{"text_format":"1","workbook":"xlsx","n_sheets":3,"sheets":["calculo VP","parametros","parametros_anbima"],"not_rendered":{"charts":0,"images":1,"macros":1,"external_links":0,"defined_names":19,"comments":0,"pivot_tables":0},"unopened":[],"bounds":{"document_bytes":16777216,"sheet_cells":100000,"rows_first":2000,"rows_last":500,"rows_between":2000,"halvings":0,"cell_chars":16384,"cell_head_chars":4096},"cells_cut":0,"cells_raw":0,"read":"whole","date_system":"1900"}

{"sheet":"calculo VP","index":0,"n_rows":12509,"n_cols":14,"rows_kept":12509,"cut":false,"hidden":false,"merged":[[32,0,32,2],[31,0,31,4],[32,3,32,4],[12,0,12,2],[30,0,30,2],[23,0,23,6],[22,0,22,6],[27,0,27,6],[26,0,26,6],[25,0,25,6],[24,0,24,6],[9,4,12,6]]}
[null,null,null,null,null,null,null,null,null,"PRÉ-FIXADA",21,{"$f":"252*9900000","v":2494800000},"menor_prazo =>",{"$f":"IF(tipo_curva=J1,K1,IF(tipo_curva=J2,K2,IF(tipo_curva=J3,K3,IF(tipo_curva=J4,K4,K5))))","v":21}]
[null,null,null,null,null,null,"=> Células Editáveis",null,null,"Cupom de IPCA",126,{"$f":"252*9900000","v":2494800000},"dias_ano=>",{"$f":"IF(tipo_curva=J4,360,252)","v":252}]
[null,null,null,null,null,null,null,null,null,"Cupom de IGPM",21,{"$f":"252*9900000","v":2494800000},"maior_prazo=>",{"$f":"IF(tipo_curva=J1,L1,IF(tipo_curva=J2,L2,IF(tipo_curva=J3,L3,IF(tipo_curva=J4,L4,L5))))","v":2494800000}]
[null,null,null,null,null,null,"=> Células Não-Editáveis",null,null,"Cupom Cambial",30,{"$f":"360*10","v":3600},"Check cargas=>",{"$f":"AND(NOT(IF(gerador=\"Susep\",ISERROR(VLOOKUP(tipo_curva,parametros!$B:$B,1,0)),parametros_anbima!$A$9=0)),ref<>\"\")","v":false}]
["Coodernação Geral de Monitoramento de Solvência - CGSOA",null,null,null,null,null,null,null,null,"Cupom de TR",21,{"$f":"252*9900000","v":2494800000}]
["Coordenação de Monitoramento Riscos e Ativos - COARI"]
[null,null,null,null,null,null,null,null,null,{"$f":"IF(parametros_anbima!A10<>0,\"Anbima- \"&parametros_anbima!B10,\"\")","v":""}]
["Data-base",{"$f":"IF(check,IF(gerador=\"Susep\",parametros!$A$9,parametros_anbima!$A$9),\"\")","v":""},null,null,null,null,null,null,null,{"$f":"IF(parametros_anbima!A9<>0,\"Anbima- \"&parametros_anbima!B9,\"\")","v":""}]
["Referência",null,null,null,null,null,null,null,null,{"$f":"IF(ISERROR(VLOOKUP(J4,parametros!$B$9:$B$13,1,0)),\"\",\"Susep - \"&J4)","v":""}]
["Tipo de Curva",{"$f":"IF(NOT(ISERROR(FIND(\" (até 03/16)\",ref,1))),MID(ref,9,(LEN(ref)-20)),MID(ref,9,LEN(ref)))","v":""},null,null,null,null,null,null,null,{"$f":"IF(ISERROR(VLOOKUP(J3,parametros!$B$9:$B$13,1,0)),\"\",\"Susep - \"&J3)","v":""}]
["Gerado por",{"$f":"TRIM(MID(ref,1,6))","v":""},null,null,null,null,null,null,null,{"$f":"IF(ISERROR(VLOOKUP(J5,parametros!$B$9:$B$13,1,0)),\"\",\"Susep - \"&J5)","v":""}]
[null,null,null,null,null,null,null,null,null,{"$f":"IF(ISERROR(VLOOKUP(J2,parametros!$B$9:$B$13,1,0)),\"\",\"Susep - \"&J2)","v":""}]
["PARÂMETROS",null,null,null,null,null,null,null,null,{"$f":"IF(ISERROR(VLOOKUP(J1,parametros!$B$9:$B$13,1,0)),\"\",\"Susep - \"&J1)","v":""}]
["beta-0","beta-1","beta-2"]
[{"$f":"IF(check,IF(gerador=\"Susep\",VLOOKUP(tipo_curva,parametros!$B:$I,2,0),VLOOKUP(tipo_curva,parametros_anbima!$B:$I,2,0)),\"\")","v":""},{"$f":"IF(check,IF(gerador=\"Susep\",VLOOKUP(tipo_curva,parametros!$B:$I,3,0),VLOOKUP(tipo_curva,parametros_anbima!$B:$I,3,0)),\"\")","v":""},{"$f":"IF(check,IF(gerador=\"Susep\",VLOOKUP(tipo_curva,parametros!$B:$I,4,0),VLOOKUP(tipo_curva,parametros_anbima!$B:$I,4,0)),\"\")","v":""}]
["beta-3","lambda-1","lambda-2"]
[{"$f":"IF(check,IF(OR(tipo_curva=\"Cupom Cambial\",tipo_curva=\"Cupom de TR\"),0,IF(gerador=\"Susep\",VLOOKUP(tipo_curva,parametros!$B:$I,5,0),VLOOKUP(tipo_curva,parametros_anbima!$B:$I,5,0))),\"\")","v":""},{"$f":"IF(check,IF(gerador=\"Susep\",VLOOKUP(tipo_curva,parametros!$B:$I,6,0),VLOOKUP(tipo_curva,parametros_anbima!$B:$I,6,0)),\"\")","v":""},{"$f":"IF(check,IF(OR(tipo_curva=\"Cupom Cambial\",tipo_curva=\"Cupom de TR\"),1,IF(gerador=\"Susep\",VLOOKUP(tipo_curva,parametros!$B:$I,7,0),VLOOKUP(tipo_curva,parametros_anbima!$B:$I,7,0))),\"\")","v":""}]
["beta-0","beta-1","beta-2"]
[{"$f":"IF(check,IF(gerador=\"Susep\",VLOOKUP(tipo_curva,parametros!$B:$I,2,0),VLOOKUP(tipo_curva,parametros_anbima!$B:$I,2,0)),\"\")","v":""},{"$f":"IF(check,IF(gerador=\"Susep\",VLOOKUP(tipo_curva,parametros!$B:$I,3,0),VLOOKUP(tipo_curva,parametros_anbima!$B:$I,3,0)),\"\")","v":""},{"$f":"IF(check,IF(gerador=\"Susep\",VLOOKUP(tipo_curva,parametros!$B:$I,4,0),VLOOKUP(tipo_curva,parametros_anbima!$B:$I,4,0)),\"\")","v":""}]
["beta-3","lambda-1","lambda-2"]
[{"$f":"IF(check,IF(OR(tipo_curva=\"Cupom Cambial\",tipo_curva=\"Cupom de TR\"),\"-\",IF(gerador=\"Susep\",VLOOKUP(tipo_curva,parametros!$B:$I,5,0),VLOOKUP(tipo_curva,parametros_anbima!$B:$I,5,0))),\"\")","v":""},{"$f":"IF(check,IF(gerador=\"Susep\",VLOOKUP(tipo_curva,parametros!$B:$I,6,0),VLOOKUP(tipo_curva,parametros_anbima!$B:$I,6,0)),\"\")","v":""},{"$f":"IF(check,IF(OR(tipo_curva=\"Cupom Cambial\",tipo_curva=\"Cupom de TR\"),\"-\",IF(gerador=\"Susep\",VLOOKUP(tipo_curva,parametros!$B:$I,7,0),VLOOKUP(tipo_curva,parametros_anbima!$B:$I,7,0))),\"\")","v":""}]
[]
["Obs1.: Esta planilha é um exemplo para desconto financeiro e não considera premissas atuariais."]
["Obs2.: Na curva de cupom cambial foi adotado o padrão de capitalização linear e dias corridos (360 dias)."]
["Obs3.: Na curva de cupom de IPCA para os prazos inferiores à 126 dias, utilizou-se a taxa de 126 dias para o prazo indicado. Para as demais curvas considerou-se o menor prazo como um mês (30 dias corridos para o cupom cambial e 21 dias úteis para as restantes)."]
["Obs4.: Tendo em vista a característica de menor prazo das obrigações em dólar das entidades supervisionadas no mercado segurador, foi adotada como premissa na curva de cupom cambial o tempo máximo igual a 10 anos (3600 dias corridos)."]
["Obs5.: Para atualizar os parâmetros gerados pela Susep basta fazer o download do arquivo texto \"resultado_curvas_divulgacao_AAAAMM.txt\" no endereço http://www.susep.gov.br/setores-susep/cgsoa/coris/dicem/modelo-de-interpolacao-e-extrapolacao-da-ettj e clicar no botão \"Atualizar Parâmetros Susep\" acima e utilizar o arquivo texto do mês de referência."]
["Obs6.: Para atualizar os parâmetros gerados pela Anbima basta fazer o download do arquivo texto \"Curva_Zero_AAAAMM.txt\" (idoma: INGLÊS e Tipo TXT)  no endereço http://www.anbima.com.br/est_termo/Curva_Zero.asp OU http://www.susep.gov.br/setores-susep/cgsoa/coris/dicem/modelo-de-interpolacao-e-extrapolacao-da-ettj e clicar no botão \"Atualizar Parâmetros Anbima\" acima e utilizar o arquivo texto do mês de referência."]
[]
[null,null,null,"VP total",{"$f":"SUM(E35:E12509)","v":0}]
[]
["FLUXO DE CAIXA"]
[{"$f":"IF(tipo_curva=\"Cupom Cambial\",\"TAXAS ANUAIS EFETIVAS PARA 360 DIAS ÚTEIS (LINEAR)\",\"TAXAS ANUAIS EFETIVAS PARA 252 DIAS ÚTEIS\")","v":"TAXAS ANUAIS EFETIVAS PARA 252 DIAS ÚTEIS"},null,null,"MONTANTES"]
[{"$f":"IF(tipo_curva=\"Cupom Cambial\",\"Prazo (dias corridos)\",\"Prazo (dias úteis)\")","v":"Prazo (dias úteis)"},"Cap. Contínua","Cap. Discreta","Valor Futuro (R$)","Valor Presente (R$) * Cap. Discreta"]
[null,{"$f":"IF(check,IF(gerador=\"Susep\",IF(ISNUMBER(A35),IF(A35<meno_prazo,beta0 +\nbeta1*((1-EXP(-(meno_prazo/dias_ano)*lamb1))/( (meno_prazo/dias_ano)*lamb1)) +\nbeta2*(((1-EXP(-(meno_prazo/dias_ano)*lamb1))/((meno_prazo/dias_ano)*lamb1))-EXP(-(meno_prazo/dias_ano)*lamb1)) +\nbeta3*(((1-EXP(-(meno_prazo/dias_ano)*lamb2))/( (meno_prazo/dias_ano)*lamb2))-EXP(-(meno_prazo/dias_ano)*lamb2)),\nbeta0 +\nbeta1*((1-EXP(-(A35/dias_ano)*lamb1))/( (A35/dias_ano)*lamb1)) +\nbeta2*(((1-EXP(-(A35/dias_ano)*lamb1))/((A35/dias_ano)*lamb1))-EXP(-(A35/dias_ano)*lamb1)) +\nbeta3*(((1-EXP(-(A35/dias_ano)*lamb2))/( (A35/dias_ano)*lamb2))-EXP(-(A35/dias_ano)*lamb2))),\"\"),\"\"),\"\")","v":""},{"$f":"IF(check,IF(gerador=\"Susep\",IF(ISNUMBER(A35),EXP(B35)-1,\"\"),IF(ISNUMBER(A35),IF(A35<meno_prazo,beta0 +\nbeta1*((1-EXP(-(meno_prazo/dias_ano)*lamb1))/( (meno_prazo/dias_ano)*lamb1)) +\nbeta2*(((1-EXP(-(meno_prazo/dias_ano)*lamb1))/((meno_prazo/dias_ano)*lamb1))-EXP(-(meno_prazo/dias_ano)*lamb1)) +\nbeta3*(((1-EXP(-(meno_prazo/dias_ano)*lamb2))/( (meno_prazo/dias_ano)*lamb2))-EXP(-(meno_prazo/dias_ano)*lamb2)),\nbeta0 +\nbeta1*((1-EXP(-(A35/dias_ano)*lamb1))/( (A35/dias_ano)*lamb1)) +\nbeta2*(((1-EXP(-(A35/dias_ano)*lamb1))/((A35/dias_ano)*lamb1))-EXP(-(A35/dias_ano)*lamb1)) +\nbeta3*(((1-EXP(-(A35/dias_ano)*lamb2))/( (A35/dias_ano)*lamb2))-EXP(-(A35/dias_ano)*lamb2))),\"\")),\"\")","v":""},null,{"$f":"IF(check,IF(AND(ISNUMBER(D35),ISNUMBER(A35)),IF(tipo_curva=\"Cupom Cambial\",D35/(1+C35*(A35/360)),D35*(1+C35)^(-A35/252)),\"\"),\"\")","v":""}]
[null,"","",null,""]
[null,"","",null,""]
[null,"","",null,""]
[null,"","",null,""]
[null,"","",null,""]
[null,"","",null,""]
[null,"","",null,""]
[null,"","",null,""]
[null,"","",null,""]
[null,"","",null,""]
[null,"","",null,""]
[null,"","",null,""]
[null,"","",null,""]
[null,"","",null,""]
[null,"","",null,""]
[null,"","",null,""]
[null,"","",null,""]
[null,"","",null,""]
[null,"","",null,""]
[null,"","",null,""]
[null,"","",null,""]
[null,"","",null,""]
[null,"","",null,""]
[null,"","",null,""]
[null,"","",null,""]
[null,"","",null,""]
[null,"","",null,""]
[null,"","",null,""]
[null,"","",null,""]
[null,"","",null,""]
[null,"","",null,""]
[null,"","",null,""]
[null,"","",null,""]
[null,"","",null,""]
[null,"","",null,""]
[null,"","",null,""]
[null,"","",null,""]
[null,"","",null,""]
[null,"","",null,""]
[null,"","",null,""]
[null,"","",null,""]
[null,"","",null,""]
[null,"","",null,""]
[null,"","",null,""]
[null,"","",null,""]
[null,"","",null,""]
[null,"","",null,""]
[null,"","",null,""]
[null,"","",null,""]
[null,"","",null,""]
[null,"","",null,""]
[null,"","",null,""]
[null,"","",null,""]
[null,"","",null,""]
[null,"","",null,""]
[null,"","",null,""]
[null,"","",null,""]
[null,"","",null,""]
[null,"","",null,""]
[null,"","",null,""]
[null,"","",null,""]
[null,"","",null,""]
[null,"","",null,""]
[null,{"$f":"IF(check,IF(gerador=\"Susep\",IF(ISNUMBER(A99),IF(A99<meno_prazo,beta0 +\nbeta1*((1-EXP(-(meno_prazo/dias_ano)*lamb1))/( (meno_prazo/dias_ano)*lamb1)) +\nbeta2*(((1-EXP(-(meno_prazo/dias_ano)*lamb1))/((meno_prazo/dias_ano)*lamb1))-EXP(-(meno_prazo/dias_ano)*lamb1)) +\nbeta3*(((1-EXP(-(meno_prazo/dias_ano)*lamb2))/( (meno_prazo/dias_ano)*lamb2))-EXP(-(meno_prazo/dias_ano)*lamb2)),\nbeta0 +\nbeta1*((1-EXP(-(A99/dias_ano)*lamb1))/( (A99/dias_ano)*lamb1)) +\nbeta2*(((1-EXP(-(A99/dias_ano)*lamb1))/((A99/dias_ano)*lamb1))-EXP(-(A99/dias_ano)*lamb1)) +\nbeta3*(((1-EXP(-(A99/dias_ano)*lamb2))/( (A99/dias_ano)*lamb2))-EXP(-(A99/dias_ano)*lamb2))),\"\"),\"\"),\"\")","v":""},{"$f":"IF(check,IF(gerador=\"Susep\",IF(ISNUMBER(A99),EXP(B99)-1,\"\"),IF(ISNUMBER(A99),IF(A99<meno_prazo,beta0 +\nbeta1*((1-EXP(-(meno_prazo/dias_ano)*lamb1))/( (meno_prazo/dias_ano)*lamb1)) +\nbeta2*(((1-EXP(-(meno_prazo/dias_ano)*lamb1))/((meno_prazo/dias_ano)*lamb1))-EXP(-(meno_prazo/dias_ano)*lamb1)) +\nbeta3*(((1-EXP(-(meno_prazo/dias_ano)*lamb2))/( (meno_prazo/dias_ano)*lamb2))-EXP(-(meno_prazo/dias_ano)*lamb2)),\nbeta0 +\nbeta1*((1-EXP(-(A99/dias_ano)*lamb1))/( (A99/dias_ano)*lamb1)) +\nbeta2*(((1-EXP(-(A99/dias_ano)*lamb1))/((A99/dias_ano)*lamb1))-EXP(-(A99/dias_ano)*lamb1)) +\nbeta3*(((1-EXP(-(A99/dias_ano)*lamb2))/( (A99/dias_ano)*lamb2))-EXP(-(A99/dias_ano)*lamb2))),\"\")),\"\")","v":""},null,{"$f":"IF(check,IF(AND(ISNUMBER(D99),ISNUMBER(A99)),IF(tipo_curva=\"Cupom Cambial\",D99/(1+C99*(A99/360)),D99*(1+C99)^(-A99/252)),\"\"),\"\")","v":""}]
[null,"","",null,""]
[null,"","",null,""]
[null,"","",null,""]
[null,"","",null,""]
[null,"","",null,""]
[null,"","",null,""]
[null,"","",null,""]
[null,"","",null,""]
[null,"","",null,""]
[null,"","",null,""]
[null,"","",null,""]
[null,"","",null,""]
[null,"","",null,""]
[null,"","",null,""]
[null,"","",null,""]
[null,"","",null,""]
[null,"","",null,""]
[null,"","",null,""]
[null,"","",null,""]
[null,"","",null,""]
[null,"","",null,""]
[null,"","",null,""]
[null,"","",null,""]
[null,"","",null,""]
[null,"","",null,""]
[null,"","",null,""]
[null,"","",null,""]
[null,"","",null,""]
[null,"","",null,""]
[null,"","",null,""]
[null,"","",null,""]
[null,"","",null,""]
[null,"","",null,""]
[null,"","",null,""]
[null,"","",null,""]
[null,"","",null,""]
[null,"","",null,""]
[null,"","",null,""]
[null,"","",null,""]
[null,"","",null,""]
[null,"","",null,""]
[null,"","",null,""]
[null,"","",null,""]
[null,"","",null,""]
[null,"","",null,""]
[null,"","",null,""]
[null,"","",null,""]
[null,"","",null,""]
[null,"","",null,""]
[null,"","",null,""]
[null,"","",null,""]
[null,"","",null,""]
[null,"","",null,""]
[null,"","",null,""]
[null,"","",null,""]
[null,"","",null,""]
[null,"","",null,""]
[null,"","",null,""]
[null,"","",null,""]
[null,"","",null,""]
[null,"","",null,""]
[null,"","",null,""]
[null,"","",null,""]
[null,{"$f":"IF(check,IF(gerador=\"Susep\",IF(ISNUMBER(A163),IF(A163<meno_prazo,beta0 +\nbeta1*((1-EXP(-(meno_prazo/dias_ano)*lamb1))/( (meno_prazo/dias_ano)*lamb1)) +\nbeta2*(((1-EXP(-(meno_prazo/dias_ano)*lamb1))/((meno_prazo/dias_ano)*lamb1))-EXP(-(meno_prazo/dias_ano)*lamb1)) +\nbeta3*(((1-EXP(-(meno_prazo/dias_ano)*lamb2))/( (meno_prazo/dias_ano)*lamb2))-EXP(-(meno_prazo/dias_ano)*lamb2)),\nbeta0 +\nbeta1*((1-EXP(-(A163/dias_ano)*lamb1))/( (A163/dias_ano)*lamb1)) +\nbeta2*(((1-EXP(-(A163/dias_ano)*lamb1))/((A163/dias_ano)*lamb1))-EXP(-(A163/dias_ano)*lamb1)) +\nbeta3*(((1-EXP(-(A163/dias_ano)*lamb2))/( (A163/dias_ano)*lamb2))-EXP(-(A163/dias_ano)*lamb2))),\"\"),\"\"),\"\")","v":""},{"$f":"IF(check,IF(gerador=\"Susep\",IF(ISNUMBER(A163),EXP(B163)-1,\"\"),IF(ISNUMBER(A163),IF(A163<meno_prazo,beta0 +\nbeta1*((1-EXP(-(meno_prazo/dias_ano)*lamb1))/( (meno_prazo/dias_ano)*lamb1)) +\nbeta2*(((1-EXP(-(meno_prazo/dias_ano)*lamb1))/((meno_prazo/dias_ano)*lamb1))-EXP(-(meno_prazo/dias_ano)*lamb1)) +\nbeta3*(((1-EXP(-(meno_prazo/dias_ano)*lamb2))/( (meno_prazo/dias_ano)*lamb2))-EXP(-(meno_prazo/dias_ano)*lamb2)),\nbeta0 +\nbeta1*((1-EXP(-(A163/dias_ano)*lamb1))/( (A163/dias_ano)*lamb1)) +\nbeta2*(((1-EXP(-(A163/dias_ano)*lamb1))/((A163/dias_ano)*lamb1))-EXP(-(A163/dias_ano)*lamb1)) +\nbeta3*(((1-EXP(-(A163/dias_ano)*lamb2))/( (A163/dias_ano)*lamb2))-EXP(-(A163/dias_ano)*lamb2))),\"\")),\"\")","v":""},null,{"$f":"IF(check,IF(AND(ISNUMBER(D163),ISNUMBER(A163)),IF(tipo_curva=\"Cupom Cambial\",D163/(1+C163*(A163/360)),D163*(1+C163)^(-A163/252)),\"\"),\"\")","v":""}]
[null,"","",null,""]
[null,"","",null,""]
[null,"","",null,""]
[null,"","",null,""]
[null,"","",null,""]
[null,"","",null,""]
[null,"","",null,""]
[null,"","",null,""]
[null,"","",null,""]
[null,"","",null,""]
[null,"","",null,""]
[null,"","",null,""]
[null,"","",null,""]
[null,"","",null,""]
[null,"","",null,""]
[null,"","",null,""]
[null,"","",null,""]
[null,"","",null,""]
[null,"","",null,""]
[null,"","",null,""]
[null,"","",null,""]
[null,"","",null,""]
[null,"","",null,""]
[null,"","",null,""]
[null,"","",null,""]
[null,"","",null,""]
[null,"","",null,""]
[null,"","",null,""]
[null,"","",null,""]
[null,"","",null,""]
[null,"","",null,""]
[null,"","",null,""]
[null,"","",null,""]
[null,"","",null,""]
[null,"","",null,""]
[null,"","",null,""]
[null,"","",null,""]
[null,"","",null,""]
[null,"","",null,""]
[null,"","",null,""]
[null,"","",null,""]
[null,"","",null,""]
[null,"","",null,""]
[null,"","",null,""]
[null,"","",null,""]
[null,"","",null,""]
[null,"","",null,""]
[null,"","",null,""]
[null,"","",null,""]
[null,"","",null,""]
[null,"","",null,""]
[null,"","",null,""]
[null,"","",null,""]
[null,"","",null,""]
[null,"","",null,""]
[null,"","",null,""]
[null,"","",null,""]
[null,"","",null,""]
[null,"","",null,""]
[null,"","",null,""]
[null,"","",null,""]
[null,"","",null,""]
[null,"","",null,""]
[null,{"$f":"IF(check,IF(gerador=\"Susep\",IF(ISNUMBER(A227),IF(A227<meno_prazo,beta0 +\nbeta1*((1-EXP(-(meno_prazo/dias_ano)*lamb1))/( (meno_prazo/dias_ano)*lamb1)) +\nbeta2*(((1-EXP(-(meno_prazo/dias_ano)*lamb1))/((meno_prazo/dias_ano)*lamb1))-EXP(-(meno_prazo/dias_ano)*lamb1)) +\nbeta3*(((1-EXP(-(meno_prazo/dias_ano)*lamb2))/( (meno_prazo/dias_ano)*lamb2))-EXP(-(meno_prazo/dias_ano)*lamb2)),\nbeta0 +\nbeta1*((1-EXP(-(A227/dias_ano)*lamb1))/( (A227/dias_ano)*lamb1)) +\nbeta2*(((1-EXP(-(A227/dias_ano)*lamb1))/((A227/dias_ano)*lamb1))-EXP(-(A227/dias_ano)*lamb1)) +\nbeta3*(((1-EXP(-(A227/dias_ano)*lamb2))/( (A227/dias_ano)*lamb2))-EXP(-(A227/dias_ano)*lamb2))),\"\"),\"\"),\"\")","v":""},{"$f":"IF(check,IF(gerador=\"Susep\",IF(ISNUMBER(A227),EXP(B227)-1,\"\"),IF(ISNUMBER(A227),IF(A227<meno_prazo,beta0 +\nbeta1*((1-EXP(-(meno_prazo/dias_ano)*lamb1))/( (meno_prazo/dias_ano)*lamb1)) +\nbeta2*(((1-EXP(-(meno_prazo/dias_ano)*lamb1))/((meno_prazo/dias_ano)*lamb1))-EXP(-(meno_prazo/dias_ano)*lamb1)) +\nbeta3*(((1-EXP(-(meno_prazo/dias_ano)*lamb2))/( (meno_prazo/dias_ano)*lamb2))-EXP(-(meno_prazo/dias_ano)*lamb2)),\nbeta0 +\nbeta1*((1-EXP(-(A227/dias_ano)*lamb1))/( (A227/dias_ano)*lamb1)) +\nbeta2*(((1-EXP(-(A227/dias_ano)*lamb1))/((A227/dias_ano)*lamb1))-EXP(-(A227/dias_ano)*lamb1)) +\nbeta3*(((1-EXP(-(A227/dias_ano)*lamb2))/( (A227/dias_ano)*lamb2))-EXP(-(A227/dias_ano)*lamb2))),\"\")),\"\")","v":""},null,{"$f":"IF(check,IF(AND(ISNUMBER(D227),ISNUMBER(A227)),IF(tipo_curva=\"Cupom Cambial\",D227/(1+C227*(A227/360)),D227*(1+C227)^(-A227/252)),\"\"),\"\")","v":""}]
[null,"","",null,""]
[null,"","",null,""]
[null,"","",null,""]
[null,"","",null,""]
[null,"","",null,""]
[null,"","",null,""]
[null,"","",null,""]
[null,"","",null,""]
[null,"","",null,""]
[null,"","",null,""]
[null,"","",null,""]
[null,"","",null,""]
[null,"","",null,""]
[null,"","",null,""]
[null,"","",null,""]
[null,"","",null,""]
[null,"","",null,""]
[null,"","",null,""]
[null,"","",null,""]
[null,"","",null,""]
[null,"","",null,""]
[null,"","",null,""]
[null,"","",null,""]
[null,"","",null,""]
[null,"","",null,""]
[null,"","",null,""]
[null,"","",null,""]
[null,"","",null,""]
[null,"","",null,""]
[null,"","",null,""]
[null,"","",null,""]
[null,"","",null,""]
[null,"","",null,""]
[null,"","",null,""]
[null,"","",null,""]
[null,"","",null,""]
[null,"","",null,""]
[null,"","",null,""]
[null,"","",null,""]
[null,"","",null,""]
[null,"","",null,""]
[null,"","",null,""]
[null,"","",null,""]
[null,"","",null,""]
[null,"","",null,""]
[null,"","",null,""]
[null,"","",null,""]
[null,"","",null,""]
[null,"","",null,""]
[null,"","",null,""]
[null,"","",null,""]
[null,"","",null,""]
[null,"","",null,""]
[null,"","",null,""]
[null,"","",null,""]
[null,"","",null,""]
[null,"","",null,""]
[null,"","",null,""]
[null,"","",null,""]
[null,"","",null,""]
[null,"","",null,""]
[null,"","",null,""]
[null,"","",null,""]
[null,{"$f":"IF(check,IF(gerador=\"Susep\",IF(ISNUMBER(A291),IF(A291<meno_prazo,beta0 +\nbeta1*((1-EXP(-(meno_prazo/dias_ano)*lamb1))/( (meno_prazo/dias_ano)*lamb1)) +\nbeta2*(((1-EXP(-(meno_prazo/dias_ano)*lamb1))/((meno_prazo/dias_ano)*lamb1))-EXP(-(meno_prazo/dias_ano)*lamb1)) +\nbeta3*(((1-EXP(-(meno_prazo/dias_ano)*lamb2))/( (meno_prazo/dias_ano)*lamb2))-EXP(-(meno_prazo/dias_ano)*lamb2)),\nbeta0 +\nbeta1*((1-EXP(-(A291/dias_ano)*lamb1))/( (A291/dias_ano)*lamb1)) +\nbeta2*(((1-EXP(-(A291/dias_ano)*lamb1))/((A291/dias_ano)*lamb1))-EXP(-(A291/dias_ano)*lamb1)) +\nbeta3*(((1-EXP(-(A291/dias_ano)*lamb2))/( (A291/dias_ano)*lamb2))-EXP(-(A291/dias_ano)*lamb2))),\"\"),\"\"),\"\")","v":""},{"$f":"IF(check,IF(gerador=\"Susep\",IF(ISNUMBER(A291),EXP(B291)-1,\"\"),IF(ISNUMBER(A291),IF(A291<meno_prazo,beta0 +\nbeta1*((1-EXP(-(meno_prazo/dias_ano)*lamb1))/( (meno_prazo/dias_ano)*lamb1)) +\nbeta2*(((1-EXP(-(meno_prazo/dias_ano)*lamb1))/((meno_prazo/dias_ano)*lamb1))-EXP(-(meno_prazo/dias_ano)*lamb1)) +\nbeta3*(((1-EXP(-(meno_prazo/dias_ano)*lamb2))/( (meno_prazo/dias_ano)*lamb2))-EXP(-(meno_prazo/dias_ano)*lamb2)),\nbeta0 +\nbeta1*((1-EXP(-(A291/dias_ano)*lamb1))/( (A291/dias_ano)*lamb1)) +\nbeta2*(((1-EXP(-(A291/dias_ano)*lamb1))/((A291/dias_ano)*lamb1))-EXP(-(A291/dias_ano)*lamb1)) +\nbeta3*(((1-EXP(-(A291/dias_ano)*lamb2))/( (A291/dias_ano)*lamb2))-EXP(-(A291/dias_ano)*lamb2))),\"\")),\"\")","v":""},null,{"$f":"IF(check,IF(AND(ISNUMBER(D291),ISNUMBER(A291)),IF(tipo_curva=\"Cupom Cambial\",D291/(1+C291*(A291/360)),D291*(1+C291)^(-A291/252)),\"\"),\"\")","v":""}]
[null,"","",null,""]
[null,"","",null,""]
[null,"","",null,""]
[null,"","",null,""]
[null,"","",null,""]
[null,"","",null,""]
[null,"","",null,""]
[null,"","",null,""]
[null,"","",null,""]
[null,"","",null,""]
[null,"","",null,""]
[null,"","",null,""]
[null,"","",null,""]
[null,"","",null,""]
[null,"","",null,""]
[null,"","",null,""]
[null,"","",null,""]
[null,"","",null,""]
[null,"","",null,""]
[null,"","",null,""]
[null,"","",null,""]
[null,"","",null,""]
[null,"","",null,""]
[null,"","",null,""]
[null,"","",null,""]
[null,"","",null,""]
[null,"","",null,""]
[null,"","",null,""]
[null,"","",null,""]
[null,"","",null,""]
[null,"","",null,""]
[null,"","",null,""]
[null,"","",null,""]
[null,"","",null,""]
[null,"","",null,""]
[null,"","",null,""]
[null,"","",null,""]
[null,"","",null,""]
[null,"","",null,""]
[null,"","",null,""]
[null,"","",null,""]
[null,"","",null,""]
[null,"","",null,""]
[null,"","",null,""]
[null,"","",null,""]
[null,"","",null,""]
[null,"","",null,""]
[null,"","",null,""]
[null,"","",null,""]
[null,"","",null,""]
[null,"","",null,""]
[null,"","",null,""]
[null,"","",null,""]
[null,"","",null,""]
[null,"","",null,""]
[null,"","",null,""]
[null,"","",null,""]
[null,"","",null,""]
[null,"","",null,""]
[null,"","",null,""]
[null,"","",null,""]
[null,"","",null,""]
[null,"","",null,""]
[null,{"$f":"IF(check,IF(gerador=\"Susep\",IF(ISNUMBER(A355),IF(A355<meno_prazo,beta0 +\nbeta1*((1-EXP(-(meno_prazo/dias_ano)*lamb1))/( (meno_prazo/dias_ano)*lamb1)) +\nbeta2*(((1-EXP(-(meno_prazo/dias_ano)*lamb1))/((meno_prazo/dias_ano)*lamb1))-EXP(-(meno_prazo/dias_ano)*lamb1)) +\nbeta3*(((1-EXP(-(meno_prazo/dias_ano)*lamb2))/( (meno_prazo/dias_ano)*lamb2))-EXP(-(meno_prazo/dias_ano)*lamb2)),\nbeta0 +\nbeta1*((1-EXP(-(A355/dias_ano)*lamb1))/( (A355/dias_ano)*lamb1)) +\nbeta2*(((1-EXP(-(A355/dias_ano)*lamb1))/((A355/dias_ano)*lamb1))-EXP(-(A355/dias_ano)*lamb1)) +\nbeta3*(((1-EXP(-(A355/dias_ano)*lamb2))/( (A355/dias_ano)*lamb2))-EXP(-(A355/dias_ano)*lamb2))),\"\"),\"\"),\"\")","v":""},{"$f":"IF(check,IF(gerador=\"Susep\",IF(ISNUMBER(A355),EXP(B355)-1,\"\"),IF(ISNUMBER(A355),IF(A355<meno_prazo,beta0 +\nbeta1*((1-EXP(-(meno_prazo/dias_ano)*lamb1))/( (meno_prazo/dias_ano)*lamb1)) +\nbeta2*(((1-EXP(-(meno_prazo/dias_ano)*lamb1))/((meno_prazo/dias_ano)*lamb1))-EXP(-(meno_prazo/dias_ano)*lamb1)) +\nbeta3*(((1-EXP(-(meno_prazo/dias_ano)*lamb2))/( (meno_prazo/dias_ano)*lamb2))-EXP(-(meno_prazo/dias_ano)*lamb2)),\nbeta0 +\nbeta1*((1-EXP(-(A355/dias_ano)*lamb1))/( (A355/dias_ano)*lamb1)) +\nbeta2*(((1-EXP(-(A355/dias_ano)*lamb1))/((A355/dias_ano)*lamb1))-EXP(-(A355/dias_ano)*lamb1)) +\nbeta3*(((1-EXP(-(A355/dias_ano)*lamb2))/( (A355/dias_ano)*lamb2))-EXP(-(A355/dias_ano)*lamb2))),\"\")),\"\")","v":""},null,{"$f":"IF(check,IF(AND(ISNUMBER(D355),ISNUMBER(A355)),IF(tipo_curva=\"Cupom Cambial\",D355/(1+C355*(A355/360)),D355*(1+C355)^(-A355/252)),\"\"),\"\")","v":""}]
[null,"","",null,""]
[null,"","",null,""]
[null,"","",null,""]
[null,"","",null,""]
[null,"","",null,""]
[null,"","",null,""]
[null,"","",null,""]
[null,"","",null,""]
[null,"","",null,""]
[null,"","",null,""]
[null,"","",null,""]
[null,"","",null,""]
[null,"","",null,""]
[null,"","",null,""]
[null,"","",null,""]
[null,"","",null,""]
[null,"","",null,""]
[null,"","",null,""]
[null,"","",null,""]
[null,"","",null,""]
[null,"","",null,""]
[null,"","",null,""]
[null,"","",null,""]
[null,"","",null,""]
[null,"","",null,""]
[null,"","",null,""]
[null,"","",null,""]
[null,"","",null,""]
[null,"","",null,""]
[null,"","",null,""]
[null,"","",null,""]
[null,"","",null,""]
[null,"","",null,""]
[null,"","",null,""]
[null,"","",null,""]
[null,"","",null,""]
[null,"","",null,""]
[null,"","",null,""]
[null,"","",null,""]
[null,"","",null,""]
[null,"","",null,""]
[null,"","",null,""]
[null,"","",null,""]
[null,"","",null,""]
[null,"","",null,""]
{"$rows_left_out":12110}
{"sheet":"parametros","index":1,"n_rows":8,"n_cols":8,"rows_kept":8,"cut":false,"hidden":true,"merged":[]}
[]
[]
[]
[]
["Coodernação Geral de Monitoramento de Solvência - CGSOA"]
["Coordenação de Monitoramento Riscos e Ativos - COARI"]
[]
["Data","Tipo","beta-0","beta-1","beta-2","beta-3","lambda-1","lambda-2"]

{"sheet":"parametros_anbima","index":2,"n_rows":13,"n_cols":8,"rows_kept":13,"cut":false,"hidden":true,"merged":[]}
[]
[]
[]
[]
["Coodernação Geral de Monitoramento de Solvência - CGSOA"]
["Coordenação de Monitoramento Riscos e Ativos - COARI"]
[]
["Data","Tipo","beta-0","beta-1","beta-2","beta-3","lambda-1","lambda-2"]
[{"$f":"L5","v":"00:00:00"},"PRÉ-FIXADA",{"$f":"L7","v":0},0,0,0,0,0]
[{"$f":"L5","v":"00:00:00"},"Cupom de IPCA",0,0,0,0,0,0]
[]
["(*) Dados gerados pela Anbima"]
["Acessível e obtido em: http://www.anbima.com.br/est_termo/Curva_Zero.asp"]