{"text_format":"1","workbook":"xlsx","n_sheets":6,"sheets":["DISPENSA SERV - PNOS","DISPENSA SERV - PNOC","DISPENSA SERV - PUOS","DISPENSA SERV - PUOC","Listas","Feriados"],"not_rendered":{"charts":0,"images":0,"macros":1,"external_links":0,"defined_names":0,"comments":4,"pivot_tables":0},"unopened":[],"bounds":{"document_bytes":16777216,"sheet_cells":100000,"rows_first":2000,"rows_last":500,"rows_between":2000,"halvings":0,"cell_chars":16384,"cell_head_chars":4096},"cells_cut":0,"cells_raw":0,"read":"whole","date_system":"1900"}

{"sheet":"DISPENSA SERV - PNOS","index":0,"n_rows":39,"n_cols":17,"rows_kept":39,"cut":false,"hidden":false,"merged":[[14,0,23,0],[24,0,30,0],[31,0,33,0],[34,0,37,0],[10,2,10,8],[12,4,13,4],[12,5,12,6],[12,7,12,10],[12,11,12,13],[12,14,12,16],[13,1,13,2],[3,3,3,8],[4,3,4,8],[5,3,5,8],[6,3,6,8],[7,3,7,8],[8,3,8,8],[1,2,1,8],[1,10,1,16],[2,3,2,8],[2,10,3,10],[2,11,3,11],[2,12,3,12],[2,13,3,13],[2,14,3,14],[2,15,3,15],[2,16,3,16]]}
[]
[null,null,"DADOS BÁSICOS DA CONTRATAÇÃO",null,null,null,null,null,null,null,"QUADRO RESUMO DE ACOMPANHAMENTO DO PROCESSO DE CONTRATAÇÃO"]
[null,null,"Objeto da Contatação*","XXXXXXXXX",null,null,null,null,null,null,"Data Inicial Prevista","Data Término Prevista","TMPL Padrão","TMPL Previsto","Data Término Atualizado","TMPL Efetivo","Dias para Conclusão"]
[null,null,"Tipo de Objeto*","SERVIÇOS"]
[null,null,"Modalidade Licitatória*","DISPENSA POR VALOR - SERVIÇOS (Art. 24, I e II da Lei 8.666/93)",null,null,null,null,null,null,{"$f":"IF(H15=\"\",\"\",H15)","v":""},{"$f":"I38","v":""},{"$f":"E39","v":79},{"$f":"F39","v":79},{"$f":"M38","v":{"$error":"#VALUE!"}},{"$f":"SUMIF(N15:N38,\"<>0\")+SUMIFS(F15:F38,N15:N38,\"\")","v":79},{"$f":"IF(H15=\"\",\"\",NETWORKDAYS(TODAY(),M38,Feriados!$A$1:$A$442))","v":""}]
[null,null,"Fluxo da Instrução Processual*","PRAZO NORMAL/OBJETO SIMPLES"]
[null,null,"Valor da Contratação*","XXXXXXXXX"]
[null,null,"Nº do Processo*","XXXXXXXXX"]
[null,null,"Atende quais itens do PAC*","XXXXXXXXX"]
[null,null,"EVOLUÇÃO DA CONTRATAÇÃO"]
[null,null,{"$f":"SUM(Q15:Q104)/SUM(E15:E104)","v":0}]
[null,null,"* preenchimento obrigatório"]
[null,null,null,null,"Tempo médio padrão","1° Pactuação",null,"ACOMPANHAMENTO DOS PRAZOS PACTUADOS ",null,null,null,"PREVISTO/REALIZADO",null,null,"STATUS"]
["Etapas","Atividade",null,"Setor",null,"Dias","Datas Pactuadas","Data Início","Data Término","Realizado","Dias Adiantado/\nAtrasado (Processo)","Data Início","Data Término","Dias Efetivos","Concluído","%","Dias"]
["PLANEJAMENTO DA CONTRATAÇÃO",1,"Confecção do DFD/DOD","Demandante",2,2,{"$f":"I15","v":""},null,{"$f":"IF(H15=\"\",\"\",WORKDAY(H15,F15,Feriados!$A$1:$A$442))","v":""},null,{"$f":"IF(J15=\"\",\"\",IF(J15=I15,0,NETWORKDAYS(I15,J15,Feriados!$A$1:$A$442)))","v":""},{"$f":"IF(H15=\"\",G15,H15)","v":""},{"$f":"IF(J15<>0,J15,WORKDAY(L15,F15,Feriados!A1:$A$442))","v":{"$error":"#VALUE!"}},{"$f":"IFERROR(IF(J15=\"\",\"\",NETWORKDAYS(L15,M15,Feriados!$A$1:$A$442)),\"\")","v":""},{"$f":"IF(J15<>0,\"Sim\",\"Não\")","v":"Não"},{"$f":"IF(O15=\"Sim\",100%,IF(O15=\"Não\",0%,\"\"))","v":0},{"$f":"E15*P15","v":0}]
[null,{"$f":"B15+1","v":2},"Pactuação do Cronograma da Contratação","CGL/EPC",2,2,{"$f":"IF(G15=\"\",\"\",WORKDAY(G15,F16,Feriados!$A$1:$A$442))","v":""},{"$f":"IF(I15=\"\",\"\",I15)","v":""},{"$f":"IF(H16=\"\",\"\",WORKDAY(H16,F16,Feriados!$A$1:$A$442))","v":""},null,{"$f":"IF(J16=\"\",\"\",IF(J16=I16,0,NETWORKDAYS(I16,J16,Feriados!$A$1:$A$442)))","v":""},{"$f":"IF(M15=\"\",H16,M15)","v":{"$error":"#VALUE!"}},{"$f":"IF(J16<>0,J16,WORKDAY(L16,F16,Feriados!A2:$A$442))","v":{"$error":"#VALUE!"}},{"$f":"IFERROR(IF(J16=\"\",\"\",NETWORKDAYS(L16,M16,Feriados!$A$1:$A$442)),\"\")","v":""},{"$f":"IF(J16<>0,\"Sim\",\"Não\")","v":"Não"},{"$f":"IF(O16=\"Sim\",100%,IF(O16=\"Não\",0%,\"\"))","v":0},{"$f":"E16*P16","v":0}]
[null,{"$f":"B16+1","v":3},"Aprovação do Cronograma da Contratação","SAA/SE",2,2,{"$f":"IF(G16=\"\",\"\",WORKDAY(G16,F17,Feriados!$A$1:$A$442))","v":""},{"$f":"IF(I16=\"\",\"\",I16)","v":""},{"$f":"IF(H17=\"\",\"\",WORKDAY(H17,F17,Feriados!$A$1:$A$442))","v":""},null,{"$f":"IF(J17=\"\",\"\",IF(J17=I17,0,NETWORKDAYS(I17,J17,Feriados!$A$1:$A$442)))","v":""},{"$f":"IF(M16=\"\",H17,M16)","v":{"$error":"#VALUE!"}},{"$f":"IF(J17<>0,J17,WORKDAY(L17,F17,Feriados!A3:$A$442))","v":{"$error":"#VALUE!"}},{"$f":"IFERROR(IF(J17=\"\",\"\",NETWORKDAYS(L17,M17,Feriados!$A$1:$A$442)),\"\")","v":""},"Não",0,0]
[null,4,"Confecção do Projeto Básico - PB","Demandante",15,15,{"$f":"IF(G17=\"\",\"\",WORKDAY(G17,F18,Feriados!$A$1:$A$442))","v":""},{"$f":"IF(I17=\"\",\"\",I17)","v":""},{"$f":"IF(H18=\"\",\"\",WORKDAY(H18,F18,Feriados!$A$1:$A$442))","v":""},null,{"$f":"IF(J18=\"\",\"\",IF(J18=I18,0,NETWORKDAYS(I18,J18,Feriados!$A$1:$A$442)))","v":""},{"$f":"IF(M17=\"\",H18,M17)","v":{"$error":"#VALUE!"}},{"$f":"IF(J18<>0,J18,WORKDAY(L18,F18,Feriados!A4:$A$442))","v":{"$error":"#VALUE!"}},{"$f":"IFERROR(IF(J18=\"\",\"\",NETWORKDAYS(L18,M18,Feriados!$A$1:$A$442)),\"\")","v":""},{"$f":"IF(J18<>0,\"Sim\",\"Não\")","v":"Não"},{"$f":"IF(O18=\"Sim\",100%,IF(O18=\"Não\",0%,\"\"))","v":0},{"$f":"E18*P18","v":0}]
[null,5,"Realização da Pesquisa de Preços ","Demandante",15,15,{"$f":"IF(G18=\"\",\"\",WORKDAY(G18,F19,Feriados!$A$1:$A$442))","v":""},"",{"$f":"IF(H19=\"\",\"\",WORKDAY(H19,F19,Feriados!$A$1:$A$442))","v":""},null,{"$f":"IF(J19=\"\",\"\",IF(J19=I19,0,NETWORKDAYS(I19,J19,Feriados!$A$1:$A$442)))","v":""},{"$error":"#VALUE!"},{"$f":"IF(J19<>0,J19,WORKDAY(L19,F19,Feriados!A5:$A$442))","v":{"$error":"#VALUE!"}},{"$f":"IFERROR(IF(J19=\"\",\"\",NETWORKDAYS(L19,M19,Feriados!$A$1:$A$442)),\"\")","v":""},"Não",0,0]
[null,6,"Análise do PB e Pesquisa de Preços","CGL (COPLI/CCONT/COEFIN)",3,3,{"$f":"IF(G19=\"\",\"\",WORKDAY(G19,F20,Feriados!$A$1:$A$442))","v":""},"",{"$f":"IF(H20=\"\",\"\",WORKDAY(H20,F20,Feriados!$A$1:$A$442))","v":""},null,{"$f":"IF(J20=\"\",\"\",IF(J20=I20,0,NETWORKDAYS(I20,J20,Feriados!$A$1:$A$442)))","v":""},{"$error":"#VALUE!"},{"$f":"IF(J20<>0,J20,WORKDAY(L20,F20,Feriados!A6:$A$442))","v":{"$error":"#VALUE!"}},{"$f":"IFERROR(IF(J20=\"\",\"\",NETWORKDAYS(L20,M20,Feriados!$A$1:$A$442)),\"\")","v":""},"Não",0,0]
[null,7,"Compilação e envio a Demandante","CGL",2,2,{"$f":"IF(G20=\"\",\"\",WORKDAY(G20,F21,Feriados!$A$1:$A$442))","v":""},"",{"$f":"IF(H21=\"\",\"\",WORKDAY(H21,F21,Feriados!$A$1:$A$442))","v":""},null,{"$f":"IF(J21=\"\",\"\",IF(J21=I21,0,NETWORKDAYS(I21,J21,Feriados!$A$1:$A$442)))","v":""},{"$error":"#VALUE!"},{"$f":"IF(J21<>0,J21,WORKDAY(L21,F21,Feriados!A7:$A$442))","v":{"$error":"#VALUE!"}},{"$f":"IFERROR(IF(J21=\"\",\"\",NETWORKDAYS(L21,M21,Feriados!$A$1:$A$442)),\"\")","v":""},"Não",0,0]
[null,8,"Retorno do PB ajustado ","Demandante",3,3,{"$f":"IF(G21=\"\",\"\",WORKDAY(G21,F22,Feriados!$A$1:$A$442))","v":""},"",{"$f":"IF(H22=\"\",\"\",WORKDAY(H22,F22,Feriados!$A$1:$A$442))","v":""},null,{"$f":"IF(J22=\"\",\"\",IF(J22=I22,0,NETWORKDAYS(I22,J22,Feriados!$A$1:$A$442)))","v":""},{"$error":"#VALUE!"},{"$f":"IF(J22<>0,J22,WORKDAY(L22,F22,Feriados!A8:$A$442))","v":{"$error":"#VALUE!"}},{"$f":"IFERROR(IF(J22=\"\",\"\",NETWORKDAYS(L22,M22,Feriados!$A$1:$A$442)),\"\")","v":""},"Não",0,0]
[null,9,"Conformidade de Pesquisa de Preço","SCPP/COPLI/CGL",5,5,{"$f":"IF(G22=\"\",\"\",WORKDAY(G22,F23,Feriados!$A$1:$A$442))","v":""},"",{"$f":"IF(H23=\"\",\"\",WORKDAY(H23,F23,Feriados!$A$1:$A$442))","v":""},null,{"$f":"IF(J23=\"\",\"\",IF(J23=I23,0,NETWORKDAYS(I23,J23,Feriados!$A$1:$A$442)))","v":""},{"$error":"#VALUE!"},{"$f":"IF(J23<>0,J23,WORKDAY(L23,F23,Feriados!A9:$A$442))","v":{"$error":"#VALUE!"}},{"$f":"IFERROR(IF(J23=\"\",\"\",NETWORKDAYS(L23,M23,Feriados!$A$1:$A$442)),\"\")","v":""},"Não",0,0]
[null,10,"DDO","COEFIN/CGL",2,2,{"$f":"IF(G23=\"\",\"\",WORKDAY(G23,F24,Feriados!$A$1:$A$442))","v":""},"",{"$f":"IF(H24=\"\",\"\",WORKDAY(H24,F24,Feriados!$A$1:$A$442))","v":""},null,{"$f":"IF(J24=\"\",\"\",IF(J24=I24,0,NETWORKDAYS(I24,J24,Feriados!$A$1:$A$442)))","v":""},{"$error":"#VALUE!"},{"$f":"IF(J24<>0,J24,WORKDAY(L24,F24,Feriados!A11:$A$442))","v":{"$error":"#VALUE!"}},{"$f":"IFERROR(IF(J24=\"\",\"\",NETWORKDAYS(L24,M24,Feriados!$A$1:$A$442)),\"\")","v":""},"Não",0,0]
["INSTRUMENTO DE CONTRATAÇÃO E ANÁLISE JURÍDICA",11,"Minuta Contrato ou Congênere / Nota Técnica COPLI","CCONT/ COPLI / CGL",5,5,{"$f":"IF(G24=\"\",\"\",WORKDAY(G24,F25,Feriados!$A$1:$A$442))","v":""},"",{"$f":"IF(H25=\"\",\"\",WORKDAY(H25,F25,Feriados!$A$1:$A$442))","v":""},null,{"$f":"IF(J25=\"\",\"\",IF(J25=I25,0,NETWORKDAYS(I25,J25,Feriados!$A$1:$A$442)))","v":""},{"$error":"#VALUE!"},{"$f":"IF(J25<>0,J25,WORKDAY(L25,F25,Feriados!A12:$A$442))","v":{"$error":"#VALUE!"}},{"$f":"IFERROR(IF(J25=\"\",\"\",NETWORKDAYS(L25,M25,Feriados!$A$1:$A$442)),\"\")","v":""},"Não",0,0]
[null,12,"Compilação e envio a CONJUR","CGL",0,0,{"$f":"IF(G25=\"\",\"\",WORKDAY(G25,F26,Feriados!$A$1:$A$442))","v":""},"",{"$f":"IF(H26=\"\",\"\",WORKDAY(H26,F26,Feriados!$A$1:$A$442))","v":""},null,{"$f":"IF(J26=\"\",\"\",IF(J26=I26,0,NETWORKDAYS(I26,J26,Feriados!$A$1:$A$442)))","v":""},{"$error":"#VALUE!"},{"$f":"IF(J26<>0,J26,WORKDAY(L26,F26,Feriados!A13:$A$442))","v":{"$error":"#VALUE!"}},{"$f":"IFERROR(IF(J26=\"\",\"\",NETWORKDAYS(L26,M26,Feriados!$A$1:$A$442)),\"\")","v":""},"Não",0,0]
[null,13,"Análise CONJUR -CJ","CONJUR",0,0,{"$f":"IF(G26=\"\",\"\",WORKDAY(G26,F27,Feriados!$A$1:$A$442))","v":""},"",{"$f":"IF(H27=\"\",\"\",WORKDAY(H27,F27,Feriados!$A$1:$A$442))","v":""},null,{"$f":"IF(J27=\"\",\"\",IF(J27=I27,0,NETWORKDAYS(I27,J27,Feriados!$A$1:$A$442)))","v":""},{"$error":"#VALUE!"},{"$f":"IF(J27<>0,J27,WORKDAY(L27,F27,Feriados!A14:$A$442))","v":{"$error":"#VALUE!"}},{"$f":"IFERROR(IF(J27=\"\",\"\",NETWORKDAYS(L27,M27,Feriados!$A$1:$A$442)),\"\")","v":""},"Não",0,0]
[null,14,"Envio para ajustes das recomendações CJ","CGL",0,0,{"$f":"IF(G27=\"\",\"\",WORKDAY(G27,F28,Feriados!$A$1:$A$442))","v":""},"",{"$f":"IF(H28=\"\",\"\",WORKDAY(H28,F28,Feriados!$A$1:$A$442))","v":""},null,{"$f":"IF(J28=\"\",\"\",IF(J28=I28,0,NETWORKDAYS(I28,J28,Feriados!$A$1:$A$442)))","v":""},{"$error":"#VALUE!"},{"$f":"IF(J28<>0,J28,WORKDAY(L28,F28,Feriados!A15:$A$442))","v":{"$error":"#VALUE!"}},{"$f":"IFERROR(IF(J28=\"\",\"\",NETWORKDAYS(L28,M28,Feriados!$A$1:$A$442)),\"\")","v":""},"Não",0,0]
[null,15,"Ajuste do PB pós CONJUR","Demandante",0,0,{"$f":"IF(G28=\"\",\"\",WORKDAY(G28,F29,Feriados!$A$1:$A$442))","v":""},"",{"$f":"IF(H29=\"\",\"\",WORKDAY(H29,F29,Feriados!$A$1:$A$442))","v":""},null,{"$f":"IF(J29=\"\",\"\",IF(J29=I29,0,NETWORKDAYS(I29,J29,Feriados!$A$1:$A$442)))","v":""},{"$error":"#VALUE!"},{"$f":"IF(J29<>0,J29,WORKDAY(L29,F29,Feriados!A22:$A$442))","v":{"$error":"#VALUE!"}},{"$f":"IFERROR(IF(J29=\"\",\"\",NETWORKDAYS(L29,M29,Feriados!$A$1:$A$442)),\"\")","v":""},"Não",0,0]
[null,16,"Adequar Minuta de Contrato ou Congênere","CCONT",0,0,{"$f":"IF(G29=\"\",\"\",WORKDAY(G29,F30,Feriados!$A$1:$A$442))","v":""},"",{"$f":"IF(H30=\"\",\"\",WORKDAY(H30,F30,Feriados!$A$1:$A$442))","v":""},null,{"$f":"IF(J30=\"\",\"\",IF(J30=I30,0,NETWORKDAYS(I30,J30,Feriados!$A$1:$A$442)))","v":""},{"$error":"#VALUE!"},{"$f":"IF(J30<>0,J30,WORKDAY(L30,F30,Feriados!A23:$A$442))","v":{"$error":"#VALUE!"}},{"$f":"IFERROR(IF(J30=\"\",\"\",NETWORKDAYS(L30,M30,Feriados!$A$1:$A$442)),\"\")","v":""},"Não",0,0]
[null,17,"Nota Técnica Final e envio para autorização da Dispensa e Ratificação pelas Autoridades Competentes","COPLI/SECON",2,2,{"$f":"IF(G30=\"\",\"\",WORKDAY(G30,F31,Feriados!$A$1:$A$442))","v":""},"",{"$f":"IF(H31=\"\",\"\",WORKDAY(H31,F31,Feriados!$A$1:$A$442))","v":""},null,{"$f":"IF(J31=\"\",\"\",IF(J31=I31,0,NETWORKDAYS(I31,J31,Feriados!$A$1:$A$442)))","v":""},{"$error":"#VALUE!"},{"$f":"IF(J31<>0,J31,WORKDAY(L31,F31,Feriados!A24:$A$442))","v":{"$error":"#VALUE!"}},{"$f":"IFERROR(IF(J31=\"\",\"\",NETWORKDAYS(L31,M31,Feriados!$A$1:$A$442)),\"\")","v":""},"Não",0,0]
["SELEÇÃO DE FORNECEDOR",18,"Emissão de Autorização da Dispensa pela Autoridade Competente","CGL",2,2,{"$f":"IF(G31=\"\",\"\",WORKDAY(G31,F32,Feriados!$A$1:$A$442))","v":""},"",{"$f":"IF(H32=\"\",\"\",WORKDAY(H32,F32,Feriados!$A$1:$A$442))","v":""},null,{"$f":"IF(J32=\"\",\"\",IF(J32=I32,0,NETWORKDAYS(I32,J32,Feriados!$A$1:$A$442)))","v":""},{"$error":"#VALUE!"},{"$f":"IF(J32<>0,J32,WORKDAY(L32,F32,Feriados!A25:$A$442))","v":{"$error":"#VALUE!"}},{"$f":"IFERROR(IF(J32=\"\",\"\",NETWORKDAYS(L32,M32,Feriados!$A$1:$A$442)),\"\")","v":""},"Não",0,0]
[null,19,"Emissão de Ratificação da Dispensa pela Autoridade Competente","SAA/SE",3,3,{"$f":"IF(G32=\"\",\"\",WORKDAY(G32,F33,Feriados!$A$1:$A$442))","v":""},"",{"$f":"IF(H33=\"\",\"\",WORKDAY(H33,F33,Feriados!$A$1:$A$442))","v":""},null,{"$f":"IF(J33=\"\",\"\",IF(J33=I33,0,NETWORKDAYS(I33,J33,Feriados!$A$1:$A$442)))","v":""},{"$error":"#VALUE!"},{"$f":"IF(J33<>0,J33,WORKDAY(L33,F33,Feriados!A26:$A$442))","v":{"$error":"#VALUE!"}},{"$f":"IFERROR(IF(J33=\"\",\"\",NETWORKDAYS(L33,M33,Feriados!$A$1:$A$442)),\"\")","v":""},"Não",0,0]
[null,20,"Lançamento no Sistema (Publicação)","COPLI/SECON",2,2,{"$f":"IF(G33=\"\",\"\",WORKDAY(G33,F34,Feriados!$A$1:$A$442))","v":""},"",{"$f":"IF(H34=\"\",\"\",WORKDAY(H34,F34,Feriados!$A$1:$A$442))","v":""},null,{"$f":"IF(J34=\"\",\"\",IF(J34=I34,0,NETWORKDAYS(I34,J34,Feriados!$A$1:$A$442)))","v":""},{"$error":"#VALUE!"},{"$f":"IF(J34<>0,J34,WORKDAY(L34,F34,Feriados!A27:$A$442))","v":{"$error":"#VALUE!"}},{"$f":"IFERROR(IF(J34=\"\",\"\",NETWORKDAYS(L34,M34,Feriados!$A$1:$A$442)),\"\")","v":""},"Não",0,0]
["CONTRATAÇÃO",21,"Instrução para Autorização da contratação","CGL",2,2,{"$f":"IF(G34=\"\",\"\",WORKDAY(G34,F35,Feriados!$A$1:$A$442))","v":""},"",{"$f":"IF(H35=\"\",\"\",WORKDAY(H35,F35,Feriados!$A$1:$A$442))","v":""},null,{"$f":"IF(J35=\"\",\"\",IF(J35=I35,0,NETWORKDAYS(I35,J35,Feriados!$A$1:$A$442)))","v":""},{"$error":"#VALUE!"},{"$f":"IF(J35<>0,J35,WORKDAY(L35,F35,Feriados!A28:$A$442))","v":{"$error":"#VALUE!"}},{"$f":"IFERROR(IF(J35=\"\",\"\",NETWORKDAYS(L35,M35,Feriados!$A$1:$A$442)),\"\")","v":""},"Não",0,0]
[null,22,"Autorização da Contratação","Autor. Competente",5,5,{"$f":"IF(G35=\"\",\"\",WORKDAY(G35,F36,Feriados!$A$1:$A$442))","v":""},"",{"$f":"IF(H36=\"\",\"\",WORKDAY(H36,F36,Feriados!$A$1:$A$442))","v":""},null,{"$f":"IF(J36=\"\",\"\",IF(J36=I36,0,NETWORKDAYS(I36,J36,Feriados!$A$1:$A$442)))","v":""},{"$error":"#VALUE!"},{"$f":"IF(J36<>0,J36,WORKDAY(L36,F36,Feriados!A39:$A$442))","v":{"$error":"#VALUE!"}},{"$f":"IFERROR(IF(J36=\"\",\"\",NETWORKDAYS(L36,M36,Feriados!$A$1:$A$442)),\"\")","v":""},"Não",0,0]
[null,23,"Emissão de Empenho ","COEFIN/CGL",2,2,{"$f":"IF(G36=\"\",\"\",WORKDAY(G36,F37,Feriados!$A$1:$A$442))","v":""},"",{"$f":"IF(H37=\"\",\"\",WORKDAY(H37,F37,Feriados!$A$1:$A$442))","v":""},null,{"$f":"IF(J37=\"\",\"\",IF(J37=I37,0,NETWORKDAYS(I37,J37,Feriados!$A$1:$A$442)))","v":""},{"$error":"#VALUE!"},{"$f":"IF(J37<>0,J37,WORKDAY(L37,F37,Feriados!A40:$A$442))","v":{"$error":"#VALUE!"}},{"$f":"IFERROR(IF(J37=\"\",\"\",NETWORKDAYS(L37,M37,Feriados!$A$1:$A$442)),\"\")","v":""},"Não",0,0]
[null,24,"Formalização do Contrato ou Congênere","CCONT/CGL",5,5,{"$f":"IF(G37=\"\",\"\",WORKDAY(G37,F38,Feriados!$A$1:$A$442))","v":""},"",{"$f":"IF(H38=\"\",\"\",WORKDAY(H38,F38,Feriados!$A$1:$A$442))","v":""},null,{"$f":"IF(J38=\"\",\"\",IF(J38=I38,0,NETWORKDAYS(I38,J38,Feriados!$A$1:$A$442)))","v":""},{"$error":"#VALUE!"},{"$f":"IF(J38<>0,J38,WORKDAY(L38,F38,Feriados!A41:$A$442))","v":{"$error":"#VALUE!"}},{"$f":"IFERROR(IF(J38=\"\",\"\",NETWORKDAYS(L38,M38,Feriados!$A$1:$A$442)),\"\")","v":""},"Não",0,0]
[null,null,null,"TOTAL",{"$f":"SUM(E15:E38)","v":79},{"$f":"SUM(F15:F38)","v":79},null,null,null,null,null,null,"TOTAL",{"$f":"SUM(N15:N38)","v":0}]

{"sheet":"DISPENSA SERV - PNOC","index":1,"n_rows":39,"n_cols":17,"rows_kept":39,"cut":false,"hidden":false,"merged":[[14,0,23,0],[24,0,30,0],[31,0,33,0],[34,0,37,0],[10,2,10,8],[12,4,13,4],[12,5,12,6],[12,7,12,10],[12,11,12,13],[12,14,12,16],[13,1,13,2],[3,3,3,8],[4,3,4,8],[5,3,5,8],[6,3,6,8],[7,3,7,8],[8,3,8,8],[1,2,1,8],[1,10,1,16],[2,3,2,8],[2,10,3,10],[2,11,3,11],[2,12,3,12],[2,13,3,13],[2,14,3,14],[2,15,3,15],[2,16,3,16]]}
[]
[null,null,"DADOS BÁSICOS DA CONTRATAÇÃO",null,null,null,null,null,null,null,"QUADRO RESUMO DE ACOMPANHAMENTO DO PROCESSO DE CONTRATAÇÃO"]
[null,null,"Objeto da Contatação*","XXXXXXXXX",null,null,null,null,null,null,"Data Inicial Prevista","Data Término Prevista","TMPL Padrão","TMPL Previsto","Data Término Atualizado","TMPL Efetivo","Dias para Conclusão"]
[null,null,"Tipo de Objeto*","SERVIÇOS"]
[null,null,"Modalidade Licitatória*","DISPENSA POR VALOR - SERVIÇOS (Art. 24, I e II da Lei 8.666/93)",null,null,null,null,null,null,{"$f":"IF(H15=\"\",\"\",H15)","v":""},{"$f":"I38","v":""},{"$f":"E39","v":83},{"$f":"F39","v":83},{"$f":"M38","v":{"$error":"#VALUE!"}},{"$f":"SUMIF(N15:N38,\"<>0\")+SUMIFS(F15:F38,N15:N38,\"\")","v":83},{"$f":"IF(H15=\"\",\"\",NETWORKDAYS(TODAY(),M38,Feriados!$A$1:$A$442))","v":""}]
[null,null,"Fluxo da Instrução Processual*","PRAZO NORMAL/OBJETO COMPLEXO"]
[null,null,"Valor da Contratação*","XXXXXXXXX"]
[null,null,"Nº do Processo*","XXXXXXXXX"]
[null,null,"Atende quais itens do PAC*","XXXXXXXXX"]
[null,null,"EVOLUÇÃO DA CONTRATAÇÃO"]
[null,null,{"$f":"SUM(Q15:Q104)/SUM(E15:E104)","v":0}]
[null,null,"* preenchimento obrigatório"]
[null,null,null,null,"Tempo médio padrão","1° Pactuação",null,"ACOMPANHAMENTO DOS PRAZOS PACTUADOS ",null,null,null,"PREVISTO/REALIZADO",null,null,"STATUS"]
["Etapas","Atividade",null,"Setor",null,"Dias","Datas Pactuadas","Data Início","Data Término","Realizado","Dias Adiantado/\nAtrasado (Processo)","Data Início","Data Término","Dias Efetivos","Concluído","%","Dias"]
["PLANEJAMENTO DA CONTRATAÇÃO",1,"Confecção do DFD/DOD","Demandante",3,3,{"$f":"I15","v":""},null,{"$f":"IF(H15=\"\",\"\",WORKDAY(H15,F15,Feriados!$A$1:$A$442))","v":""},null,{"$f":"IF(J15=\"\",\"\",IF(J15=I15,0,NETWORKDAYS(I15,J15,Feriados!$A$1:$A$442)))","v":""},{"$f":"IF(H15=\"\",G15,H15)","v":""},{"$f":"IF(J15<>0,J15,WORKDAY(L15,F15,Feriados!A1:$A$442))","v":{"$error":"#VALUE!"}},{"$f":"IFERROR(IF(J15=\"\",\"\",NETWORKDAYS(L15,M15,Feriados!$A$1:$A$442)),\"\")","v":""},{"$f":"IF(J15<>0,\"Sim\",\"Não\")","v":"Não"},{"$f":"IF(O15=\"Sim\",100%,IF(O15=\"Não\",0%,\"\"))","v":0},{"$f":"E15*P15","v":0}]
[null,{"$f":"B15+1","v":2},"Pactuação do Cronograma da Contratação","CGL/EPC",2,2,{"$f":"IF(G15=\"\",\"\",WORKDAY(G15,F16,Feriados!$A$1:$A$442))","v":""},{"$f":"IF(I15=\"\",\"\",I15)","v":""},{"$f":"IF(H16=\"\",\"\",WORKDAY(H16,F16,Feriados!$A$1:$A$442))","v":""},null,{"$f":"IF(J16=\"\",\"\",IF(J16=I16,0,NETWORKDAYS(I16,J16,Feriados!$A$1:$A$442)))","v":""},{"$f":"IF(M15=\"\",H16,M15)","v":{"$error":"#VALUE!"}},{"$f":"IF(J16<>0,J16,WORKDAY(L16,F16,Feriados!A2:$A$442))","v":{"$error":"#VALUE!"}},{"$f":"IFERROR(IF(J16=\"\",\"\",NETWORKDAYS(L16,M16,Feriados!$A$1:$A$442)),\"\")","v":""},{"$f":"IF(J16<>0,\"Sim\",\"Não\")","v":"Não"},{"$f":"IF(O16=\"Sim\",100%,IF(O16=\"Não\",0%,\"\"))","v":0},{"$f":"E16*P16","v":0}]
[null,{"$f":"B16+1","v":3},"Aprovação do Cronograma da Contratação","SAA/SE",2,2,{"$f":"IF(G16=\"\",\"\",WORKDAY(G16,F17,Feriados!$A$1:$A$442))","v":""},{"$f":"IF(I16=\"\",\"\",I16)","v":""},{"$f":"IF(H17=\"\",\"\",WORKDAY(H17,F17,Feriados!$A$1:$A$442))","v":""},null,{"$f":"IF(J17=\"\",\"\",IF(J17=I17,0,NETWORKDAYS(I17,J17,Feriados!$A$1:$A$442)))","v":""},{"$f":"IF(M16=\"\",H17,M16)","v":{"$error":"#VALUE!"}},{"$f":"IF(J17<>0,J17,WORKDAY(L17,F17,Feriados!A3:$A$442))","v":{"$error":"#VALUE!"}},{"$f":"IFERROR(IF(J17=\"\",\"\",NETWORKDAYS(L17,M17,Feriados!$A$1:$A$442)),\"\")","v":""},"Não",0,0]
[null,4,"Confecção do Projeto Básico - PB","Demandante",20,20,{"$f":"IF(G17=\"\",\"\",WORKDAY(G17,F18,Feriados!$A$1:$A$442))","v":""},{"$f":"IF(I17=\"\",\"\",I17)","v":""},{"$f":"IF(H18=\"\",\"\",WORKDAY(H18,F18,Feriados!$A$1:$A$442))","v":""},null,{"$f":"IF(J18=\"\",\"\",IF(J18=I18,0,NETWORKDAYS(I18,J18,Feriados!$A$1:$A$442)))","v":""},{"$f":"IF(M17=\"\",H18,M17)","v":{"$error":"#VALUE!"}},{"$f":"IF(J18<>0,J18,WORKDAY(L18,F18,Feriados!A4:$A$442))","v":{"$error":"#VALUE!"}},{"$f":"IFERROR(IF(J18=\"\",\"\",NETWORKDAYS(L18,M18,Feriados!$A$1:$A$442)),\"\")","v":""},{"$f":"IF(J18<>0,\"Sim\",\"Não\")","v":"Não"},{"$f":"IF(O18=\"Sim\",100%,IF(O18=\"Não\",0%,\"\"))","v":0},{"$f":"E18*P18","v":0}]
[null,5,"Realização da Pesquisa de Preços ","Demandante",15,15,{"$f":"IF(G18=\"\",\"\",WORKDAY(G18,F19,Feriados!$A$1:$A$442))","v":""},"",{"$f":"IF(H19=\"\",\"\",WORKDAY(H19,F19,Feriados!$A$1:$A$442))","v":""},null,{"$f":"IF(J19=\"\",\"\",IF(J19=I19,0,NETWORKDAYS(I19,J19,Feriados!$A$1:$A$442)))","v":""},{"$error":"#VALUE!"},{"$f":"IF(J19<>0,J19,WORKDAY(L19,F19,Feriados!A5:$A$442))","v":{"$error":"#VALUE!"}},{"$f":"IFERROR(IF(J19=\"\",\"\",NETWORKDAYS(L19,M19,Feriados!$A$1:$A$442)),\"\")","v":""},"Não",0,0]
[null,6,"Análise do PB e Pesquisa de Preços","CGL (COPLI/CCONT/COEFIN)",3,3,{"$f":"IF(G19=\"\",\"\",WORKDAY(G19,F20,Feriados!$A$1:$A$442))","v":""},"",{"$f":"IF(H20=\"\",\"\",WORKDAY(H20,F20,Feriados!$A$1:$A$442))","v":""},null,{"$f":"IF(J20=\"\",\"\",IF(J20=I20,0,NETWORKDAYS(I20,J20,Feriados!$A$1:$A$442)))","v":""},{"$error":"#VALUE!"},{"$f":"IF(J20<>0,J20,WORKDAY(L20,F20,Feriados!A6:$A$442))","v":{"$error":"#VALUE!"}},{"$f":"IFERROR(IF(J20=\"\",\"\",NETWORKDAYS(L20,M20,Feriados!$A$1:$A$442)),\"\")","v":""},"Não",0,0]
[null,7,"Compilação e envio a Demandante","CGL",2,2,{"$f":"IF(G20=\"\",\"\",WORKDAY(G20,F21,Feriados!$A$1:$A$442))","v":""},"",{"$f":"IF(H21=\"\",\"\",WORKDAY(H21,F21,Feriados!$A$1:$A$442))","v":""},null,{"$f":"IF(J21=\"\",\"\",IF(J21=I21,0,NETWORKDAYS(I21,J21,Feriados!$A$1:$A$442)))","v":""},{"$error":"#VALUE!"},{"$f":"IF(J21<>0,J21,WORKDAY(L21,F21,Feriados!A7:$A$442))","v":{"$error":"#VALUE!"}},{"$f":"IFERROR(IF(J21=\"\",\"\",NETWORKDAYS(L21,M21,Feriados!$A$1:$A$442)),\"\")","v":""},"Não",0,0]
[null,8,"Retorno do PB ajustado ","Demandante",3,3,{"$f":"IF(G21=\"\",\"\",WORKDAY(G21,F22,Feriados!$A$1:$A$442))","v":""},"",{"$f":"IF(H22=\"\",\"\",WORKDAY(H22,F22,Feriados!$A$1:$A$442))","v":""},null,{"$f":"IF(J22=\"\",\"\",IF(J22=I22,0,NETWORKDAYS(I22,J22,Feriados!$A$1:$A$442)))","v":""},{"$error":"#VALUE!"},{"$f":"IF(J22<>0,J22,WORKDAY(L22,F22,Feriados!A8:$A$442))","v":{"$error":"#VALUE!"}},{"$f":"IFERROR(IF(J22=\"\",\"\",NETWORKDAYS(L22,M22,Feriados!$A$1:$A$442)),\"\")","v":""},"Não",0,0]
[null,9,"Conformidade de Pesquisa de Preço","SCPP/COPLI/CGL",5,5,{"$f":"IF(G22=\"\",\"\",WORKDAY(G22,F23,Feriados!$A$1:$A$442))","v":""},"",{"$f":"IF(H23=\"\",\"\",WORKDAY(H23,F23,Feriados!$A$1:$A$442))","v":""},null,{"$f":"IF(J23=\"\",\"\",IF(J23=I23,0,NETWORKDAYS(I23,J23,Feriados!$A$1:$A$442)))","v":""},{"$error":"#VALUE!"},{"$f":"IF(J23<>0,J23,WORKDAY(L23,F23,Feriados!A9:$A$442))","v":{"$error":"#VALUE!"}},{"$f":"IFERROR(IF(J23=\"\",\"\",NETWORKDAYS(L23,M23,Feriados!$A$1:$A$442)),\"\")","v":""},"Não",0,0]
[null,10,"DDO","COEFIN/CGL",2,2,{"$f":"IF(G23=\"\",\"\",WORKDAY(G23,F24,Feriados!$A$1:$A$442))","v":""},"",{"$f":"IF(H24=\"\",\"\",WORKDAY(H24,F24,Feriados!$A$1:$A$442))","v":""},null,{"$f":"IF(J24=\"\",\"\",IF(J24=I24,0,NETWORKDAYS(I24,J24,Feriados!$A$1:$A$442)))","v":""},{"$error":"#VALUE!"},{"$f":"IF(J24<>0,J24,WORKDAY(L24,F24,Feriados!A11:$A$442))","v":{"$error":"#VALUE!"}},{"$f":"IFERROR(IF(J24=\"\",\"\",NETWORKDAYS(L24,M24,Feriados!$A$1:$A$442)),\"\")","v":""},"Não",0,0]
["INSTRUMENTO DE CONTRATAÇÃO E ANÁLISE JURÍDICA",11,"Minuta Contrato ou Congênere / Nota Técnica COPLI","CCONT/ COPLI / CGL",3,3,{"$f":"IF(G24=\"\",\"\",WORKDAY(G24,F25,Feriados!$A$1:$A$442))","v":""},"",{"$f":"IF(H25=\"\",\"\",WORKDAY(H25,F25,Feriados!$A$1:$A$442))","v":""},null,{"$f":"IF(J25=\"\",\"\",IF(J25=I25,0,NETWORKDAYS(I25,J25,Feriados!$A$1:$A$442)))","v":""},{"$error":"#VALUE!"},{"$f":"IF(J25<>0,J25,WORKDAY(L25,F25,Feriados!A12:$A$442))","v":{"$error":"#VALUE!"}},{"$f":"IFERROR(IF(J25=\"\",\"\",NETWORKDAYS(L25,M25,Feriados!$A$1:$A$442)),\"\")","v":""},"Não",0,0]
[null,12,"Compilação e envio a CONJUR","CGL",0,0,{"$f":"IF(G25=\"\",\"\",WORKDAY(G25,F26,Feriados!$A$1:$A$442))","v":""},"",{"$f":"IF(H26=\"\",\"\",WORKDAY(H26,F26,Feriados!$A$1:$A$442))","v":""},null,{"$f":"IF(J26=\"\",\"\",IF(J26=I26,0,NETWORKDAYS(I26,J26,Feriados!$A$1:$A$442)))","v":""},{"$error":"#VALUE!"},{"$f":"IF(J26<>0,J26,WORKDAY(L26,F26,Feriados!A13:$A$442))","v":{"$error":"#VALUE!"}},{"$f":"IFERROR(IF(J26=\"\",\"\",NETWORKDAYS(L26,M26,Feriados!$A$1:$A$442)),\"\")","v":""},"Não",0,0]
[null,13,"Análise CONJUR - CJ","CONJUR",0,0,{"$f":"IF(G26=\"\",\"\",WORKDAY(G26,F27,Feriados!$A$1:$A$442))","v":""},"",{"$f":"IF(H27=\"\",\"\",WORKDAY(H27,F27,Feriados!$A$1:$A$442))","v":""},null,{"$f":"IF(J27=\"\",\"\",IF(J27=I27,0,NETWORKDAYS(I27,J27,Feriados!$A$1:$A$442)))","v":""},{"$error":"#VALUE!"},{"$f":"IF(J27<>0,J27,WORKDAY(L27,F27,Feriados!A14:$A$442))","v":{"$error":"#VALUE!"}},{"$f":"IFERROR(IF(J27=\"\",\"\",NETWORKDAYS(L27,M27,Feriados!$A$1:$A$442)),\"\")","v":""},"Não",0,0]
[null,14,"Envio para ajustes das recomendações CJ","CGL",0,0,{"$f":"IF(G27=\"\",\"\",WORKDAY(G27,F28,Feriados!$A$1:$A$442))","v":""},"",{"$f":"IF(H28=\"\",\"\",WORKDAY(H28,F28,Feriados!$A$1:$A$442))","v":""},null,{"$f":"IF(J28=\"\",\"\",IF(J28=I28,0,NETWORKDAYS(I28,J28,Feriados!$A$1:$A$442)))","v":""},{"$error":"#VALUE!"},{"$f":"IF(J28<>0,J28,WORKDAY(L28,F28,Feriados!A15:$A$442))","v":{"$error":"#VALUE!"}},{"$f":"IFERROR(IF(J28=\"\",\"\",NETWORKDAYS(L28,M28,Feriados!$A$1:$A$442)),\"\")","v":""},"Não",0,0]
[null,15,"Ajuste do PB pós CONJUR","Demandante",0,0,{"$f":"IF(G28=\"\",\"\",WORKDAY(G28,F29,Feriados!$A$1:$A$442))","v":""},"",{"$f":"IF(H29=\"\",\"\",WORKDAY(H29,F29,Feriados!$A$1:$A$442))","v":""},null,{"$f":"IF(J29=\"\",\"\",IF(J29=I29,0,NETWORKDAYS(I29,J29,Feriados!$A$1:$A$442)))","v":""},{"$error":"#VALUE!"},{"$f":"IF(J29<>0,J29,WORKDAY(L29,F29,Feriados!A22:$A$442))","v":{"$error":"#VALUE!"}},{"$f":"IFERROR(IF(J29=\"\",\"\",NETWORKDAYS(L29,M29,Feriados!$A$1:$A$442)),\"\")","v":""},"Não",0,0]
[null,16,"Adequar Minuta de Contrato ou Congênere","CCONT",0,0,{"$f":"IF(G29=\"\",\"\",WORKDAY(G29,F30,Feriados!$A$1:$A$442))","v":""},"",{"$f":"IF(H30=\"\",\"\",WORKDAY(H30,F30,Feriados!$A$1:$A$442))","v":""},null,{"$f":"IF(J30=\"\",\"\",IF(J30=I30,0,NETWORKDAYS(I30,J30,Feriados!$A$1:$A$442)))","v":""},{"$error":"#VALUE!"},{"$f":"IF(J30<>0,J30,WORKDAY(L30,F30,Feriados!A23:$A$442))","v":{"$error":"#VALUE!"}},{"$f":"IFERROR(IF(J30=\"\",\"\",NETWORKDAYS(L30,M30,Feriados!$A$1:$A$442)),\"\")","v":""},"Não",0,0]
[null,17,"Nota Técnica Final e envio para  autorização da Dispensa e Ratificação pelas Autoridades Competentes","COPLI/SECON",2,2,{"$f":"IF(G30=\"\",\"\",WORKDAY(G30,F31,Feriados!$A$1:$A$442))","v":""},"",{"$f":"IF(H31=\"\",\"\",WORKDAY(H31,F31,Feriados!$A$1:$A$442))","v":""},null,{"$f":"IF(J31=\"\",\"\",IF(J31=I31,0,NETWORKDAYS(I31,J31,Feriados!$A$1:$A$442)))","v":""},{"$error":"#VALUE!"},{"$f":"IF(J31<>0,J31,WORKDAY(L31,F31,Feriados!A24:$A$442))","v":{"$error":"#VALUE!"}},{"$f":"IFERROR(IF(J31=\"\",\"\",NETWORKDAYS(L31,M31,Feriados!$A$1:$A$442)),\"\")","v":""},"Não",0,0]
["SELEÇÃO DE FORNECEDOR",18,"Emissão de Autorização da Dispensa pela Autoridade Competente","CGL",2,2,{"$f":"IF(G31=\"\",\"\",WORKDAY(G31,F32,Feriados!$A$1:$A$442))","v":""},"",{"$f":"IF(H32=\"\",\"\",WORKDAY(H32,F32,Feriados!$A$1:$A$442))","v":""},null,{"$f":"IF(J32=\"\",\"\",IF(J32=I32,0,NETWORKDAYS(I32,J32,Feriados!$A$1:$A$442)))","v":""},{"$error":"#VALUE!"},{"$f":"IF(J32<>0,J32,WORKDAY(L32,F32,Feriados!A25:$A$442))","v":{"$error":"#VALUE!"}},{"$f":"IFERROR(IF(J32=\"\",\"\",NETWORKDAYS(L32,M32,Feriados!$A$1:$A$442)),\"\")","v":""},"Não",0,0]
[null,19,"Emissão de Ratificação da Dispensa pela Autoridade Competente","SAA/SE",3,3,{"$f":"IF(G32=\"\",\"\",WORKDAY(G32,F33,Feriados!$A$1:$A$442))","v":""},"",{"$f":"IF(H33=\"\",\"\",WORKDAY(H33,F33,Feriados!$A$1:$A$442))","v":""},null,{"$f":"IF(J33=\"\",\"\",IF(J33=I33,0,NETWORKDAYS(I33,J33,Feriados!$A$1:$A$442)))","v":""},{"$error":"#VALUE!"},{"$f":"IF(J33<>0,J33,WORKDAY(L33,F33,Feriados!A26:$A$442))","v":{"$error":"#VALUE!"}},{"$f":"IFERROR(IF(J33=\"\",\"\",NETWORKDAYS(L33,M33,Feriados!$A$1:$A$442)),\"\")","v":""},"Não",0,0]
[null,20,"Lançamento no Sistema (Publicação)","COPLI/SECON",2,2,{"$f":"IF(G33=\"\",\"\",WORKDAY(G33,F34,Feriados!$A$1:$A$442))","v":""},"",{"$f":"IF(H34=\"\",\"\",WORKDAY(H34,F34,Feriados!$A$1:$A$442))","v":""},null,{"$f":"IF(J34=\"\",\"\",IF(J34=I34,0,NETWORKDAYS(I34,J34,Feriados!$A$1:$A$442)))","v":""},{"$error":"#VALUE!"},{"$f":"IF(J34<>0,J34,WORKDAY(L34,F34,Feriados!A27:$A$442))","v":{"$error":"#VALUE!"}},{"$f":"IFERROR(IF(J34=\"\",\"\",NETWORKDAYS(L34,M34,Feriados!$A$1:$A$442)),\"\")","v":""},"Não",0,0]
["CONTRATAÇÃO",21,"Instrução para Autorização da contratação","CGL",2,2,{"$f":"IF(G34=\"\",\"\",WORKDAY(G34,F35,Feriados!$A$1:$A$442))","v":""},"",{"$f":"IF(H35=\"\",\"\",WORKDAY(H35,F35,Feriados!$A$1:$A$442))","v":""},null,{"$f":"IF(J35=\"\",\"\",IF(J35=I35,0,NETWORKDAYS(I35,J35,Feriados!$A$1:$A$442)))","v":""},{"$error":"#VALUE!"},{"$f":"IF(J35<>0,J35,WORKDAY(L35,F35,Feriados!A28:$A$442))","v":{"$error":"#VALUE!"}},{"$f":"IFERROR(IF(J35=\"\",\"\",NETWORKDAYS(L35,M35,Feriados!$A$1:$A$442)),\"\")","v":""},"Não",0,0]
[null,22,"Autorização da Contratação","Autor. Competente",5,5,{"$f":"IF(G35=\"\",\"\",WORKDAY(G35,F36,Feriados!$A$1:$A$442))","v":""},"",{"$f":"IF(H36=\"\",\"\",WORKDAY(H36,F36,Feriados!$A$1:$A$442))","v":""},null,{"$f":"IF(J36=\"\",\"\",IF(J36=I36,0,NETWORKDAYS(I36,J36,Feriados!$A$1:$A$442)))","v":""},{"$error":"#VALUE!"},{"$f":"IF(J36<>0,J36,WORKDAY(L36,F36,Feriados!A39:$A$442))","v":{"$error":"#VALUE!"}},{"$f":"IFERROR(IF(J36=\"\",\"\",NETWORKDAYS(L36,M36,Feriados!$A$1:$A$442)),\"\")","v":""},"Não",0,0]
[null,23,"Emissão de Empenho ","COEFIN/CGL",2,2,{"$f":"IF(G36=\"\",\"\",WORKDAY(G36,F37,Feriados!$A$1:$A$442))","v":""},"",{"$f":"IF(H37=\"\",\"\",WORKDAY(H37,F37,Feriados!$A$1:$A$442))","v":""},null,{"$f":"IF(J37=\"\",\"\",IF(J37=I37,0,NETWORKDAYS(I37,J37,Feriados!$A$1:$A$442)))","v":""},{"$error":"#VALUE!"},{"$f":"IF(J37<>0,J37,WORKDAY(L37,F37,Feriados!A40:$A$442))","v":{"$error":"#VALUE!"}},{"$f":"IFERROR(IF(J37=\"\",\"\",NETWORKDAYS(L37,M37,Feriados!$A$1:$A$442)),\"\")","v":""},"Não",0,0]
[null,24,"Formalização do Contrato ou Congênere","CCONT/CGL",5,5,{"$f":"IF(G37=\"\",\"\",WORKDAY(G37,F38,Feriados!$A$1:$A$442))","v":""},"",{"$f":"IF(H38=\"\",\"\",WORKDAY(H38,F38,Feriados!$A$1:$A$442))","v":""},null,{"$f":"IF(J38=\"\",\"\",IF(J38=I38,0,NETWORKDAYS(I38,J38,Feriados!$A$1:$A$442)))","v":""},{"$error":"#VALUE!"},{"$f":"IF(J38<>0,J38,WORKDAY(L38,F38,Feriados!A41:$A$442))","v":{"$error":"#VALUE!"}},{"$f":"IFERROR(IF(J38=\"\",\"\",NETWORKDAYS(L38,M38,Feriados!$A$1:$A$442)),\"\")","v":""},"Não",0,0]
[null,null,null,"TOTAL",{"$f":"SUM(E15:E38)","v":83},{"$f":"SUM(F15:F38)","v":83},null,null,null,null,null,null,"TOTAL",{"$f":"SUM(N15:N38)","v":0}]

{"sheet":"DISPENSA SERV - PUOS","index":2,"n_rows":39,"n_cols":17,"rows_kept":39,"cut":false,"hidden":false,"merged":[[14,0,23,0],[24,0,30,0],[31,0,33,0],[34,0,37,0],[10,2,10,8],[12,4,13,4],[12,5,12,6],[12,7,12,10],[12,11,12,13],[12,14,12,16],[13,1,13,2],[3,3,3,8],[4,3,4,8],[5,3,5,8],[6,3,6,8],[7,3,7,8],[8,3,8,8],[1,2,1,8],[1,10,1,16],[2,3,2,8],[2,10,3,10],[2,11,3,11],[2,12,3,12],[2,13,3,13],[2,14,3,14],[2,15,3,15],[2,16,3,16]]}
[]
[null,null,"DADOS BÁSICOS DA CONTRATAÇÃO",null,null,null,null,null,null,null,"QUADRO RESUMO DE ACOMPANHAMENTO DO PROCESSO DE CONTRATAÇÃO"]
[null,null,"Objeto da Contatação*","XXXXXXXXX",null,null,null,null,null,null,"Data Inicial Prevista","Data Término Prevista","TMPL Padrão","TMPL Previsto","Data Término Atualizado","TMPL Efetivo","Dias para Conclusão"]
[null,null,"Tipo de Objeto*","SERVIÇOS"]
[null,null,"Modalidade Licitatória*","DISPENSA POR VALOR - SERVIÇOS (Art. 24, I e II da Lei 8.666/93)",null,null,null,null,null,null,{"$f":"IF(H15=\"\",\"\",H15)","v":""},{"$f":"I38","v":""},{"$f":"E39","v":62},{"$f":"F39","v":62},{"$f":"M38","v":{"$error":"#VALUE!"}},{"$f":"SUMIF(N15:N38,\"<>0\")+SUMIFS(F15:F38,N15:N38,\"\")","v":62},{"$f":"IF(H15=\"\",\"\",NETWORKDAYS(TODAY(),M38,Feriados!$A$1:$A$442))","v":""}]
[null,null,"Fluxo da Instrução Processual*","PRAZO URGENTE/OBJETO SIMPLES"]
[null,null,"Valor da Contratação*","XXXXXXXXX"]
[null,null,"Nº do Processo*","XXXXXXXXX"]
[null,null,"Atende quais itens do PAC*","XXXXXXXXX"]
[null,null,"EVOLUÇÃO DA CONTRATAÇÃO"]
[null,null,{"$f":"SUM(Q15:Q104)/SUM(E15:E104)","v":0}]
[null,null,"* preenchimento obrigatório"]
[null,null,null,null,"Tempo médio padrão","1° Pactuação",null,"ACOMPANHAMENTO DOS PRAZOS PACTUADOS ",null,null,null,"PREVISTO/REALIZADO",null,null,"STATUS"]
["Etapas","Atividade",null,"Setor",null,"Dias","Datas Pactuadas","Data Início","Data Término","Realizado","Dias Adiantado/\nAtrasado (Processo)","Data Início","Data Término","Dias Efetivos","Concluído","%","Dias"]
["PLANEJAMENTO DA CONTRATAÇÃO",1,"Confecção do DFD/DOD","Demandante",2,2,{"$f":"I15","v":""},null,{"$f":"IF(H15=\"\",\"\",WORKDAY(H15,F15,Feriados!$A$1:$A$442))","v":""},null,{"$f":"IF(J15=\"\",\"\",IF(J15=I15,0,NETWORKDAYS(I15,J15,Feriados!$A$1:$A$442)))","v":""},{"$f":"IF(H15=\"\",G15,H15)","v":""},{"$f":"IF(J15<>0,J15,WORKDAY(L15,F15,Feriados!A1:$A$442))","v":{"$error":"#VALUE!"}},{"$f":"IFERROR(IF(J15=\"\",\"\",NETWORKDAYS(L15,M15,Feriados!$A$1:$A$442)),\"\")","v":""},{"$f":"IF(J15<>0,\"Sim\",\"Não\")","v":"Não"},{"$f":"IF(O15=\"Sim\",100%,IF(O15=\"Não\",0%,\"\"))","v":0},{"$f":"E15*P15","v":0}]
[null,{"$f":"B15+1","v":2},"Pactuação do Cronograma da Contratação","CGL/EPC",2,2,{"$f":"IF(G15=\"\",\"\",WORKDAY(G15,F16,Feriados!$A$1:$A$442))","v":""},{"$f":"IF(I15=\"\",\"\",I15)","v":""},{"$f":"IF(H16=\"\",\"\",WORKDAY(H16,F16,Feriados!$A$1:$A$442))","v":""},null,{"$f":"IF(J16=\"\",\"\",IF(J16=I16,0,NETWORKDAYS(I16,J16,Feriados!$A$1:$A$442)))","v":""},{"$f":"IF(M15=\"\",H16,M15)","v":{"$error":"#VALUE!"}},{"$f":"IF(J16<>0,J16,WORKDAY(L16,F16,Feriados!A2:$A$442))","v":{"$error":"#VALUE!"}},{"$f":"IFERROR(IF(J16=\"\",\"\",NETWORKDAYS(L16,M16,Feriados!$A$1:$A$442)),\"\")","v":""},{"$f":"IF(J16<>0,\"Sim\",\"Não\")","v":"Não"},{"$f":"IF(O16=\"Sim\",100%,IF(O16=\"Não\",0%,\"\"))","v":0},{"$f":"E16*P16","v":0}]
[null,{"$f":"B16+1","v":3},"Aprovação do Cronograma da Contratação","SAA/SE",2,2,{"$f":"IF(G16=\"\",\"\",WORKDAY(G16,F17,Feriados!$A$1:$A$442))","v":""},{"$f":"IF(I16=\"\",\"\",I16)","v":""},{"$f":"IF(H17=\"\",\"\",WORKDAY(H17,F17,Feriados!$A$1:$A$442))","v":""},null,{"$f":"IF(J17=\"\",\"\",IF(J17=I17,0,NETWORKDAYS(I17,J17,Feriados!$A$1:$A$442)))","v":""},{"$f":"IF(M16=\"\",H17,M16)","v":{"$error":"#VALUE!"}},{"$f":"IF(J17<>0,J17,WORKDAY(L17,F17,Feriados!A3:$A$442))","v":{"$error":"#VALUE!"}},{"$f":"IFERROR(IF(J17=\"\",\"\",NETWORKDAYS(L17,M17,Feriados!$A$1:$A$442)),\"\")","v":""},"Não",0,0]
[null,4,"Confecção do Projeto Básico - PB","Demandante",10,10,{"$f":"IF(G17=\"\",\"\",WORKDAY(G17,F18,Feriados!$A$1:$A$442))","v":""},{"$f":"IF(I17=\"\",\"\",I17)","v":""},{"$f":"IF(H18=\"\",\"\",WORKDAY(H18,F18,Feriados!$A$1:$A$442))","v":""},null,{"$f":"IF(J18=\"\",\"\",IF(J18=I18,0,NETWORKDAYS(I18,J18,Feriados!$A$1:$A$442)))","v":""},{"$f":"IF(M17=\"\",H18,M17)","v":{"$error":"#VALUE!"}},{"$f":"IF(J18<>0,J18,WORKDAY(L18,F18,Feriados!A4:$A$442))","v":{"$error":"#VALUE!"}},{"$f":"IFERROR(IF(J18=\"\",\"\",NETWORKDAYS(L18,M18,Feriados!$A$1:$A$442)),\"\")","v":""},{"$f":"IF(J18<>0,\"Sim\",\"Não\")","v":"Não"},{"$f":"IF(O18=\"Sim\",100%,IF(O18=\"Não\",0%,\"\"))","v":0},{"$f":"E18*P18","v":0}]
[null,5,"Realização da Pesquisa de Preços ","Demandante",10,10,{"$f":"IF(G18=\"\",\"\",WORKDAY(G18,F19,Feriados!$A$1:$A$442))","v":""},"",{"$f":"IF(H19=\"\",\"\",WORKDAY(H19,F19,Feriados!$A$1:$A$442))","v":""},null,{"$f":"IF(J19=\"\",\"\",IF(J19=I19,0,NETWORKDAYS(I19,J19,Feriados!$A$1:$A$442)))","v":""},{"$error":"#VALUE!"},{"$f":"IF(J19<>0,J19,WORKDAY(L19,F19,Feriados!A5:$A$442))","v":{"$error":"#VALUE!"}},{"$f":"IFERROR(IF(J19=\"\",\"\",NETWORKDAYS(L19,M19,Feriados!$A$1:$A$442)),\"\")","v":""},"Não",0,0]
[null,6,"Análise do PB e Pesquisa de Preços","CGL (COPLI/CCONT/COEFIN)",3,3,{"$f":"IF(G19=\"\",\"\",WORKDAY(G19,F20,Feriados!$A$1:$A$442))","v":""},"",{"$f":"IF(H20=\"\",\"\",WORKDAY(H20,F20,Feriados!$A$1:$A$442))","v":""},null,{"$f":"IF(J20=\"\",\"\",IF(J20=I20,0,NETWORKDAYS(I20,J20,Feriados!$A$1:$A$442)))","v":""},{"$error":"#VALUE!"},{"$f":"IF(J20<>0,J20,WORKDAY(L20,F20,Feriados!A6:$A$442))","v":{"$error":"#VALUE!"}},{"$f":"IFERROR(IF(J20=\"\",\"\",NETWORKDAYS(L20,M20,Feriados!$A$1:$A$442)),\"\")","v":""},"Não",0,0]
[null,7,"Compilação e envio a Demandante","CGL",2,2,{"$f":"IF(G20=\"\",\"\",WORKDAY(G20,F21,Feriados!$A$1:$A$442))","v":""},"",{"$f":"IF(H21=\"\",\"\",WORKDAY(H21,F21,Feriados!$A$1:$A$442))","v":""},null,{"$f":"IF(J21=\"\",\"\",IF(J21=I21,0,NETWORKDAYS(I21,J21,Feriados!$A$1:$A$442)))","v":""},{"$error":"#VALUE!"},{"$f":"IF(J21<>0,J21,WORKDAY(L21,F21,Feriados!A7:$A$442))","v":{"$error":"#VALUE!"}},{"$f":"IFERROR(IF(J21=\"\",\"\",NETWORKDAYS(L21,M21,Feriados!$A$1:$A$442)),\"\")","v":""},"Não",0,0]
[null,8,"Retorno do PB ajustado ","Demandante",3,3,{"$f":"IF(G21=\"\",\"\",WORKDAY(G21,F22,Feriados!$A$1:$A$442))","v":""},"",{"$f":"IF(H22=\"\",\"\",WORKDAY(H22,F22,Feriados!$A$1:$A$442))","v":""},null,{"$f":"IF(J22=\"\",\"\",IF(J22=I22,0,NETWORKDAYS(I22,J22,Feriados!$A$1:$A$442)))","v":""},{"$error":"#VALUE!"},{"$f":"IF(J22<>0,J22,WORKDAY(L22,F22,Feriados!A8:$A$442))","v":{"$error":"#VALUE!"}},{"$f":"IFERROR(IF(J22=\"\",\"\",NETWORKDAYS(L22,M22,Feriados!$A$1:$A$442)),\"\")","v":""},"Não",0,0]
[null,9,"Conformidade de Pesquisa de Preço","SCPP/COPLI/CGL",3,3,{"$f":"IF(G22=\"\",\"\",WORKDAY(G22,F23,Feriados!$A$1:$A$442))","v":""},"",{"$f":"IF(H23=\"\",\"\",WORKDAY(H23,F23,Feriados!$A$1:$A$442))","v":""},null,{"$f":"IF(J23=\"\",\"\",IF(J23=I23,0,NETWORKDAYS(I23,J23,Feriados!$A$1:$A$442)))","v":""},{"$error":"#VALUE!"},{"$f":"IF(J23<>0,J23,WORKDAY(L23,F23,Feriados!A9:$A$442))","v":{"$error":"#VALUE!"}},{"$f":"IFERROR(IF(J23=\"\",\"\",NETWORKDAYS(L23,M23,Feriados!$A$1:$A$442)),\"\")","v":""},"Não",0,0]
[null,10,"DDO","COEFIN/CGL",2,2,{"$f":"IF(G23=\"\",\"\",WORKDAY(G23,F24,Feriados!$A$1:$A$442))","v":""},"",{"$f":"IF(H24=\"\",\"\",WORKDAY(H24,F24,Feriados!$A$1:$A$442))","v":""},null,{"$f":"IF(J24=\"\",\"\",IF(J24=I24,0,NETWORKDAYS(I24,J24,Feriados!$A$1:$A$442)))","v":""},{"$error":"#VALUE!"},{"$f":"IF(J24<>0,J24,WORKDAY(L24,F24,Feriados!A10:$A$442))","v":{"$error":"#VALUE!"}},{"$f":"IFERROR(IF(J24=\"\",\"\",NETWORKDAYS(L24,M24,Feriados!$A$1:$A$442)),\"\")","v":""},"Não",0,0]
["INSTRUMENTO DE CONTRATAÇÃO E ANÁLISE JURÍDICA",11,"Minuta Contrato ou Congênere / Nota Técnica COPLI","CCONT/ COPLI / CGL",2,2,{"$f":"IF(G24=\"\",\"\",WORKDAY(G24,F25,Feriados!$A$1:$A$442))","v":""},"",{"$f":"IF(H25=\"\",\"\",WORKDAY(H25,F25,Feriados!$A$1:$A$442))","v":""},null,{"$f":"IF(J25=\"\",\"\",IF(J25=I25,0,NETWORKDAYS(I25,J25,Feriados!$A$1:$A$442)))","v":""},{"$error":"#VALUE!"},{"$f":"IF(J25<>0,J25,WORKDAY(L25,F25,Feriados!A12:$A$442))","v":{"$error":"#VALUE!"}},{"$f":"IFERROR(IF(J25=\"\",\"\",NETWORKDAYS(L25,M25,Feriados!$A$1:$A$442)),\"\")","v":""},"Não",0,0]
[null,12,"Compilação e envio a CONJUR","CGL",0,0,{"$f":"IF(G25=\"\",\"\",WORKDAY(G25,F26,Feriados!$A$1:$A$442))","v":""},"",{"$f":"IF(H26=\"\",\"\",WORKDAY(H26,F26,Feriados!$A$1:$A$442))","v":""},null,{"$f":"IF(J26=\"\",\"\",IF(J26=I26,0,NETWORKDAYS(I26,J26,Feriados!$A$1:$A$442)))","v":""},{"$error":"#VALUE!"},{"$f":"IF(J26<>0,J26,WORKDAY(L26,F26,Feriados!A13:$A$442))","v":{"$error":"#VALUE!"}},{"$f":"IFERROR(IF(J26=\"\",\"\",NETWORKDAYS(L26,M26,Feriados!$A$1:$A$442)),\"\")","v":""},"Não",0,0]
[null,13,"Análise CONJUR - CJ","CONJUR",0,0,{"$f":"IF(G26=\"\",\"\",WORKDAY(G26,F27,Feriados!$A$1:$A$442))","v":""},"",{"$f":"IF(H27=\"\",\"\",WORKDAY(H27,F27,Feriados!$A$1:$A$442))","v":""},null,{"$f":"IF(J27=\"\",\"\",IF(J27=I27,0,NETWORKDAYS(I27,J27,Feriados!$A$1:$A$442)))","v":""},{"$error":"#VALUE!"},{"$f":"IF(J27<>0,J27,WORKDAY(L27,F27,Feriados!A14:$A$442))","v":{"$error":"#VALUE!"}},{"$f":"IFERROR(IF(J27=\"\",\"\",NETWORKDAYS(L27,M27,Feriados!$A$1:$A$442)),\"\")","v":""},"Não",0,0]
[null,14,"Envio para ajustes das recomendações CJ","CGL",0,0,{"$f":"IF(G27=\"\",\"\",WORKDAY(G27,F28,Feriados!$A$1:$A$442))","v":""},"",{"$f":"IF(H28=\"\",\"\",WORKDAY(H28,F28,Feriados!$A$1:$A$442))","v":""},null,{"$f":"IF(J28=\"\",\"\",IF(J28=I28,0,NETWORKDAYS(I28,J28,Feriados!$A$1:$A$442)))","v":""},{"$error":"#VALUE!"},{"$f":"IF(J28<>0,J28,WORKDAY(L28,F28,Feriados!A15:$A$442))","v":{"$error":"#VALUE!"}},{"$f":"IFERROR(IF(J28=\"\",\"\",NETWORKDAYS(L28,M28,Feriados!$A$1:$A$442)),\"\")","v":""},"Não",0,0]
[null,15,"Ajuste do PB pós CONJUR","Demandante",0,0,{"$f":"IF(G28=\"\",\"\",WORKDAY(G28,F29,Feriados!$A$1:$A$442))","v":""},"",{"$f":"IF(H29=\"\",\"\",WORKDAY(H29,F29,Feriados!$A$1:$A$442))","v":""},null,{"$f":"IF(J29=\"\",\"\",IF(J29=I29,0,NETWORKDAYS(I29,J29,Feriados!$A$1:$A$442)))","v":""},{"$error":"#VALUE!"},{"$f":"IF(J29<>0,J29,WORKDAY(L29,F29,Feriados!A22:$A$442))","v":{"$error":"#VALUE!"}},{"$f":"IFERROR(IF(J29=\"\",\"\",NETWORKDAYS(L29,M29,Feriados!$A$1:$A$442)),\"\")","v":""},"Não",0,0]
[null,16,"Adequar Minuta de Contrato ou Congênere","CCONT",0,0,{"$f":"IF(G29=\"\",\"\",WORKDAY(G29,F30,Feriados!$A$1:$A$442))","v":""},"",{"$f":"IF(H30=\"\",\"\",WORKDAY(H30,F30,Feriados!$A$1:$A$442))","v":""},null,{"$f":"IF(J30=\"\",\"\",IF(J30=I30,0,NETWORKDAYS(I30,J30,Feriados!$A$1:$A$442)))","v":""},{"$error":"#VALUE!"},{"$f":"IF(J30<>0,J30,WORKDAY(L30,F30,Feriados!A23:$A$442))","v":{"$error":"#VALUE!"}},{"$f":"IFERROR(IF(J30=\"\",\"\",NETWORKDAYS(L30,M30,Feriados!$A$1:$A$442)),\"\")","v":""},"Não",0,0]
[null,17,"Nota Técnica Final e envio para autorização da Dispensa e Ratificação pelas Autoridades Competentes","COPLI/SECON",2,2,{"$f":"IF(G30=\"\",\"\",WORKDAY(G30,F31,Feriados!$A$1:$A$442))","v":""},"",{"$f":"IF(H31=\"\",\"\",WORKDAY(H31,F31,Feriados!$A$1:$A$442))","v":""},null,{"$f":"IF(J31=\"\",\"\",IF(J31=I31,0,NETWORKDAYS(I31,J31,Feriados!$A$1:$A$442)))","v":""},{"$error":"#VALUE!"},{"$f":"IF(J31<>0,J31,WORKDAY(L31,F31,Feriados!A24:$A$442))","v":{"$error":"#VALUE!"}},{"$f":"IFERROR(IF(J31=\"\",\"\",NETWORKDAYS(L31,M31,Feriados!$A$1:$A$442)),\"\")","v":""},"Não",0,0]
["SELEÇÃO DE FORNECEDOR",18,"Emissão de Autorização da Dispensa pela Autoridade Competente","CGL",2,2,{"$f":"IF(G31=\"\",\"\",WORKDAY(G31,F32,Feriados!$A$1:$A$442))","v":""},"",{"$f":"IF(H32=\"\",\"\",WORKDAY(H32,F32,Feriados!$A$1:$A$442))","v":""},null,{"$f":"IF(J32=\"\",\"\",IF(J32=I32,0,NETWORKDAYS(I32,J32,Feriados!$A$1:$A$442)))","v":""},{"$error":"#VALUE!"},{"$f":"IF(J32<>0,J32,WORKDAY(L32,F32,Feriados!A25:$A$442))","v":{"$error":"#VALUE!"}},{"$f":"IFERROR(IF(J32=\"\",\"\",NETWORKDAYS(L32,M32,Feriados!$A$1:$A$442)),\"\")","v":""},"Não",0,0]
[null,19,"Emissão de Ratificação da Dispensa pela Autoridade Competente","SAA/SE",3,3,{"$f":"IF(G32=\"\",\"\",WORKDAY(G32,F33,Feriados!$A$1:$A$442))","v":""},"",{"$f":"IF(H33=\"\",\"\",WORKDAY(H33,F33,Feriados!$A$1:$A$442))","v":""},null,{"$f":"IF(J33=\"\",\"\",IF(J33=I33,0,NETWORKDAYS(I33,J33,Feriados!$A$1:$A$442)))","v":""},{"$error":"#VALUE!"},{"$f":"IF(J33<>0,J33,WORKDAY(L33,F33,Feriados!A26:$A$442))","v":{"$error":"#VALUE!"}},{"$f":"IFERROR(IF(J33=\"\",\"\",NETWORKDAYS(L33,M33,Feriados!$A$1:$A$442)),\"\")","v":""},"Não",0,0]
[null,20,"Lançamento no Sistema (Publicação)","COPLI/SECON",2,2,{"$f":"IF(G33=\"\",\"\",WORKDAY(G33,F34,Feriados!$A$1:$A$442))","v":""},"",{"$f":"IF(H34=\"\",\"\",WORKDAY(H34,F34,Feriados!$A$1:$A$442))","v":""},null,{"$f":"IF(J34=\"\",\"\",IF(J34=I34,0,NETWORKDAYS(I34,J34,Feriados!$A$1:$A$442)))","v":""},{"$error":"#VALUE!"},{"$f":"IF(J34<>0,J34,WORKDAY(L34,F34,Feriados!A27:$A$442))","v":{"$error":"#VALUE!"}},{"$f":"IFERROR(IF(J34=\"\",\"\",NETWORKDAYS(L34,M34,Feriados!$A$1:$A$442)),\"\")","v":""},"Não",0,0]
["CONTRATAÇÃO",21,"Instrução para Autorização da contratação","CGL",1,1,{"$f":"IF(G34=\"\",\"\",WORKDAY(G34,F35,Feriados!$A$1:$A$442))","v":""},"",{"$f":"IF(H35=\"\",\"\",WORKDAY(H35,F35,Feriados!$A$1:$A$442))","v":""},null,{"$f":"IF(J35=\"\",\"\",IF(J35=I35,0,NETWORKDAYS(I35,J35,Feriados!$A$1:$A$442)))","v":""},{"$error":"#VALUE!"},{"$f":"IF(J35<>0,J35,WORKDAY(L35,F35,Feriados!A28:$A$442))","v":{"$error":"#VALUE!"}},{"$f":"IFERROR(IF(J35=\"\",\"\",NETWORKDAYS(L35,M35,Feriados!$A$1:$A$442)),\"\")","v":""},"Não",0,0]
[null,22,"Autorização da Contratação","Autor. Competente",5,5,{"$f":"IF(G35=\"\",\"\",WORKDAY(G35,F36,Feriados!$A$1:$A$442))","v":""},"",{"$f":"IF(H36=\"\",\"\",WORKDAY(H36,F36,Feriados!$A$1:$A$442))","v":""},null,{"$f":"IF(J36=\"\",\"\",IF(J36=I36,0,NETWORKDAYS(I36,J36,Feriados!$A$1:$A$442)))","v":""},{"$error":"#VALUE!"},{"$f":"IF(J36<>0,J36,WORKDAY(L36,F36,Feriados!A39:$A$442))","v":{"$error":"#VALUE!"}},{"$f":"IFERROR(IF(J36=\"\",\"\",NETWORKDAYS(L36,M36,Feriados!$A$1:$A$442)),\"\")","v":""},"Não",0,0]
[null,23,"Emissão de Empenho ","COEFIN/CGL",1,1,{"$f":"IF(G36=\"\",\"\",WORKDAY(G36,F37,Feriados!$A$1:$A$442))","v":""},"",{"$f":"IF(H37=\"\",\"\",WORKDAY(H37,F37,Feriados!$A$1:$A$442))","v":""},null,{"$f":"IF(J37=\"\",\"\",IF(J37=I37,0,NETWORKDAYS(I37,J37,Feriados!$A$1:$A$442)))","v":""},{"$error":"#VALUE!"},{"$f":"IF(J37<>0,J37,WORKDAY(L37,F37,Feriados!A40:$A$442))","v":{"$error":"#VALUE!"}},{"$f":"IFERROR(IF(J37=\"\",\"\",NETWORKDAYS(L37,M37,Feriados!$A$1:$A$442)),\"\")","v":""},"Não",0,0]
[null,24,"Formalização do Contrato ou Congênere","CCONT/CGL",5,5,{"$f":"IF(G37=\"\",\"\",WORKDAY(G37,F38,Feriados!$A$1:$A$442))","v":""},"",{"$f":"IF(H38=\"\",\"\",WORKDAY(H38,F38,Feriados!$A$1:$A$442))","v":""},null,{"$f":"IF(J38=\"\",\"\",IF(J38=I38,0,NETWORKDAYS(I38,J38,Feriados!$A$1:$A$442)))","v":""},{"$error":"#VALUE!"},{"$f":"IF(J38<>0,J38,WORKDAY(L38,F38,Feriados!A41:$A$442))","v":{"$error":"#VALUE!"}},{"$f":"IFERROR(IF(J38=\"\",\"\",NETWORKDAYS(L38,M38,Feriados!$A$1:$A$442)),\"\")","v":""},"Não",0,0]
[null,null,null,"TOTAL",{"$f":"SUM(E15:E38)","v":62},{"$f":"SUM(F15:F38)","v":62},null,null,null,null,null,null,"TOTAL",{"$f":"SUM(N15:N38)","v":0}]

{"sheet":"DISPENSA SERV - PUOC","index":3,"n_rows":39,"n_cols":17,"rows_kept":39,"cut":false,"hidden":false,"merged":[[1,2,1,8],[1,10,1,16],[2,3,2,8],[2,10,3,10],[2,11,3,11],[2,12,3,12],[2,13,3,13],[2,14,3,14],[2,15,3,15],[2,16,3,16],[12,11,12,13],[12,14,12,16],[13,1,13,2],[3,3,3,8],[4,3,4,8],[5,3,5,8],[6,3,6,8],[7,3,7,8],[8,3,8,8],[14,0,23,0],[24,0,30,0],[31,0,33,0],[34,0,37,0],[10,2,10,8],[12,4,13,4],[12,5,12,6],[12,7,12,10]]}
[]
[null,null,"DADOS BÁSICOS DA CONTRATAÇÃO",null,null,null,null,null,null,null,"QUADRO RESUMO DE ACOMPANHAMENTO DO PROCESSO DE CONTRATAÇÃO"]
[null,null,"Objeto da Contatação*","XXXXXXXXX",null,null,null,null,null,null,"Data Inicial Prevista","Data Término Prevista","TMPL Padrão","TMPL Previsto","Data Término Atualizado","TMPL Efetivo","Dias para Conclusão"]
[null,null,"Tipo de Objeto*","SERVIÇOS"]
[null,null,"Modalidade Licitatória*","DISPENSA POR VALOR - SERVIÇOS (Art. 24, I e II da Lei 8.666/93)",null,null,null,null,null,null,{"$f":"IF(H15=\"\",\"\",H15)","v":""},{"$f":"I38","v":""},{"$f":"E39","v":72},{"$f":"F39","v":72},{"$f":"M38","v":{"$error":"#VALUE!"}},{"$f":"SUMIF(N15:N38,\"<>0\")+SUMIFS(F15:F38,N15:N38,\"\")","v":72},{"$f":"IF(H15=\"\",\"\",NETWORKDAYS(TODAY(),M38,Feriados!$A$1:$A$442))","v":""}]
[null,null,"Fluxo da Instrução Processual*","PRAZO URGENTE/OBJETO COMPLEXO"]
[null,null,"Valor da Contratação*","XXXXXXXXX"]
[null,null,"Nº do Processo*","XXXXXXXXX"]
[null,null,"Atende quais itens do PAC*","XXXXXXXXX"]
[null,null,"EVOLUÇÃO DA CONTRATAÇÃO"]
[null,null,{"$f":"SUM(Q15:Q104)/SUM(E15:E104)","v":0}]
[null,null,"* preenchimento obrigatório"]
[null,null,null,null,"Tempo médio padrão","1° Pactuação",null,"ACOMPANHAMENTO DOS PRAZOS PACTUADOS ",null,null,null,"PREVISTO/REALIZADO",null,null,"STATUS"]
["Etapas","Atividade",null,"Setor",null,"Dias","Datas Pactuadas","Data Início","Data Término","Realizado","Dias Adiantado/\nAtrasado (Processo)","Data Início","Data Término","Dias Efetivos","Concluído","%","Dias"]
["PLANEJAMENTO DA CONTRATAÇÃO",1,"Confecção do DFD/DOD","Demandante",3,3,{"$f":"I15","v":""},null,{"$f":"IF(H15=\"\",\"\",WORKDAY(H15,F15,Feriados!$A$1:$A$442))","v":""},null,{"$f":"IF(J15=\"\",\"\",IF(J15=I15,0,NETWORKDAYS(I15,J15,Feriados!$A$1:$A$442)))","v":""},{"$f":"IF(H15=\"\",G15,H15)","v":""},{"$f":"IF(J15<>0,J15,WORKDAY(L15,F15,Feriados!A1:$A$442))","v":{"$error":"#VALUE!"}},{"$f":"IFERROR(IF(J15=\"\",\"\",NETWORKDAYS(L15,M15,Feriados!$A$1:$A$442)),\"\")","v":""},{"$f":"IF(J15<>0,\"Sim\",\"Não\")","v":"Não"},{"$f":"IF(O15=\"Sim\",100%,IF(O15=\"Não\",0%,\"\"))","v":0},{"$f":"E15*P15","v":0}]
[null,2,"Pactuação do Cronograma da Contratação","CGL/EPC",2,2,{"$f":"IF(G15=\"\",\"\",WORKDAY(G15,F16,Feriados!$A$1:$A$442))","v":""},{"$f":"IF(I15=\"\",\"\",I15)","v":""},{"$f":"IF(H16=\"\",\"\",WORKDAY(H16,F16,Feriados!$A$1:$A$442))","v":""},null,{"$f":"IF(J16=\"\",\"\",IF(J16=I16,0,NETWORKDAYS(I16,J16,Feriados!$A$1:$A$442)))","v":""},{"$f":"IF(M15=\"\",H16,M15)","v":{"$error":"#VALUE!"}},{"$f":"IF(J16<>0,J16,WORKDAY(L16,F16,Feriados!A2:$A$442))","v":{"$error":"#VALUE!"}},{"$f":"IFERROR(IF(J16=\"\",\"\",NETWORKDAYS(L16,M16,Feriados!$A$1:$A$442)),\"\")","v":""},{"$f":"IF(J16<>0,\"Sim\",\"Não\")","v":"Não"},{"$f":"IF(O16=\"Sim\",100%,IF(O16=\"Não\",0%,\"\"))","v":0},{"$f":"E16*P16","v":0}]
[null,3,"Aprovação do Cronograma da Contratação","SAA/SE",2,2,{"$f":"IF(G16=\"\",\"\",WORKDAY(G16,F17,Feriados!$A$1:$A$442))","v":""},{"$f":"IF(I16=\"\",\"\",I16)","v":""},{"$f":"IF(H17=\"\",\"\",WORKDAY(H17,F17,Feriados!$A$1:$A$442))","v":""},null,{"$f":"IF(J17=\"\",\"\",IF(J17=I17,0,NETWORKDAYS(I17,J17,Feriados!$A$1:$A$442)))","v":""},{"$f":"IF(M16=\"\",H17,M16)","v":{"$error":"#VALUE!"}},{"$f":"IF(J17<>0,J17,WORKDAY(L17,F17,Feriados!A3:$A$442))","v":{"$error":"#VALUE!"}},{"$f":"IFERROR(IF(J17=\"\",\"\",NETWORKDAYS(L17,M17,Feriados!$A$1:$A$442)),\"\")","v":""},"Não",0,0]
[null,7,"Confecção do Projeto Básico - PB","Demandante",15,{"$f":"E18","v":15},{"$f":"IF(G17=\"\",\"\",WORKDAY(G17,F18,Feriados!$A$1:$A$442))","v":""},{"$f":"IF(I17=\"\",\"\",I17)","v":""},{"$f":"IF(H18=\"\",\"\",WORKDAY(H18,F18,Feriados!$A$1:$A$442))","v":""},null,{"$f":"IF(J18=\"\",\"\",IF(J18=I18,0,NETWORKDAYS(I18,J18,Feriados!$A$1:$A$442)))","v":""},{"$f":"IF(M17=\"\",H18,M17)","v":{"$error":"#VALUE!"}},{"$f":"IF(J18<>0,J18,WORKDAY(L18,F18,Feriados!A4:$A$442))","v":{"$error":"#VALUE!"}},{"$f":"IFERROR(IF(J18=\"\",\"\",NETWORKDAYS(L18,M18,Feriados!$A$1:$A$442)),\"\")","v":""},{"$f":"IF(J18<>0,\"Sim\",\"Não\")","v":"Não"},{"$f":"IF(O18=\"Sim\",100%,IF(O18=\"Não\",0%,\"\"))","v":0},{"$f":"E18*P18","v":0}]
[null,8,"Realização da Pesquisa de Preços ","Demandante",10,10,{"$f":"IF(G18=\"\",\"\",WORKDAY(G18,F19,Feriados!$A$1:$A$442))","v":""},"",{"$f":"IF(H19=\"\",\"\",WORKDAY(H19,F19,Feriados!$A$1:$A$442))","v":""},null,{"$f":"IF(J19=\"\",\"\",IF(J19=I19,0,NETWORKDAYS(I19,J19,Feriados!$A$1:$A$442)))","v":""},{"$error":"#VALUE!"},{"$f":"IF(J19<>0,J19,WORKDAY(L19,F19,Feriados!A5:$A$442))","v":{"$error":"#VALUE!"}},{"$f":"IFERROR(IF(J19=\"\",\"\",NETWORKDAYS(L19,M19,Feriados!$A$1:$A$442)),\"\")","v":""},"Não",0,0]
[null,9,"Análise do PB e Pesquisa de Preços","CGL (COPLI/CCONT/COEFIN)",3,3,{"$f":"IF(G19=\"\",\"\",WORKDAY(G19,F20,Feriados!$A$1:$A$442))","v":""},"",{"$f":"IF(H20=\"\",\"\",WORKDAY(H20,F20,Feriados!$A$1:$A$442))","v":""},null,{"$f":"IF(J20=\"\",\"\",IF(J20=I20,0,NETWORKDAYS(I20,J20,Feriados!$A$1:$A$442)))","v":""},{"$error":"#VALUE!"},{"$f":"IF(J20<>0,J20,WORKDAY(L20,F20,Feriados!A6:$A$442))","v":{"$error":"#VALUE!"}},{"$f":"IFERROR(IF(J20=\"\",\"\",NETWORKDAYS(L20,M20,Feriados!$A$1:$A$442)),\"\")","v":""},"Não",0,0]
[null,10,"Compilação e envio a Demandante","CGL",2,2,{"$f":"IF(G20=\"\",\"\",WORKDAY(G20,F21,Feriados!$A$1:$A$442))","v":""},"",{"$f":"IF(H21=\"\",\"\",WORKDAY(H21,F21,Feriados!$A$1:$A$442))","v":""},null,{"$f":"IF(J21=\"\",\"\",IF(J21=I21,0,NETWORKDAYS(I21,J21,Feriados!$A$1:$A$442)))","v":""},{"$error":"#VALUE!"},{"$f":"IF(J21<>0,J21,WORKDAY(L21,F21,Feriados!A7:$A$442))","v":{"$error":"#VALUE!"}},{"$f":"IFERROR(IF(J21=\"\",\"\",NETWORKDAYS(L21,M21,Feriados!$A$1:$A$442)),\"\")","v":""},"Não",0,0]
[null,11,"Retorno do PB ajustado ","Demandante",3,3,{"$f":"IF(G21=\"\",\"\",WORKDAY(G21,F22,Feriados!$A$1:$A$442))","v":""},"",{"$f":"IF(H22=\"\",\"\",WORKDAY(H22,F22,Feriados!$A$1:$A$442))","v":""},null,{"$f":"IF(J22=\"\",\"\",IF(J22=I22,0,NETWORKDAYS(I22,J22,Feriados!$A$1:$A$442)))","v":""},{"$error":"#VALUE!"},{"$f":"IF(J22<>0,J22,WORKDAY(L22,F22,Feriados!A8:$A$442))","v":{"$error":"#VALUE!"}},{"$f":"IFERROR(IF(J22=\"\",\"\",NETWORKDAYS(L22,M22,Feriados!$A$1:$A$442)),\"\")","v":""},"Não",0,0]
[null,12,"Conformidade de Pesquisa de Preços","SCPP/COPLI/CGL",3,3,{"$f":"IF(G22=\"\",\"\",WORKDAY(G22,F23,Feriados!$A$1:$A$442))","v":""},"",{"$f":"IF(H23=\"\",\"\",WORKDAY(H23,F23,Feriados!$A$1:$A$442))","v":""},null,{"$f":"IF(J23=\"\",\"\",IF(J23=I23,0,NETWORKDAYS(I23,J23,Feriados!$A$1:$A$442)))","v":""},{"$error":"#VALUE!"},{"$f":"IF(J23<>0,J23,WORKDAY(L23,F23,Feriados!A9:$A$442))","v":{"$error":"#VALUE!"}},{"$f":"IFERROR(IF(J23=\"\",\"\",NETWORKDAYS(L23,M23,Feriados!$A$1:$A$442)),\"\")","v":""},"Não",0,0]
[null,13,"DDO","COEFIN/CGL",2,2,{"$f":"IF(G23=\"\",\"\",WORKDAY(G23,F24,Feriados!$A$1:$A$442))","v":""},"",{"$f":"IF(H24=\"\",\"\",WORKDAY(H24,F24,Feriados!$A$1:$A$442))","v":""},null,{"$f":"IF(J24=\"\",\"\",IF(J24=I24,0,NETWORKDAYS(I24,J24,Feriados!$A$1:$A$442)))","v":""},{"$error":"#VALUE!"},{"$f":"IF(J24<>0,J24,WORKDAY(L24,F24,Feriados!A10:$A$442))","v":{"$error":"#VALUE!"}},{"$f":"IFERROR(IF(J24=\"\",\"\",NETWORKDAYS(L24,M24,Feriados!$A$1:$A$442)),\"\")","v":""},"Não",0,0]
["INSTRUMENTO DE CONTRATAÇÃO E ANÁLISE JURÍDICA",14,"Minuta Contrato ou Congênere / Nota Técnica de validação da instrução processual","CCONT/ COPLI / CGL",5,5,{"$f":"IF(G24=\"\",\"\",WORKDAY(G24,F25,Feriados!$A$1:$A$442))","v":""},{"$f":"IF(I24=\"\",\"\",I24)","v":""},{"$f":"IF(H25=\"\",\"\",WORKDAY(H25,F25,Feriados!$A$1:$A$442))","v":""},null,{"$f":"IF(J25=\"\",\"\",IF(J25=I25,0,NETWORKDAYS(I25,J25,Feriados!$A$1:$A$442)))","v":""},{"$f":"IF(M24=\"\",H25,M24)","v":{"$error":"#VALUE!"}},{"$f":"IF(J25<>0,J25,WORKDAY(L25,F25,Feriados!A12:$A$442))","v":{"$error":"#VALUE!"}},{"$f":"IFERROR(IF(J25=\"\",\"\",NETWORKDAYS(L25,M25,Feriados!$A$1:$A$442)),\"\")","v":""},{"$f":"IF(J25<>0,\"Sim\",\"Não\")","v":"Não"},{"$f":"IF(O25=\"Sim\",100%,IF(O25=\"Não\",0%,\"\"))","v":0},{"$f":"E25*P25","v":0}]
[null,15,"Compilação e envio para Jurídica","CGL",0,0,{"$f":"IF(G25=\"\",\"\",WORKDAY(G25,F26,Feriados!$A$1:$A$442))","v":""},"",{"$f":"IF(H26=\"\",\"\",WORKDAY(H26,F26,Feriados!$A$1:$A$442))","v":""},null,{"$f":"IF(J26=\"\",\"\",IF(J26=I26,0,NETWORKDAYS(I26,J26,Feriados!$A$1:$A$442)))","v":""},{"$error":"#VALUE!"},{"$f":"IF(J26<>0,J26,WORKDAY(L26,F26,Feriados!A13:$A$442))","v":{"$error":"#VALUE!"}},{"$f":"IFERROR(IF(J26=\"\",\"\",NETWORKDAYS(L26,M26,Feriados!$A$1:$A$442)),\"\")","v":""},"Não",0,0]
[null,16,"Análise CONJUR -CJ","CONJUR",0,0,{"$f":"IF(G26=\"\",\"\",WORKDAY(G26,F27,Feriados!$A$1:$A$442))","v":""},"",{"$f":"IF(H27=\"\",\"\",WORKDAY(H27,F27,Feriados!$A$1:$A$442))","v":""},null,{"$f":"IF(J27=\"\",\"\",IF(J27=I27,0,NETWORKDAYS(I27,J27,Feriados!$A$1:$A$442)))","v":""},{"$error":"#VALUE!"},{"$f":"IF(J27<>0,J27,WORKDAY(L27,F27,Feriados!A14:$A$442))","v":{"$error":"#VALUE!"}},{"$f":"IFERROR(IF(J27=\"\",\"\",NETWORKDAYS(L27,M27,Feriados!$A$1:$A$442)),\"\")","v":""},"Não",0,0]
[null,17,"Envio para atendimento das recomendações da CONJUR","CGL",0,0,{"$f":"IF(G27=\"\",\"\",WORKDAY(G27,F28,Feriados!$A$1:$A$442))","v":""},"",{"$f":"IF(H28=\"\",\"\",WORKDAY(H28,F28,Feriados!$A$1:$A$442))","v":""},null,{"$f":"IF(J28=\"\",\"\",IF(J28=I28,0,NETWORKDAYS(I28,J28,Feriados!$A$1:$A$442)))","v":""},{"$error":"#VALUE!"},{"$f":"IF(J28<>0,J28,WORKDAY(L28,F28,Feriados!A15:$A$442))","v":{"$error":"#VALUE!"}},{"$f":"IFERROR(IF(J28=\"\",\"\",NETWORKDAYS(L28,M28,Feriados!$A$1:$A$442)),\"\")","v":""},"Não",0,0]
[null,18,"Ajuste do PB em atendimento as recomendações da CONJUR","Demandante",0,0,{"$f":"IF(G28=\"\",\"\",WORKDAY(G28,F29,Feriados!$A$1:$A$442))","v":""},"",{"$f":"IF(H29=\"\",\"\",WORKDAY(H29,F29,Feriados!$A$1:$A$442))","v":""},null,{"$f":"IF(J29=\"\",\"\",IF(J29=I29,0,NETWORKDAYS(I29,J29,Feriados!$A$1:$A$442)))","v":""},{"$error":"#VALUE!"},{"$f":"IF(J29<>0,J29,WORKDAY(L29,F29,Feriados!A22:$A$442))","v":{"$error":"#VALUE!"}},{"$f":"IFERROR(IF(J29=\"\",\"\",NETWORKDAYS(L29,M29,Feriados!$A$1:$A$442)),\"\")","v":""},"Não",0,0]
[null,19,"Adequar Minuta de Contrato ou Congênere, se necessário","CCONT",0,0,{"$f":"IF(G29=\"\",\"\",WORKDAY(G29,F30,Feriados!$A$1:$A$442))","v":""},"",{"$f":"IF(H30=\"\",\"\",WORKDAY(H30,F30,Feriados!$A$1:$A$442))","v":""},null,{"$f":"IF(J30=\"\",\"\",IF(J30=I30,0,NETWORKDAYS(I30,J30,Feriados!$A$1:$A$442)))","v":""},{"$error":"#VALUE!"},{"$f":"IF(J30<>0,J30,WORKDAY(L30,F30,Feriados!A23:$A$442))","v":{"$error":"#VALUE!"}},{"$f":"IFERROR(IF(J30=\"\",\"\",NETWORKDAYS(L30,M30,Feriados!$A$1:$A$442)),\"\")","v":""},"Não",0,0]
[null,20,"Nota Técnica Final e envio para autorização da Dispensa e Ratificação pelas Autoridades Competentes","COPLI/SECON",2,2,{"$f":"IF(G30=\"\",\"\",WORKDAY(G30,F31,Feriados!$A$1:$A$442))","v":""},"",{"$f":"IF(H31=\"\",\"\",WORKDAY(H31,F31,Feriados!$A$1:$A$442))","v":""},null,{"$f":"IF(J31=\"\",\"\",IF(J31=I31,0,NETWORKDAYS(I31,J31,Feriados!$A$1:$A$442)))","v":""},{"$error":"#VALUE!"},{"$f":"IF(J31<>0,J31,WORKDAY(L31,F31,Feriados!A24:$A$442))","v":{"$error":"#VALUE!"}},{"$f":"IFERROR(IF(J31=\"\",\"\",NETWORKDAYS(L31,M31,Feriados!$A$1:$A$442)),\"\")","v":""},"Não",0,0]
["SELEÇÃO DE FORNECEDOR",21,"Emissão de Autorização da Dispensa pela Autoridade Competente","CGL",2,2,{"$f":"IF(G31=\"\",\"\",WORKDAY(G31,F32,Feriados!$A$1:$A$442))","v":""},"",{"$f":"IF(H32=\"\",\"\",WORKDAY(H32,F32,Feriados!$A$1:$A$442))","v":""},null,{"$f":"IF(J32=\"\",\"\",IF(J32=I32,0,NETWORKDAYS(I32,J32,Feriados!$A$1:$A$442)))","v":""},{"$error":"#VALUE!"},{"$f":"IF(J32<>0,J32,WORKDAY(L32,F32,Feriados!A25:$A$442))","v":{"$error":"#VALUE!"}},{"$f":"IFERROR(IF(J32=\"\",\"\",NETWORKDAYS(L32,M32,Feriados!$A$1:$A$442)),\"\")","v":""},"Não",0,0]
[null,22,"Emissão de Ratificação da Dispensa pela Autoridade Competente","SAA/SE",3,3,{"$f":"IF(G32=\"\",\"\",WORKDAY(G32,F33,Feriados!$A$1:$A$442))","v":""},"",{"$f":"IF(H33=\"\",\"\",WORKDAY(H33,F33,Feriados!$A$1:$A$442))","v":""},null,{"$f":"IF(J33=\"\",\"\",IF(J33=I33,0,NETWORKDAYS(I33,J33,Feriados!$A$1:$A$442)))","v":""},{"$error":"#VALUE!"},{"$f":"IF(J33<>0,J33,WORKDAY(L33,F33,Feriados!A26:$A$442))","v":{"$error":"#VALUE!"}},{"$f":"IFERROR(IF(J33=\"\",\"\",NETWORKDAYS(L33,M33,Feriados!$A$1:$A$442)),\"\")","v":""},"Não",0,0]
[null,23,"Lançamento no Sistema (Publicação)","COPLI/SECON",2,2,{"$f":"IF(G33=\"\",\"\",WORKDAY(G33,F34,Feriados!$A$1:$A$442))","v":""},"",{"$f":"IF(H34=\"\",\"\",WORKDAY(H34,F34,Feriados!$A$1:$A$442))","v":""},null,{"$f":"IF(J34=\"\",\"\",IF(J34=I34,0,NETWORKDAYS(I34,J34,Feriados!$A$1:$A$442)))","v":""},{"$error":"#VALUE!"},{"$f":"IF(J34<>0,J34,WORKDAY(L34,F34,Feriados!A27:$A$442))","v":{"$error":"#VALUE!"}},{"$f":"IFERROR(IF(J34=\"\",\"\",NETWORKDAYS(L34,M34,Feriados!$A$1:$A$442)),\"\")","v":""},"Não",0,0]
["CONTRATAÇÃO",24,"Instrução para Autorização da Contratação, destacando atendimento das recomendações da CONJUR e Controle Interno, se for o caso.","CGL",1,1,{"$f":"IF(G34=\"\",\"\",WORKDAY(G34,F35,Feriados!$A$1:$A$442))","v":""},{"$f":"IF(I34=\"\",\"\",I34)","v":""},{"$f":"IF(H35=\"\",\"\",WORKDAY(H35,F35,Feriados!$A$1:$A$442))","v":""},null,{"$f":"IF(J35=\"\",\"\",IF(J35=I35,0,NETWORKDAYS(I35,J35,Feriados!$A$1:$A$442)))","v":""},{"$f":"IF(M34=\"\",H35,M34)","v":{"$error":"#VALUE!"}},{"$f":"IF(J35<>0,J35,WORKDAY(L35,F35,Feriados!A28:$A$442))","v":{"$error":"#VALUE!"}},{"$f":"IFERROR(IF(J35=\"\",\"\",NETWORKDAYS(L35,M35,Feriados!$A$1:$A$442)),\"\")","v":""},{"$f":"IF(J35<>0,\"Sim\",\"Não\")","v":"Não"},{"$f":"IF(O35=\"Sim\",100%,IF(O35=\"Não\",0%,\"\"))","v":0},{"$f":"E35*P35","v":0}]
[null,25,"Autorização da Despesa da Contratação pela Autoridade Competente (SAA/SE/GM)","Autor. Competente",5,5,{"$f":"IF(G35=\"\",\"\",WORKDAY(G35,F36,Feriados!$A$1:$A$442))","v":""},"",{"$f":"IF(H36=\"\",\"\",WORKDAY(H36,F36,Feriados!$A$1:$A$442))","v":""},null,{"$f":"IF(J36=\"\",\"\",IF(J36=I36,0,NETWORKDAYS(I36,J36,Feriados!$A$1:$A$442)))","v":""},{"$error":"#VALUE!"},{"$f":"IF(J36<>0,J36,WORKDAY(L36,F36,Feriados!A39:$A$442))","v":{"$error":"#VALUE!"}},{"$f":"IFERROR(IF(J36=\"\",\"\",NETWORKDAYS(L36,M36,Feriados!$A$1:$A$442)),\"\")","v":""},"Não",0,0]
[null,26,"Emissão de Empenho ","COEFIN/CGL",2,2,{"$f":"IF(G36=\"\",\"\",WORKDAY(G36,F37,Feriados!$A$1:$A$442))","v":""},"",{"$f":"IF(H37=\"\",\"\",WORKDAY(H37,F37,Feriados!$A$1:$A$442))","v":""},null,{"$f":"IF(J37=\"\",\"\",IF(J37=I37,0,NETWORKDAYS(I37,J37,Feriados!$A$1:$A$442)))","v":""},{"$error":"#VALUE!"},{"$f":"IF(J37<>0,J37,WORKDAY(L37,F37,Feriados!A40:$A$442))","v":{"$error":"#VALUE!"}},{"$f":"IFERROR(IF(J37=\"\",\"\",NETWORKDAYS(L37,M37,Feriados!$A$1:$A$442)),\"\")","v":""},"Não",0,0]
[null,27,"Formalização do Contrato ou Congênere","CCONT/CGL",5,5,{"$f":"IF(G37=\"\",\"\",WORKDAY(G37,F38,Feriados!$A$1:$A$442))","v":""},"",{"$f":"IF(H38=\"\",\"\",WORKDAY(H38,F38,Feriados!$A$1:$A$442))","v":""},null,{"$f":"IF(J38=\"\",\"\",IF(J38=I38,0,NETWORKDAYS(I38,J38,Feriados!$A$1:$A$442)))","v":""},{"$error":"#VALUE!"},{"$f":"IF(J38<>0,J38,WORKDAY(L38,F38,Feriados!A41:$A$442))","v":{"$error":"#VALUE!"}},{"$f":"IFERROR(IF(J38=\"\",\"\",NETWORKDAYS(L38,M38,Feriados!$A$1:$A$442)),\"\")","v":""},"Não",0,0]
[null,null,null,"TOTAL",{"$f":"SUM(E15:E38)","v":72},{"$f":"SUM(F15:F38)","v":72},null,null,null,null,null,null,"TOTAL",{"$f":"SUM(N15:N38)","v":0}]

{"sheet":"Listas","index":4,"n_rows":15,"n_cols":9,"rows_kept":15,"cut":false,"hidden":true,"merged":[]}
[null,null,null,null,null,null,"INDIVIDUAL","PREGÃO ELETRÔNICO ","PRAZO NORMAL/OBJETO SIMPLES"]
[null,null,null,null,null,null,"ATENDE VARIOS ITENS DO PAC","PREGÃO ELETRÔNICO SRP","PRAZO NORMAL/OBJETO COMPLEXO"]
[null,null,null,null,null,null,"COMPARTILHADA","PREGÃO ELETRÔNICO SRP - ADESÃO","PRAZO URGENTE/OBJETO SIMPLES"]
[null,null,null,null,null,null,null,"PREGÃO ELETRÔNICO SRP - PARTICIPE","PRAZO URGENTE/OBJETO COMPLEXO"]
[null,null,null,null,null,null,null,"CONCORRÊNCIA "]
[null,null,null,null,null,null,null,"CONCORRÊNCIA SRP"]
[null,null,null,null,null,null,null,"CONVITE"]
[null,null,null,null,null,null,null,"TOMADA DE PREÇOS"]
[null,null,null,null,null,null,null,"LEILÃO"]
[null,null,null,null,null,null,null,"RDC"]
[null,null,null,null,null,null,null,"CREDENCIAMENTO"]
[null,null,null,null,null,null,null,"INEXIGIBILIDADE DE LICITAÇÃO"]
[null,null,null,null,null,null,null,"DISPENSA POR VALOR - SERVIÇOS (Art. 24, I e II da Lei 8.666/93)"]
[null,null,null,null,null,null,null,"DISPENSA POR VALOR - AQUISIÇÃO  (Art. 24, I e II da Lei 8.666/93)"]
[null,null,null,null,null,null,null,"DISPENSA DEMAIS CASOS (Art. 24, inc. III e seguintes da Lei nº 8.666/93)"]

{"sheet":"Feriados","index":5,"n_rows":442,"n_cols":1,"rows_kept":442,"cut":false,"hidden":true,"merged":[]}
["2019-01-01"]
["2019-03-04"]
["2019-03-05"]
["2019-04-19"]
["2019-04-21"]
["2019-04-21"]
["2019-05-01"]
["2019-06-20"]
["2019-09-07"]
["2019-10-12"]
["2019-11-02"]
["2019-11-15"]
["2019-12-25"]
["2020-01-01"]
["2020-02-24"]
["2020-02-25"]
["2020-04-10"]
["2020-04-21"]
["2020-04-12"]
["2020-05-01"]
["2020-06-11"]
["2020-09-07"]
["2020-10-12"]
["2020-11-02"]
["2020-11-15"]
["2020-12-25"]
["2021-01-01"]
["2021-02-15"]
["2021-02-16"]
["2021-04-02"]
["2021-04-21"]
["2021-04-04"]
["2021-05-01"]
["2021-06-03"]
["2021-09-07"]
["2021-10-12"]
["2021-11-02"]
["2021-11-15"]
["2021-12-25"]
["2022-01-01"]
["2022-02-28"]
["2022-03-01"]
["2022-04-15"]
["2022-04-21"]
["2022-04-17"]
["2022-05-01"]
["2022-06-16"]
["2022-09-07"]
["2022-10-12"]
["2022-11-02"]
["2022-11-15"]
["2022-12-25"]
["2023-01-01"]
["2023-02-20"]
["2023-02-21"]
["2023-04-07"]
["2023-04-21"]
["2023-04-09"]
["2023-05-01"]
["2023-06-08"]
["2023-09-07"]
["2023-10-12"]
["2023-11-02"]
["2023-11-15"]
["2023-12-25"]
["2024-01-01"]
["2024-02-12"]
["2024-02-13"]
["2024-03-29"]
["2024-04-21"]
["2024-03-31"]
["2024-05-01"]
["2024-05-30"]
["2024-09-07"]
["2024-10-12"]
["2024-11-02"]
["2024-11-15"]
["2024-12-25"]
["2025-01-01"]
["2025-03-03"]
["2025-03-04"]
["2025-04-18"]
["2025-04-21"]
["2025-04-20"]
["2025-05-01"]
["2025-06-19"]
["2025-09-07"]
["2025-10-12"]
["2025-11-02"]
["2025-11-15"]
["2025-12-25"]
["2026-01-01"]
["2026-02-16"]
["2026-02-17"]
["2026-04-03"]
["2026-04-21"]
["2026-04-05"]
["2026-05-01"]
["2026-06-04"]
["2026-09-07"]
["2026-10-12"]
["2026-11-02"]
["2026-11-15"]
["2026-12-25"]
["2027-01-01"]
["2027-02-08"]
["2027-02-09"]
["2027-03-26"]
["2027-04-21"]
["2027-03-28"]
["2027-05-01"]
["2027-05-27"]
["2027-09-07"]
["2027-10-12"]
["2027-11-02"]
["2027-11-15"]
["2027-12-25"]
["2028-01-01"]
["2028-02-28"]
["2028-02-29"]
["2028-04-14"]
["2028-04-21"]
["2028-04-16"]
["2028-05-01"]
["2028-06-15"]
["2028-09-07"]
["2028-10-12"]
["2028-11-02"]
["2028-11-15"]
["2028-12-25"]
["2029-01-01"]
["2029-02-12"]
["2029-02-13"]
["2029-03-30"]
["2029-04-21"]
["2029-04-01"]
["2029-05-01"]
["2029-05-31"]
["2029-09-07"]
["2029-10-12"]
["2029-11-02"]
["2029-11-15"]
["2029-12-25"]
["2030-01-01"]
["2030-03-04"]
["2030-03-05"]
["2030-04-19"]
["2030-04-21"]
["2030-04-21"]
["2030-05-01"]
["2030-06-20"]
["2030-09-07"]
["2030-10-12"]
["2030-11-02"]
["2030-11-15"]
["2030-12-25"]
["2031-01-01"]
["2031-02-24"]
["2031-02-25"]
["2031-04-11"]
["2031-04-21"]
["2031-04-13"]
["2031-05-01"]
["2031-06-12"]
["2031-09-07"]
["2031-10-12"]
["2031-11-02"]
["2031-11-15"]
["2031-12-25"]
["2032-01-01"]
["2032-02-09"]
["2032-02-10"]
["2032-03-26"]
["2032-04-21"]
["2032-03-28"]
["2032-05-01"]
["2032-05-27"]
["2032-09-07"]
["2032-10-12"]
["2032-11-02"]
["2032-11-15"]
["2032-12-25"]
["2033-01-01"]
["2033-02-28"]
["2033-03-01"]
["2033-04-15"]
["2033-04-21"]
["2033-04-17"]
["2033-05-01"]
["2033-06-16"]
["2033-09-07"]
["2033-10-12"]
["2033-11-02"]
["2033-11-15"]
["2033-12-25"]
["2034-01-01"]
["2034-02-20"]
["2034-02-21"]
["2034-04-07"]
["2034-04-21"]
["2034-04-09"]
["2034-05-01"]
["2034-06-08"]
["2034-09-07"]
["2034-10-12"]
["2034-11-02"]
["2034-11-15"]
["2034-12-25"]
["2035-01-01"]
["2035-02-05"]
["2035-02-06"]
["2035-03-23"]
["2035-04-21"]
["2035-03-25"]
["2035-05-01"]
["2035-05-24"]
["2035-09-07"]
["2035-10-12"]
["2035-11-02"]
["2035-11-15"]
["2035-12-25"]
["2036-01-01"]
["2036-02-25"]
["2036-02-26"]
["2036-04-11"]
["2036-04-21"]
["2036-04-13"]
["2036-05-01"]
["2036-06-12"]
["2036-09-07"]
["2036-10-12"]
["2036-11-02"]
["2036-11-15"]
["2036-12-25"]
["2037-01-01"]
["2037-02-16"]
["2037-02-17"]
["2037-04-03"]
["2037-04-21"]
["2037-04-05"]
["2037-05-01"]
["2037-06-04"]
["2037-09-07"]
["2037-10-12"]
["2037-11-02"]
["2037-11-15"]
["2037-12-25"]
["2038-01-01"]
["2038-03-08"]
["2038-03-09"]
["2038-04-23"]
["2038-04-21"]
["2038-04-25"]
["2038-05-01"]
["2038-06-24"]
["2038-09-07"]
["2038-10-12"]
["2038-11-02"]
["2038-11-15"]
["2038-12-25"]
["2039-01-01"]
["2039-02-21"]
["2039-02-22"]
["2039-04-08"]
["2039-04-21"]
["2039-04-10"]
["2039-05-01"]
["2039-06-09"]
["2039-09-07"]
["2039-10-12"]
["2039-11-02"]
["2039-11-15"]
["2039-12-25"]
["2040-01-01"]
["2040-02-13"]
["2040-02-14"]
["2040-03-30"]
["2040-04-21"]
["2040-04-01"]
["2040-05-01"]
["2040-05-31"]
["2040-09-07"]
["2040-10-12"]
["2040-11-02"]
["2040-11-15"]
["2040-12-25"]
["2041-01-01"]
["2041-03-04"]
["2041-03-05"]
["2041-04-19"]
["2041-04-21"]
["2041-04-21"]
["2041-05-01"]
["2041-06-20"]
["2041-09-07"]
["2041-10-12"]
["2041-11-02"]
["2041-11-15"]
["2041-12-25"]
["2042-01-01"]
["2042-02-17"]
["2042-02-18"]
["2042-04-04"]
["2042-04-21"]
["2042-04-06"]
["2042-05-01"]
["2042-06-05"]
["2042-09-07"]
["2042-10-12"]
["2042-11-02"]
["2042-11-15"]
["2042-12-25"]
["2043-01-01"]
["2043-02-09"]
["2043-02-10"]
["2043-03-27"]
["2043-04-21"]
["2043-03-29"]
["2043-05-01"]
["2043-05-28"]
["2043-09-07"]
["2043-10-12"]
["2043-11-02"]
["2043-11-15"]
["2043-12-25"]
["2044-01-01"]
["2044-02-29"]
["2044-03-01"]
["2044-04-15"]
["2044-04-21"]
["2044-04-17"]
["2044-05-01"]
["2044-06-16"]
["2044-09-07"]
["2044-10-12"]
["2044-11-02"]
["2044-11-15"]
["2044-12-25"]
["2045-01-01"]
["2045-02-20"]
["2045-02-21"]
["2045-04-07"]
["2045-04-21"]
["2045-04-09"]
["2045-05-01"]
["2045-06-08"]
["2045-09-07"]
["2045-10-12"]
["2045-11-02"]
["2045-11-15"]
["2045-12-25"]
["2046-01-01"]
["2046-02-05"]
["2046-02-06"]
["2046-03-23"]
["2046-04-21"]
["2046-03-25"]
["2046-05-01"]
["2046-05-24"]
["2046-09-07"]
["2046-10-12"]
["2046-11-02"]
["2046-11-15"]
["2046-12-25"]
["2047-01-01"]
["2047-02-25"]
["2047-02-26"]
["2047-04-12"]
["2047-04-21"]
["2047-04-14"]
["2047-05-01"]
["2047-06-13"]
["2047-09-07"]
["2047-10-12"]
["2047-11-02"]
["2047-11-15"]
["2047-12-25"]
["2048-01-01"]
["2048-02-17"]
["2048-02-18"]
["2048-04-03"]
["2048-04-21"]
["2048-04-05"]
["2048-05-01"]
["2048-06-04"]
["2048-09-07"]
["2048-10-12"]
["2048-11-02"]
["2048-11-15"]
["2048-12-25"]
["2049-01-01"]
["2049-03-01"]
["2049-03-02"]
["2049-04-16"]
["2049-04-21"]
["2049-04-18"]
["2049-05-01"]
["2049-06-17"]
["2049-09-07"]
["2049-10-12"]
["2049-11-02"]
["2049-11-15"]
["2049-12-25"]
["2050-01-01"]
["2050-02-21"]
["2050-02-22"]
["2050-04-08"]
["2050-04-21"]
["2050-04-10"]
["2050-05-01"]
["2050-06-09"]
["2050-09-07"]
["2050-10-12"]
["2050-11-02"]
["2050-11-15"]
["2050-12-25"]
["2051-01-01"]
["2051-02-13"]
["2051-02-14"]
["2051-03-31"]
["2051-04-21"]
["2051-04-02"]
["2051-05-01"]
["2051-06-01"]
["2051-09-07"]
["2051-10-12"]
["2051-11-02"]
["2051-11-15"]
["2051-12-25"]
["2052-01-01"]
["2052-03-04"]
["2052-03-05"]
["2052-04-19"]
["2052-04-21"]
["2052-04-21"]
["2052-05-01"]
["2052-06-20"]
["2052-09-07"]
["2052-10-12"]
["2052-11-02"]
["2052-11-15"]
["2052-12-25"]