{"text_format":"1","workbook":"xlsx","n_sheets":22,"sheets":["1_Informações e outros","3.2_Entradas","4.1_Circul","4.2.1_Rampas","4.2.2_Escadas","4.2.3_Elevadores","4.2.4_Plataformas","5_Esquadrias","6_Sanitários Acessíveis","6a_Sanitários Coletivos","7.1_Bebedouros","7.2_Balcões","7.3_Assentos","7.4_Telefones","7.5_Interiores","8_Vestiários","9_Bibliotecas","10_Auditórios","11_Restaurantes e copas","12a14_ilum. e Sinaliz.","Conclusão e Resumo","Anexo Fotográfico"],"not_rendered":{"charts":0,"images":0,"macros":1,"external_links":0,"defined_names":56,"comments":20,"pivot_tables":0},"unopened":[],"bounds":{"document_bytes":16777216,"sheet_cells":100000,"rows_first":2000,"rows_last":500,"rows_between":2000,"halvings":0,"cell_chars":16384,"cell_head_chars":4096},"cells_cut":0,"cells_raw":0,"read":"whole","date_system":"1900"}

{"sheet":"1_Informações e outros","index":0,"n_rows":130,"n_cols":14,"rows_kept":130,"cut":false,"hidden":false,"merged":[[16,2,20,2],[128,8,128,10],[129,8,129,10],[86,8,86,10],[104,8,104,10],[105,8,105,10],[118,8,118,10],[119,8,119,10],[107,4,107,6],[16,4,16,6],[88,4,88,6],[30,4,30,6],[71,8,71,10],[77,8,77,10],[78,8,78,10],[85,8,85,10],[10,11,10,13],[10,4,10,8],[22,4,22,10],[0,2,0,13],[14,4,14,6],[12,4,12,6],[18,4,18,6],[20,4,20,6],[14,11,14,13],[12,11,12,13],[16,10,18,10],[4,4,4,10],[6,11,6,13],[6,4,6,8],[8,4,8,8],[12,2,14,2],[22,11,22,12],[50,8,50,10],[62,8,62,10],[63,8,63,10],[70,8,70,10],[40,8,40,10],[41,8,41,10],[49,8,49,10]]}
[null,null,"Ministério da Mulher, da Família e dos Direitos Humanos\nSecretaria Nacional dos Direitos da Pessoa com Deficiência"]
[]
[null,null,"LAUDO / CHECK LIST DE ACESSIBILIDADE PARA AVALIAÇÃO DE CONFORMIDADE ÀS NORMAS DE ACESSIBILIDADE (CONFORME NBR 9050:2020) "]
[]
[null,null,"UNIDADE / ÓRGÃO",null,"MINISTÉRIO DA MULHER, DA FAMÍLIA E DOS DIREITOS HUMANOS",null,null,null,null,null,null,"TOTAL DE PAVTOS",4]
[]
[null,null,"CIDADE",null,"BRASÍLIA",null,null,null,null,null,"ESTADO","DISTRITO FEDERAL"]
[]
[null,null,"RUA / AV",null,"SCS Quadra 9 · Lote C",null,null,null,null,null,"Nº","C","ÁREA TOTAL",9380]
[]
[null,null,"BAIRRO",null,"ASA SUL",null,null,null,null,null,"ANO DE CONSTRUÇÃO",2011]
[]
[null,null,"ATENDE PÚBLICO",null,"SIM",null,null,null,null,null,"DATA HABITE-SE","10 DE NOVEMBRO DE 2011"]
[]
[null,null,null,null,"NÃO",null,null,null,"X",null,"DATA DO LAUDO","30 DE SETEMBRO DE 2022"]
[]
[null,null,"SITUAÇÃO DO IMÓVEL",null,"PRÓPRIO",null,null,null,null,null,"PRÉDIO TOMBADO OU HISTÓRICO","SIM"]
[]
[null,null,null,null,"LOCADO",null,null,null,"X",null,null,"NÃO","X"]
[]
[null,null,null,null,"CEDIDO"]
[]
[null,null,"RESPONSÁVEL PELA ELABORAÇÃO DO LAUDO\n(NOME, FORMAÇÃO (Arq. ou Eng.), CREA / CAU",null,"BRUNO CAETANO DE SOUZA    CAU: A925675",null,null,null,null,null,null,"Nº DA ART OU RRT / DATA DE EMISSÃO",null,"SI12434391I00CT001 30/09/2022"]
[]
[null,null,"Viabilidade de adaptação/implantação de acessibilidade",null,"SIM",null,"NÃO",null,"Não se aplica"]
[]
[null,null,"Há viabilidade técnica para adaptação e implantação de acessibilidade no prédio?",null,"X"]
[]
[null,null," O percurso que une a edificação à via pública, às edificações e aos serviços anexos de uso comum e aos edifícios vizinhos é acessível?",null,"X"]
[]
[null,null,null,null,"\nATENDE NBR9050-2020",null,null,null,"NÃO SE APLICA",null,"OBSERVAÇÕES"]
[]
["Item da NBR9050",null,"1. CALÇADA ou PASSEIO PÚBLICO",null,"SIM",null,"NÃO",null,"Não se aplica",null,"Observações"]
["6.12.3","a)","Possui faixa livre para pedestre com largura mínima de 1,20 m, livre de conflitos de circulação (pedestres x serviço x automóveis)?",null,"X"]
["6.12.2","b)","A inclinação longitudinal acompanha a inclinação das vias lindeiras?",null,"X"]
["6.12.1","c)","Os desníveis entre o lote e o nível da calçada são vencidos sempre no interior do lote ou na faixa de acesso quando existente?",null,"X"]
["4.3.3","d)","Obstáculos aéreos, como marquises, placas, toldos e vegetação estão localizados a uma altura superior a 2,10 m?",null,"X"]
["6.1.1.2","e)","É livre de obstáculos (elementos de mobiliário urbano, como bancos, orelhões, postes, balizadores, canteiros etc.) no piso que comprometam a rota acessível?",null,"X"]
["6.12.1","f)","A inclinação transversal da faixa livre (passeio) é de no máximo 3%?",null,"X"]
[]
[null,null,null,null,"SIM",null,"NÃO",null,"JUSTIFICATIVA"]
[null,null,"NECESSITA PROJETO ?",null,null,null,"X"]
[]
["Item da NBR9050",null,"1.1 QUANTO AO PISO UTILIZADO:",null,"SIM",null,"NÃO",null,"Não se aplica",null,"Observações"]
["6.3.2","a)","É antiderrapante?",null,"X"]
["6.3.2","b)","É contínuo, regular, estável, sem ressaltos ou depressões?",null,"X"]
["5.4.6 e \nNBR 16537 (Seção 6)","c)","Possui piso tátil de alerta onde necessário, próximo a desníveis, portas de acesso à edificação, elementos de mobiliário suspensos, escadas ou rampas, por exemplo?",null,null,null,"X",null,null,null,"Não há piso tátil de alerta para indicação de risco e direção definida, nos locais com mudanças de direção ou opção de percurso e locais de travessia do pedestre. Os locais onde é necessario são nas travessias das faixas de pedestres e saídas das garagens."]
["5.4.6 e \nNBR 16537 (Seção 7)","d)","Possui piso tátil direcional onde necessário (locais amplos e sem referência/balizamento), configurando uma rota acessível e conduzindo à entrada do edifício?",null,null,null,"X",null,null,null,"A sinalização tátil direcional deve ser utilizada contornando o limite de lotes não edificados onde exista descontinuidade da referência edificada. Deve ser implantada sinalização tátil direcional posicionada de acordo com o fluxo de pedestres, marcando as áreas\nde travessia e conduzindo à entrada da edificação. "]
[]
[null,null,null,null,"SIM",null,"NÃO",null,"JUSTIFICATIVA"]
[null,null,"NECESSITA PROJETO ?",null,"X",null,null,null,"Deve ser implantado a rota com piso tátil direcional e de alerta onde necessário, contornando o limite do lote não edificado onde exista descontinuidade da referência edificada. Desníveis, travessias e em mudanças de direção ou opção de percursos nas calçadas, devem ter sinalização tátil."]
[]
["Item da NBR9050",null,"1.2 QUANTO ÀS GUIAS (MEIO-FIO) REBAIXADAS PARA PEDESTRES:",null,"SIM",null,"NÃO",null,"Não se aplica",null,"Observações"]
["6.12.7.1","a)","Na existência de recuo para usar estacionamento de veículos, o mesmo foi feito de maneira a não prejudicar ou interferir na faixa de circulação do pedestre (faixa livre mínima de 1,20 m)?",null,null,null,null,null,"X",null,"Sem existência de recuos para usar estacionamento de veículos."]
["6.12.7.1","b)","Existe guia (meio-fio) rebaixada ou faixa de pedestres elevada?",null,"X",null,null,null,null,null,"A faixa de pedestre elavada esta fora do fluxo de pedetres, deslocada em relação a  guia de rebaixamento."]
["6.12.7.3","c)","O rebaixo de meio-fio está localizado em frente à faixa de pedestres ou nas esquinas onde houver travessia de pedestres?",null,"X"]
["6.14.1.2","d)","Existe rebaixo de meio-fio associado à vaga para embarque e desembarque de pessoa com deficiência garantindo continuidade à rota acessível?",null,"X",null,null,null,null,null,"Existe área para desembarque de pessoa com deficiência, porém não há piso tátil direcional."]
["6.12.7.3","e)","A rampa e as abas laterais têm inclinação máxima de 8,33%?",null,null,null,"X",null,null,null,"As abas laterais do rebaixamento da guia não possuem inclinação de 8,33%."]
["6.12.7.3","f)","A rampa possui largura mínima de 1,50 m?",null,"X",null,null,null,null,null,"A rampa não esta nas dimensões coretas, não deve comprometendo a faixa livre de circulação de no mínimo de 1.20m. "]
["6.12.7.3 e \nNBR16537 (Seção 6)","g)","A rampa é sinalizada com piso tátil de alerta?",null,null,null,"X",null,null,null,"É necessario implantar o piso tátil de alerta para indicar o local de travessia."]
["6.3.2","h)","O piso da rampa é em material antiderrapante?",null,"X"]
[]
[null,null,null,null,"SIM",null,"NÃO",null,"JUSTIFICATIVA"]
[null,null,"NECESSITA PROJETO ?",null,null,null,"X",null,"Deve ser ajustada a rampa garantindo inclinações laterais, a faixa livre com no mínimo 1.20m, e sem interrupção no fluxo de travessia do pedestre. Deve possuir o piso tátil direcional e de alerta. "]
[]
["Item da NBR9050",null,"1.3 QUANTO ÀS GUIAS REBAIXADAS PARA VEÍCULOS E ACESSOS A GARAGENS:",null,"SIM",null,"NÃO",null,"Não se aplica",null,"Observações"]
["6.12.4","a)","Em caso de guia rebaixada para veículo, esta respeita a faixa livre exclusiva de pedestres, deixando essa calçada com inclinação transversal máxima de 3% e sem cortes?",null,"X"]
["6.15","b)","O portão de acesso à garagem, enquanto abre ou fecha, tem seu movimento limitado à faixa de acesso ou ao lote, sem invadir a faixa livre de circulação de pedestres?",null,"X"]
["6.15 e\n5.6.4.2","c)","Portão de acesso à garagem possui sistema de sinalização visual e sonora?",null,null,null,"X",null,null,null,"Pussui sinalização visual, e carece de sinalização sonora."]
[]
[null,null,null,null,"SIM",null,"NÃO",null,"JUSTIFICATIVA"]
[null,null,"NECESSITA PROJETO ?",null,null,null,"X",null,"Instalação de sinalização sonora no portão de acesso a garagem. "]
[]
["Item da NBR9050",null,"1.4 QUANTO ÀS JUNTAS, GRELHAS E TAMPAS DE INSPEÇÃO EM ROTAS ACESSÍVEIS:",null,"SIM",null,"NÃO",null,"Não se aplica",null,"Observações"]
["6.3.5, \n6.3.6 e\n6.3.4.1","a)","Grades, ralos, juntas de dilatação e tampas de inspeção estão niveladas com o piso (admite-se ressalto máximo de 5 mm)?",null,"X"]
["6.3.5,\n6.3.6","b)","Os vãos das grelhas têm distanciamento máximo de 15 mm e o sentido das aberturas é transversal ao deslocamento ou têm formato quadricular/circular quando houver fluxos em mais de um sentido de circulação?",null,null,null,null,null,"X",null," "]
[]
[null,null,null,null,"SIM",null,"NÃO",null,"JUSTIFICATIVA"]
[null,null,"NECESSITA PROJETO ?",null,null,null,"X"]
[]
["Item da NBR9050",null,"1a. EDIFICAÇÃO EM OBRAS",null,"SIM",null,"NÃO",null,"Não se aplica",null,"Observações"]
["6.12.5","a)","Em caso de obra, reforma em andamento no prédio, o tapume preserva a circulação na faixa livre de pedestre (1,20 m)?",null,null,null,null,null,"X"]
["6.12.5","b)","No caso do tapume ocupar a calçada, há uma circulação provisória com no mínimo 1,20 m de largura sobre o leito carroçável?",null,null,null,null,null,"X"]
["6.12.5","c)","Essa circulação possui rampa para saída e retorno à calçada? ",null,null,null,null,null,"X"]
[]
[null,null,null,null,"SIM",null,"NÃO",null,"JUSTIFICATIVA"]
[null,null,"NECESSITA PROJETO ?",null,null,null,"X"]
[]
[null,null,null,null,"ATENDE NBR9050-2020",null,null,null,"NÃO SE APLICA",null,"OBSERVAÇÕES"]
[]
["Item da NBR9050",null,"2. ESTACIONAMENTO ",null,"SIM",null,"NÃO",null,"Não se aplica",null,"Observações"]
["6.3.2 e\n6.14.1.2","a)","O piso do estacionamento é antiderrapante, regular e estável?",null,"X",null,null,null,null,null,"Garagem do segundo subsolo A2."]
["6.14.3,\nLei nº 13.146/2015,\nResolução nº 304/08 do Contran","b)","Possui 2% das vagas destinadas a  veículos que transportem pessoa com deficiência com comprometimento de mobilidade, com no mínimo uma vaga?",null,"X"]
["6.14.1.2","c)","Estas vagas estão localizadas de forma a evitar a circulação entre veículos?",null,"X"]
["6.14.1.2","d)","Possui espaço adicional de circulação, vinculado à vaga, com no mínimo 1,20 m, sinalizado no piso conforme norma, quando afastadas da faixa de travessia de pedestres? (Esse espaço pode ser compartilhado por duas vagas, no caso de estacionamento paralelo, perpendicular ou oblíquo ao meio fio)",null,"X"]
["6.12.7.3 e\n6.14.1.2","e)","Existe rebaixamento de guia junto à vaga acessível ligando-a à rota acessível?",null,null,null,null,null,"X"]
["5.5.2.3, 6.14.1.2 e\nResolução nº 304/08 do Contran","f)","Em vaga para pessoa com deficiência existe placa de sinalização vertical com o Símbolo Internacional de Acesso e com identificação escrita conforme Resolução CONTRAN?",null,"X"]
["5.5.2.3, 6.14.1.2 e\nResolução nº 236/07 do Contran","g)","As vagas reservadas possuem sinalização horizontal (no piso) com o Símbolo Internacional do Acesso?",null,"X"]
["6.14.1.2","h)","O percurso entre a vaga e o acesso à edificação ou elevadores é de no máximo 50 m?",null,"X"]
["6.14.3,\nLei nº 10.741/03 e\nResolução nº 303/08 do Contran","i)","Possui 5% das vagas destinadas a pessoas idosas, com no mínimo uma vaga?",null,"X"]
["6.14.1.1","j)","As vagas para as pessoas idosas estão localizadas próximas aos acessos da edificação?",null,"X"]
["6.14.1.1 e\nResolução nº 303/08 do Contran","k)","Em vaga para pessoa idosa, existe placa de sinalização vertical conforme Resolução CONTRAN?",null,null,null,"X",null,null,null,"Não existe a sinalização vertical para vaga de pessoas idosas."]
["6.14.1.1 e\nResolução nº 303/08 do Contran","l)","As vagas reservadas possuem sinalização horizontal com o nome IDOSO?",null,"X"]
[]
[null,null,null,null,"SIM",null,"NÃO",null,"JUSTIFICATIVA"]
[null,null,"NECESSITA PROJETO ?",null,null,null,"X",null,"É necessário a sinalização vertical de indicação, vaga exclusiva para idosos."]
[]
[null,null,null,null,"ATENDE NBR9050-2020",null,null,null,"NÃO SE APLICA",null,"OBSERVAÇÕES"]
[]
["Item da NBR9050",null,"3. ACESSO À EDIFICAÇÃO (Portas / vãos principais ou secundários que permitem a entrada ao prédio pela calçada frontal, pátios ou acessos laterais)",null,"SIM",null,"NÃO",null,"Não se aplica",null,"Observações"]
["6.2.2","a)","Todas as entradas da edificação são acessíveis?",null,"X",null,null,null,null,null,"O percurso aos acessos deve compor uma rota com piso tátil direcional."]
["6.2.2","b)","Caso contrário, foram esgotadas todas as possibilidades de adequação das entradas?",null,null,null,null,null,"X"]
["5.3.2","c)","No acesso principal a edificação, se totalmente adaptado às exigências da lei, existe o Símbolo Internacional do Acesso - SIA?",null,null,null,"X",null,null,null,"Sinalização deve ser fixada em local visível ao público."]
["6.2","d)","A entrada principal do prédio é visualmente acessível, ou seja, pode ser facilmente percebida?",null,"X"]
["6.2.8,\nSeção 5 e sub-itens","e)","Possui sinalização informativa e direcional da localização das entradas e saídas acessíveis?",null,"X"]
[]
["5.2.8.1.7, 5.4.2 e\nAnexo B","f)"," Possui mapa acessível instalado imediatamente após a entrada principal com piso tátil associado, informando os principais pontos de distribuição no prédio ou locais de maior utilização?",null,null,null,"X",null,null,null,"Não possui o mapa acessível instalado nas entradas."]
[]
[null,null,null,null,"SIM",null,"NÃO",null,"JUSTIFICATIVA"]
[null,null,"NECESSITA PROJETO ?",null,null,null,"X",null,"Sinalização de piso tátil direcional conduzindo os pedestres para os acessos da edificação, e a colocação do mapa acessível nas entradas. Aplicação do símbolo internacional do acesso - SAI."]
[]
["Item da NBR9050",null,"3.1 QUANTOS AOS PISOS NOS ACESSOS:",null,"SIM",null,"NÃO",null,"Não se aplica",null,"Observações"]
["6.3.2","a)","É antiderrapante?",null,"X"]
["6.3.2","b)","É regular, estável e não trepidante?",null,"X"]
["6.3.8, 5.4.6, \nNBR16537 (Seção 6)","c)","Possui piso tátil de alerta onde necessário (exemplos: próximo a desníveis, portas de acesso à edificação, elementos de mobiliário suspensos, escadas ou rampas)?\n",null,"X"]
["6.3.8, 5.4.6 e\nNBR16537 (Seção 7)","d)","Possui piso tátil direcional onde necessário (locais amplos e sem referência/ balizamento)?",null,"X"]
["9.2 e \nNBR16537 (Seção 7)","e)","Possui piso tátil direcional dos acessos da edificação até o balcão de informação?",null,"X"]
[]
[null,null,null,null,"SIM",null,"NÃO",null,"JUSTIFICATIVA"]
[null,null,"NECESSITA PROJETO ?",null,null,null,"X"]

{"sheet":"3.2_Entradas","index":1,"n_rows":79,"n_cols":10,"rows_kept":79,"cut":false,"hidden":false,"merged":[[77,7,77,9],[78,7,78,9],[54,4,54,5],[54,7,56,7],[54,9,56,9],[51,7,51,9],[52,7,52,9],[29,4,29,5],[29,7,31,7],[29,9,31,9],[26,7,26,9],[27,7,27,9],[0,0,0,2],[2,0,2,3],[6,4,6,5],[6,7,8,7],[6,9,8,9]]}
["Ministério da Mulher, da Família e dos Direitos Humanos\nSecretaria Nacional dos Direitos da Pessoa com Deficiência"]
[]
["LAUDO / CHECK LIST DE ACESSIBILIDADE PARA AVALIAÇÃO DE CONFORMIDADE ÀS NORMAS DE ACESSIBILIDADE (CONFORME NBR 9050:2020)"]
[]
["UNIDADE / ÓRGÃO",null,{"$f":"'1_Informações e outros'!E5","v":"MINISTÉRIO DA MULHER, DA FAMÍLIA E DOS DIREITOS HUMANOS"}]
[]
[null,null,"3. ACESSO À EDIFICAÇÃO",null,"ATENDE NBR9050-2020",null,null,"NÃO SE APLICA",null,"OBSERVAÇÕES"]
[]
["Item da NBR9050",null,"3.2 CARACTERÍSTICAS DAS ENTRADAS:",null,"SIM","NÃO"]
["6.1, \n6.1.1.2 e\n6.3.4.1","a)","Existe rampa em qualquer caso em que ocorra um desnível maior que 2 cm?",null,null,null,null,"X",null,"O acesso é realizado em nível."]
["6.6.2.5","b)","A rampa atende à largura mínima de 1,50 m, sendo admissível 1,20 m?",null,null,null,null,"X"]
["6.6.2.1","c)","A rampa atende à inclinação máxima de 8,33%?",null,null,null,null,"X"]
["6.6.3, \n6.6.4 e\n6.9","d)","Possui guia de balizamento, corrimão e guarda-corpos quando não houver paredes laterais e patamares nas dimensões requeridas?",null,null,null,null,"X"]
["6.3.4.1","e)","A diferença entre o exterior e a soleira da porta de entrada tem no máximo 0,5 cm ou, quando maior que 0,5 cm e menor que 2 cm, é chanfrada na proporção 1:2 (50%)?",null,"X"]
["6.1.1.2","f)","Se a entrada é alcançada por escada, existe a opção de rampa ou equipamento eletromecânico?",null,null,null,null,"X"]
["6.3.7","g)","Na existência de capacho na entrada, está embutido no piso ou possui desnível máximo de 0,5 cm?",null,"X"]
["6.11.2.4","h)","As portas de acesso atendem à largura livre mínima de 0,80 m e altura de 2,10 m?",null,"X"]
[" 6.11.2.13","i)","Portas e paredes envidraçadas têm faixa de sinalização visual com no mínimo 50 mm de espessura, instalada a uma altura entre 0,90 m e 1,00 m ou elementos gráficos equivalentes?",null,null,null,null,"X"]
[" 6.11.2.13","j)","Nas portas das paredes envidraçadas que façam parte de rotas acessíveis, existe faixa de sinalização visual emoldurando-as, com dimensão mínima de 50 mm de largura?",null,"X"]
["6.11.2.11","k)","Na existência de portas de correr, os trilhos ficam na parte superior?",null,"X"]
["6.11.2.11","l)","Em caso de estarem na parte inferior, os trilhos estão nivelados com a superfície do piso?",null,"X"]
["6.11.2.11","m)","As frestas dos trilhos, na parte inferior das portas de correr, são inferiores a 1,5 cm?",null,"X"]
["6.2.5","n)","Na existência de catracas ou cancelas, alguma delas possui acessibilidade?",null,"X"]
["6.2.7","o)","Em caso de portas giratórias, há uma entrada alternativa acessível?",null,null,null,null,"X"]
["Anexo B","p)","Os tons e/ou cores da parede e piso são diferentes?",null,"X"]
[]
[null,null,null,null,"SIM","NÃO",null,"JUSTIFICATIVA"]
[null,null,"NECESSITA PROJETO ?",null,null,"X"]
[{"$f":"'1_Informações e outros'!M27","v":0}]
[null,null,null,null,"ATENDE NBR9050-2020",null,null,"NÃO SE APLICA",null,"OBSERVAÇÕES"]
[]
["Item da NBR9050",null,"3.3 QUANTO ÀS RAMPAS NO ACESSO:",null,"SIM","NÃO"]
["6.1.1.2","a)","Existe rampa no acesso?",null,null,null,null,"X"]
["6.6.2.5","b)","A rampa atende à largura mínima de 1,20 m ?",null,null,null,null,{"$f":"IF(OR($F$33=\"X\",$H$33=\"X\"),\"X\",\"\")","v":"X"}]
["6.3.2","c)","O piso da rampa e dos patamares é revestido com material antiderrapante?",null,null,null,null,{"$f":"IF(OR($F$33=\"X\",$H$33=\"X\"),\"X\",\"\")","v":"X"}]
["6.6.2\n(tabelas 4 e 5)","d)","A inclinação da rampa está em conformidade com a tabela de dimensionamento de rampas?",null,null,null,null,"X"]
["6.6.2.4","e)","A inclinação transversal máxima é de 2% em rampa interna ou 3% em rampa externa?",null,null,null,null,"X"]
["6.6.4","f)","Existe previsão de patamar com dimensão longitudinal mínima 1,20 m no início e no término da rampa, além da área de circulação adjacente?",null,null,null,null,"X"]
["6.6.4","g)","Há, entre os segmentos de rampa, um patamar de no mínimo 1,20 m de comprimento na direção do movimento?",null,null,null,null,"X"]
["5.4.6 e NBR 16537 (Seção 6)","h)","Possui faixa de piso tátil de alerta no início e término da rampa?",null,null,null,null,"X"]
["6.9.1","i)","Os corrimãos são construídos em materiais rígidos e resistentes, firmemente fixados às paredes e oferecem condições de segurança na utilização?",null,null,null,null,"X"]
["4.6.5","j)","O corrimão possui seção circular entre 30 mm e 45 mm?",null,null,null,null,"X"]
["6.9.3.2","k)","O corrimão prolonga-se 0,30 m antes do início e após o término da rampa?",null,null,null,null,"X"]
["6.9.3.4","l)","O corrimão possui extremidades curvadas com desenho contínuo e sem protuberâncias?",null,null,null,null,{"$f":"IF(OR($F$33=\"X\",$H$33=\"X\"),\"X\",\"\")","v":"X"}]
["4.6.5","m)","Respeita o afastamento mínimo de 40 mm entre a parede e o corrimão?",null,null,null,null,{"$f":"IF(OR($F$33=\"X\",$H$33=\"X\"),\"X\",\"\")","v":"X"}]
["6.9.3.2","n)","O corrimão é duplo e contínuo nos dois lados da rampa, com alturas de 0,70 m e 0,92 m na face superior?",null,null,null,null,"X"]
["6.9.3.5","o)","Caso a rampa possua largura igual ou superior a 2,40 m, existe corrimão intermediário?",null,null,null,null,"X"]
["6.6.2.8, 6.9.1 e\nNBR9077 (item 4.8) e NBR14718","p)","Na ausência de paredes, existe guarda-corpo associado na altura exigida pelas normas?",null,null,null,null,"X"]
["6.6.2.8 e\n6.6.3","q)","Na ausência de paredes laterais, existe guia de balizamento com altura mínima de 5 cm?",null,null,null,null,"X"]
["5.4.3","r)","Há sinalização em Braille, informando sobre os pavimentos, no início e no final das rampas fixas, instalada na geratriz superior do prolongamento horizontal do corrimão?",null,null,null,null,"X"]
[]
[null,null,null,null,"SIM","NÃO",null,"JUSTIFICATIVA"]
[null,null,"NECESSITA PROJETO ?",null,null,"X"]
[]
[null,null,null,null,"ATENDE NBR9050-2020",null,null,"NÃO SE APLICA",null,"OBSERVAÇÕES"]
[]
["Item da NBR9050",null,"3.4 QUANTO ÀS ESCADAS NO ACESSO:",null,"SIM","NÃO"]
["6.1","a)","Existe escada no acesso?",null,null,null,null,"X"]
["6.3.2","b)","O piso dos degraus é antiderrapante e estável?",null,null,null,null,{"$f":"IF(OR($F$58=\"X\",$H$58=\"X\"),\"X\",\"\")","v":"X"}]
["6.7.1","c)","A escada integrante da rota acessível não possui espelho vazado?",null,null,null,null,{"$f":"IF(OR($F$58=\"X\",$H$58=\"X\"),\"X\",\"\")","v":"X"}]
["6.7.2","d)","Possui largura mínima de 1,20 m?",null,null,null,null,"X"]
["6.8.7","e)","Há patamar em escadas a cada desnível de 3,20 m  (exceto escada de lances curvos ou mistos) com no mínimo 1,20 m de dimensão longitudinal?",null,null,null,null,"X"]
["6.8.8","f)","Entre os lances existem patamares com dimensão longitudinal mínima de 1,20 m?",null,null,null,null,"X"]
["5.4.6, \nNBR 16537 (Seção 6)","g)","Possui faixa de piso tátil de alerta no início e término da escada?",null,null,null,null,"X"]
["6.9.3.2","h)","O corrimão é duplo e contínuo nos dois lados da escada, com alturas de 0,70 m e 0,92 m na face superior?",null,null,null,null,"X"]
["6.9.1","i)","Os corrimãos são construídos em materiais rígidos e resistentes, firmemente fixados às paredes e oferecem condições de segurança na utilização?",null,null,null,null,"X"]
["4.6.5","j)","O corrimão possui seção circular entre 30 mm e 45 mm?",null,null,null,null,"X"]
["4.6.5","k)","Respeita o afastamento mínimo de 40 mm entre a parede e o corrimão?",null,null,null,null,"X"]
["6.9.3.2","l)","O corrimão prolonga-se 0,30 m antes do início e após o término da escada?",null,null,null,null,"X"]
["6.9.3.4","m)","O corrimão possui extremidades curvadas com desenho contínuo e sem protuberâncias?",null,null,null,null,"X"]
["6.9.3.5","n)","Caso a escada possua largura igual ou superior a 2,40 m, existe corrimão intermediário?",null,null,null,null,"X"]
["6.9.3.6","o)","Caso existam corrimãos intermediários, estes somente são interrompidos quando o comprimento do patamar for superior a 1,40 m, garantindo o espaçamento mínimo de 0,80 m entre o término de um segmento e o início do seguinte, conforme Figura 77 da norma?",null,null,null,null,"X"]
["6.6.2.8, 6.9.1,\nNBR 9077 (item 4.8), NBR14718","p)","Na ausência de paredes, existe guarda-corpo associado na altura exigida pelas normas?",null,null,null,null,"X"]
["5.4.4.2","q)","Possui sinalização visual aplicada aos pisos e espelhos em suas bordas laterais e/ou nas projeções dos corrimãos, contrastante com o piso adjacente, preferencialmente fotoluminescente ou retroiluminada?",null,null,null,null,"X"]
["6.8.2","r)","As dimensões dos pisos e espelhos dos degraus são constantes em toda a escada ou degraus\nisolados, atendendo ao seguinte:\na) 0,63 m ≤ p + 2e ≤ 0,65 m,\nb) pisos (p): 0,28 m ≤ p ≤ 0,32 m e\nc) espelhos (e): 0,16 m ≤ e ≤ 0,18 m",null,null,null,null,"X"]
["6.8.4","s)","Em construções novas, o primeiro e o último degraus de um lance de escada distam no mínimo 0,30 m da área de circulação adjacente?",null,null,null,null,{"$f":"IF(OR($F$58=\"X\",$H$58=\"X\"),\"X\",\"\")","v":"X"}]
[]
[null,null,null,null,"SIM","NÃO",null,"JUSTIFICATIVA"]
[null,null,"NECESSITA PROJETO ?",null,null,"X"]

{"sheet":"4.1_Circul","index":2,"n_rows":28,"n_cols":128,"rows_kept":28,"cut":false,"hidden":false,"merged":[[22,21,23,21],[22,19,22,20],[19,21,19,22],[18,21,18,22],[27,126,27,127],[27,81,27,82],[27,86,27,87],[27,91,27,92],[27,96,27,97],[27,101,27,102],[27,106,27,107],[27,111,27,112],[27,116,27,117],[27,121,27,122],[22,117,23,117],[22,119,22,120],[22,121,23,121],[22,122,23,122],[22,124,22,125],[22,126,23,126],[22,127,23,127],[26,81,26,82],[26,86,26,87],[26,91,26,92],[26,96,26,97],[26,101,26,102],[26,106,26,107],[26,111,26,112],[26,116,26,117],[26,121,26,122],[26,126,26,127],[19,126,19,127],[22,79,22,80],[22,81,23,81],[22,82,23,82],[22,84,22,85],[22,86,23,86],[22,87,23,87],[22,89,22,90],[22,91,23,91],[22,92,23,92],[22,94,22,95],[22,96,23,96],[22,97,23,97],[22,99,22,100],[22,101,23,101],[22,102,23,102],[22,104,22,105],[22,106,23,106],[22,107,23,107],[22,109,22,110],[22,111,23,111],[22,112,23,112],[22,114,22,115],[22,116,23,116],[19,81,19,82],[19,86,19,87],[19,91,19,92],[19,96,19,97],[19,101,19,102],[19,106,19,107],[19,111,19,112],[19,116,19,117],[19,121,19,122],[8,117,9,117],[8,119,8,120],[8,121,9,121],[8,122,9,122],[8,124,8,125],[8,126,9,126],[8,127,9,127],[18,81,18,82],[18,86,18,87],[18,91,18,92],[18,96,18,97],[18,101,18,102],[18,106,18,107],[18,111,18,112],[18,116,18,117],[18,121,18,122],[18,126,18,127],[6,124,6,127],[8,79,8,80],[8,81,9,81],[8,82,9,82],[8,84,8,85],[8,86,9,86],[8,87,9,87],[8,89,8,90],[8,91,9,91],[8,92,9,92],[8,94,8,95],[8,96,9,96],[8,97,9,97],[8,99,8,100],[8,101,9,101],[8,102,9,102],[8,104,8,105],[8,106,9,106],[8,107,9,107],[8,109,8,110],[8,111,9,111],[8,112,9,112],[8,114,8,115],[8,116,9,116],[6,79,6,82],[6,84,6,87],[6,89,6,92],[6,94,6,97],[6,99,6,102],[6,104,6,107],[6,109,6,112],[6,114,6,117],[6,119,6,122],[27,6,27,7],[27,11,27,12],[27,16,27,17],[19,11,19,12],[19,6,19,7],[22,14,22,15],[22,16,23,16],[8,12,9,12],[8,16,9,16],[26,6,26,7],[26,11,26,12],[26,16,26,17],[8,14,8,15],[8,17,9,17],[8,9,8,10],[8,11,9,11],[6,19,6,22],[0,0,0,2],[2,0,2,3],[22,9,22,10],[22,11,23,11],[22,4,22,5],[22,6,23,6],[8,7,9,7],[8,4,8,5],[8,6,9,6],[6,14,6,17],[6,4,6,7],[6,9,6,12],[22,12,23,12],[22,7,23,7],[22,17,23,17],[18,16,18,17],[18,11,18,12],[18,6,18,7],[19,16,19,17],[8,19,8,20],[8,21,9,21],[8,22,9,22],[22,22,23,22],[8,24,8,25],[8,26,9,26],[8,27,9,27],[8,29,8,30],[8,31,9,31],[8,32,9,32],[22,24,22,25],[22,26,23,26],[18,26,18,27],[18,31,18,32],[19,26,19,27],[19,31,19,32],[27,21,27,22],[27,26,27,27],[27,31,27,32],[6,34,6,37],[6,39,6,42],[19,36,19,37],[19,41,19,42],[27,36,27,37],[27,41,27,42],[22,27,23,27],[22,29,22,30],[22,31,23,31],[22,32,23,32],[26,21,26,22],[26,26,26,27],[26,31,26,32],[6,24,6,27],[6,29,6,32],[8,34,8,35],[8,36,9,36],[8,37,9,37],[8,39,8,40],[8,41,9,41],[8,42,9,42],[18,36,18,37],[18,41,18,42],[18,46,18,47],[18,51,18,52],[18,56,18,57],[18,61,18,62],[8,54,8,55],[8,56,9,56],[8,57,9,57],[8,59,8,60],[8,61,9,61],[8,49,8,50],[8,51,9,51],[8,52,9,52],[22,34,22,35],[22,36,23,36],[22,37,23,37],[22,39,22,40],[22,41,23,41],[22,42,23,42],[22,44,22,45],[22,46,23,46],[22,47,23,47],[26,36,26,37],[26,41,26,42],[26,46,26,47],[26,51,26,52],[26,56,26,57],[26,61,26,62],[22,54,22,55],[22,56,23,56],[22,57,23,57],[22,59,22,60],[22,61,23,61],[22,49,22,50],[22,51,23,51],[22,52,23,52],[27,46,27,47],[27,51,27,52],[27,56,27,57],[27,61,27,62],[6,64,6,67],[18,66,18,67],[22,64,22,65],[22,66,23,66],[22,67,23,67],[22,62,23,62],[19,46,19,47],[19,51,19,52],[19,56,19,57],[19,61,19,62],[8,62,9,62],[6,44,6,47],[6,49,6,52],[6,54,6,57],[6,59,6,62],[8,44,8,45],[8,46,9,46],[8,47,9,47],[18,71,18,72],[18,76,18,77],[19,66,19,67],[19,71,19,72],[19,76,19,77],[6,69,6,72],[6,74,6,77],[8,64,8,65],[8,66,9,66],[8,67,9,67],[8,69,8,70],[8,71,9,71],[8,72,9,72],[8,74,8,75],[8,76,9,76],[8,77,9,77],[22,77,23,77],[26,66,26,67],[26,71,26,72],[26,76,26,77],[27,66,27,67],[27,71,27,72],[27,76,27,77],[22,69,22,70],[22,71,23,71],[22,72,23,72],[22,74,22,75],[22,76,23,76]]}
[{"$f":"'1_Informações e outros'!C1","v":"Ministério da Mulher, da Família e dos Direitos Humanos\nSecretaria Nacional dos Direitos da Pessoa com Deficiência"}]
[]
["LAUDO / CHECK LIST DE ACESSIBILIDADE PARA AVALIAÇÃO DE CONFORMIDADE ÀS NORMAS DE ACESSIBILIDADE (CONFORME NBR 9050:2020)"]
[]
["UNIDADE / ÓRGÃO",null,{"$f":"'1_Informações e outros'!E5","v":"MINISTÉRIO DA MULHER, DA FAMÍLIA E DOS DIREITOS HUMANOS"}]
[]
[{"$f":"'1_Informações e outros'!M5","v":4},null,null,null,"8º PAVTO",null,null,null,null,"9º PAVTO",null,null,null,null,"10º PAVTO",null,null,null,null,"TÉRREO",null,null,null,null,"5º PAVTO",null,null,null,null,"6º PAVTO",null,null,null,null,"7º PAVTO",null,null,null,null,"8º PAVTO",null,null,null,null,"9º PAVTO",null,null,null,null,"10º PAVTO",null,null,null,null,"11º PAVTO",null,null,null,null,"12º PAVTO",null,null,null,null,"13º PAVTO",null,null,null,null,"14º PAVTO",null,null,null,null,"15º PAVTO",null,null,null,null,"16º PAVTO",null,null,null,null,"17º PAVTO",null,null,null,null,"18º PAVTO",null,null,null,null,"19º PAVTO",null,null,null,null,"20º PAVTO",null,null,null,null,"21º PAVTO",null,null,null,null,"22º PAVTO",null,null,null,null,"23º PAVTO",null,null,null,null,"24º PAVTO",null,null,null,null,"25º PAVTO"]
[]
[null,null,"4. EDIFICAÇÃO  - CIRCULAÇÃO INTERNA ",null,"ATENDE NBR9050-2020",null,"NÃO SE APLICA","",null,"ATENDE NBR9050-2020",null,"NÃO SE APLICA","OBSERVAÇÕES",null,"ATENDE NBR9050-2020",null,"NÃO SE APLICA","OBSERVAÇÕES",null,"ATENDE NBR9050-2020",null,"NÃO SE APLICA","OBSERVAÇÕES",null,"ATENDE NBR9050-2020",null,"NÃO SE APLICA","OBSERVAÇÕES",null,"ATENDE NBR9050-2020",null,"NÃO SE APLICA","OBSERVAÇÕES",null,"ATENDE NBR9050-2020",null,"NÃO SE APLICA","OBSERVAÇÕES",null,"ATENDE NBR9050-2020",null,"NÃO SE APLICA","OBSERVAÇÕES",null,"ATENDE NBR9050-2020",null,"NÃO SE APLICA","OBSERVAÇÕES",null,"ATENDE NBR9050-2020",null,"NÃO SE APLICA","OBSERVAÇÕES",null,"ATENDE NBR9050-2020",null,"NÃO SE APLICA","OBSERVAÇÕES",null,"ATENDE NBR9050-2020",null,"NÃO SE APLICA","OBSERVAÇÕES",null,"ATENDE NBR9050-2020",null,"NÃO SE APLICA","OBSERVAÇÕES",null,"ATENDE NBR9050-2020",null,"NÃO SE APLICA","OBSERVAÇÕES",null,"ATENDE NBR9050-2020",null,"NÃO SE APLICA","OBSERVAÇÕES",null,"ATENDE NBR9050-2020",null,"NÃO SE APLICA","OBSERVAÇÕES",null,"ATENDE NBR9050-2020",null,"NÃO SE APLICA","OBSERVAÇÕES",null,"ATENDE NBR9050-2020",null,"NÃO SE APLICA","OBSERVAÇÕES",null,"ATENDE NBR9050-2020",null,"NÃO SE APLICA","OBSERVAÇÕES",null,"ATENDE NBR9050-2020",null,"NÃO SE APLICA","OBSERVAÇÕES",null,"ATENDE NBR9050-2020",null,"NÃO SE APLICA","OBSERVAÇÕES",null,"ATENDE NBR9050-2020",null,"NÃO SE APLICA","OBSERVAÇÕES",null,"ATENDE NBR9050-2020",null,"NÃO SE APLICA","OBSERVAÇÕES",null,"ATENDE NBR9050-2020",null,"NÃO SE APLICA","OBSERVAÇÕES",null,"ATENDE NBR9050-2020",null,"NÃO SE APLICA","OBSERVAÇÕES"]
["Item da NBR9050",null,"4.1 CIRCULAÇÃO HORIZONTAL",null,"SIM","NÃO",null,null,null,"SIM","NÃO",null,null,null,"SIM","NÃO",null,null,null,"SIM","NÃO",null,null,null,"SIM","NÃO",null,null,null,"SIM","NÃO",null,null,null,"SIM","NÃO",null,null,null,"SIM","NÃO",null,null,null,"SIM","NÃO",null,null,null,"SIM","NÃO",null,null,null,"SIM","NÃO",null,null,null,"SIM","NÃO",null,null,null,"SIM","NÃO",null,null,null,"SIM","NÃO",null,null,null,"SIM","NÃO",null,null,null,"SIM","NÃO",null,null,null,"SIM","NÃO",null,null,null,"SIM","NÃO",null,null,null,"SIM","NÃO",null,null,null,"SIM","NÃO",null,null,null,"SIM","NÃO",null,null,null,"SIM","NÃO",null,null,null,"SIM","NÃO",null,null,null,"SIM","NÃO",null,null,null,"SIM","NÃO"]
["6.11.1","a)","Os corredores têm largura mínima de 0,90 m (uso comum com extensão até 4,00 m), 1,20 m (uso comum com extensão até 10,00 m), 1,50 m (para corredores com extensão superior a 10,00 m) e 1,50 m para corredores de uso público?",null,"X",null,null,null,null,"X",null,null,null,null,"X",null,null,null,null,"X"]
["6.3.2","b)","O piso é antiderrapante, regular, estável e não trepidante?",null,"X",null,null,"O piso existente nesse pavimento em todas as salas e nos corredores de acesso as salas é carpete. A norma aconselha que esse tipo de piso deve ser evitado em rotas acessíveis, quando existente devem ser nivelados, e as superfícies não podem ter enrugamento e as felpas não podem prejudicar o deslocamento das pessoas. Reclamações dos usuários, pessoas em cadeira de rodas relataram, dificuldade em se locomover por conta do carpete. O piso em carpete apresenta irregularidades em algumas salas que não estão devidamente fixados e firmes.",null,"X",null,null,"O piso em algumas salas é carpete. A norma aconselha que esse tipo de piso deve ser evitado em rotas acessíveis, quando existente devem ser nivelados, e as superfícies não podem ter enrugamento e as felpas não podem prejudicar o deslocamento das pessoas. Reclamações dos usuários relataram, dificuldade em se locomover por conta do carpete. O piso em carpete apresenta irregularidades em algumas salas que não estão devidamente fixados e firmes.",null,"X",null,null,"O piso em algumas salas é carpete. A norma aconselha que esse tipo de piso deve ser evitado em rotas acessíveis, quando existente devem ser nivelados, e as superfícies não podem ter enrugamento e as felpas não podem prejudicar o deslocamento das pessoas. Reclamações dos usuários relataram, dificuldade em se locomover por conta do carpete. O piso em carpete apresenta irregularidades em algumas salas que não estão devidamente fixados e firmes.",null,"X"]
["5.4.6 e\nNBR 16537 (Seção 6)","c)","Possui piso tátil de alerta onde necessário, próximo a desníveis, elevadores, elementos de mobiliário suspensos, escadas ou rampas, por exemplo?",null,null,"X",null,"No hall não possui piso tátil de alerta nas portas dos elevadores.",null,null,"X",null,"No hall não possui piso tátil de alerta nas portas dos elevadores.",null,null,"X",null,"No hall não possui piso tátil de alerta nas portas dos elevadores.",null,"X"]
["5.4.6 e\nNBR 16537 (Seção 7)","d)","Existe piso tátil direcional na rota acessível onde necessário (locais amplos e sem referência/ balizamento)?",null,null,"X",null," A sinalização tátil direcional no hall dos elevadores, o direcionamento com o piso tátil, deve direcionar a pessoa com deficiência visual dos equipamentos para as áreas de atendimento. O piso tátil direcional existente no pavimento está de forma ERRADA, não leva a pessoa com deficiência visual do elevador até o local de informações, o piso tátil está finalizado antes de chegar ao balcão.",null,null,"X",null," A sinalização tátil direcional no hall dos elevadores, o direcionamento com o piso tátil, deve direcionar a pessoa com deficiência visual dos equipamentos para as áreas de atendimento. O piso tátil direcional existente no pavimento está de forma ERRADA, não leva a pessoa com deficiência visual do elevador até o local de informações, o piso tátil está finalizado antes de chegar ao balcão.",null,null,"X",null," A sinalização tátil direcional no hall dos elevadores, o direcionamento com o piso tátil, deve direcionar a pessoa com deficiência visual dos equipamentos para as áreas de atendimento. O piso tátil direcional existente no pavimento está de forma ERRADA, não leva a pessoa com deficiência visual do elevador até o local de informações, o piso tátil está finalizado antes de chegar ao balcão.",null,"X"]
["4.3.3","e)","No espaço de circulação, há livre passagem sem interrupções por mobiliário, vaso de planta, elementos suspensos com mais de 10 cm de profundidade etc.?",null,"X",null,null,"O layout das salas é a razão de algumas interrupções e não possibilita a passagem livre de pessoas em cadeira de rodas é dificulta a movimentação da cadeira dentro das salas.",null,"X",null,null,"O layout das salas é a razão de algumas interrupções e não possibilita a passagem livre de pessoas em cadeira de rodas é dificulta a movimentação da cadeira dentro das salas.",null,"X",null,null,"O layout das salas é a razão de algumas interrupções e não possibilita a passagem livre de pessoas em cadeira de rodas é dificulta a movimentação da cadeira dentro das salas.",null,"X"]
["4.3.3","f)","Quando da impossibilidade de um mobiliário ser instalado fora da rota acessível, ele é projetado\ncom diferença mínima em valor de reflexão da luz (LRV) de 30 pontos, em relação ao plano de fundo e detectável com bengala longa?",null,null,null,"X",null,null,null,null,"X",null,null,null,null,"X",null,null,null,null,"X"]
["6.1.2","g)","A rota acessível possui iluminação natural ou artificial com nível mínimo de iluminância de 150 lux medidos a 1,00 m do chão (exceto cinemas, teatros e similares)?",null,null,"X",null,"No hall dos elevadores, corredores laterais para escadas de emergência e sanitários, e no corredor principal da SECRETARIA NACIONAL DOS DIREITOS DA PESSOA COM DEFICIÊNCIA que da acesso as salas de 800 a 836 não está em conformidade com o nível mínimo de iluminação de 150 lux.",null,null,"X",null,"No hall dos elevadores, corredores laterais para escadas de emergência e sanitários, não está em conformidade com o nível mínimo de iluminação de 150 lux.",null,null,"X",null,"No hall dos elevadores, corredores laterais para escadas de emergência e sanitários, não está em conformidade com o nível mínimo de iluminação de 150 lux.",null,"X"]
[]
[null,null,null,null,"SIM","NÃO","JUSTIFICATIVA",null,null,"SIM","NÃO","JUSTIFICATIVA",null,null,"SIM","NÃO","JUSTIFICATIVA",null,null,"SIM","NÃO","JUSTIFICATIVA",null,null,"SIM","NÃO","JUSTIFICATIVA",null,null,"SIM","NÃO","JUSTIFICATIVA",null,null,"SIM","NÃO","JUSTIFICATIVA",null,null,"SIM","NÃO","JUSTIFICATIVA",null,null,"SIM","NÃO","JUSTIFICATIVA",null,null,"SIM","NÃO","JUSTIFICATIVA",null,null,"SIM","NÃO","JUSTIFICATIVA",null,null,"SIM","NÃO","JUSTIFICATIVA",null,null,"SIM","NÃO","JUSTIFICATIVA",null,null,"SIM","NÃO","JUSTIFICATIVA",null,null,"SIM","NÃO","JUSTIFICATIVA",null,null,"SIM","NÃO","JUSTIFICATIVA",null,null,"SIM","NÃO","JUSTIFICATIVA",null,null,"SIM","NÃO","JUSTIFICATIVA",null,null,"SIM","NÃO","JUSTIFICATIVA",null,null,"SIM","NÃO","JUSTIFICATIVA",null,null,"SIM","NÃO","JUSTIFICATIVA",null,null,"SIM","NÃO","JUSTIFICATIVA",null,null,"SIM","NÃO","JUSTIFICATIVA",null,null,"SIM","NÃO","JUSTIFICATIVA",null,null,"SIM","NÃO","JUSTIFICATIVA"]
[null,null,"NECESSITA PROJETO ?",null,null,"X","Deve atender o mínimo de lux, trocar a Iluminação onde foi apontado e deve ser feita todas as adaptações de sinalizações táteis de alerta e direcional nos elevadores. A sinalização tátil direcional deve levar para um ou mais elevadores.",null,null,null,"X","Deve atender o mínimo de lux, trocar a Iluminação onde foi apontado e deve ser feita todas as adaptações de sinalizações táteis de alerta e direcional nos elevadores. A sinalização tátil direcional deve levar para um ou mais elevadores.",null,null,null,"X","Deve atender o mínimo de lux, trocar a Iluminação onde foi apontado e deve ser feita todas as adaptações de sinalizações táteis de alerta e direcional nos elevadores. A sinalização tátil direcional deve levar para um ou mais elevadores.",null,null,null,"X"]
[]
[]
[null,null,null,null,"ATENDE NBR9050-2020",null,"NÃO SE APLICA","OBSERVAÇÕES",null,"ATENDE NBR9050-2020",null,"NÃO SE APLICA","OBSERVAÇÕES",null,"ATENDE NBR9050-2020",null,"NÃO SE APLICA","OBSERVAÇÕES",null,"ATENDE NBR9050-2020",null,"NÃO SE APLICA","OBSERVAÇÕES",null,"ATENDE NBR9050-2020",null,"NÃO SE APLICA","OBSERVAÇÕES",null,"ATENDE NBR9050-2020",null,"NÃO SE APLICA","OBSERVAÇÕES",null,"ATENDE NBR9050-2020",null,"NÃO SE APLICA","OBSERVAÇÕES",null,"ATENDE NBR9050-2020",null,"NÃO SE APLICA","OBSERVAÇÕES",null,"ATENDE NBR9050-2020",null,"NÃO SE APLICA","OBSERVAÇÕES",null,"ATENDE NBR9050-2020",null,"NÃO SE APLICA","OBSERVAÇÕES",null,"ATENDE NBR9050-2020",null,"NÃO SE APLICA","OBSERVAÇÕES",null,"ATENDE NBR9050-2020",null,"NÃO SE APLICA","OBSERVAÇÕES",null,"ATENDE NBR9050-2020",null,"NÃO SE APLICA","OBSERVAÇÕES",null,"ATENDE NBR9050-2020",null,"NÃO SE APLICA","OBSERVAÇÕES",null,"ATENDE NBR9050-2020",null,"NÃO SE APLICA","OBSERVAÇÕES",null,"ATENDE NBR9050-2020",null,"NÃO SE APLICA","OBSERVAÇÕES",null,"ATENDE NBR9050-2020",null,"NÃO SE APLICA","OBSERVAÇÕES",null,"ATENDE NBR9050-2020",null,"NÃO SE APLICA","OBSERVAÇÕES",null,"ATENDE NBR9050-2020",null,"NÃO SE APLICA","OBSERVAÇÕES",null,"ATENDE NBR9050-2020",null,"NÃO SE APLICA","OBSERVAÇÕES",null,"ATENDE NBR9050-2020",null,"NÃO SE APLICA","OBSERVAÇÕES",null,"ATENDE NBR9050-2020",null,"NÃO SE APLICA","OBSERVAÇÕES",null,"ATENDE NBR9050-2020",null,"NÃO SE APLICA","OBSERVAÇÕES",null,"ATENDE NBR9050-2020",null,"NÃO SE APLICA","OBSERVAÇÕES",null,"ATENDE NBR9050-2020",null,"NÃO SE APLICA","OBSERVAÇÕES"]
["Item da NBR9050",null,"4.2 CIRCULAÇÃO VERTICAL",null,"SIM","NÃO",null,null,null,"SIM","NÃO",null,null,null,"SIM","NÃO",null,null,null,"SIM","NÃO",null,null,null,"SIM","NÃO",null,null,null,"SIM","NÃO",null,null,null,"SIM","NÃO",null,null,null,"SIM","NÃO",null,null,null,"SIM","NÃO",null,null,null,"SIM","NÃO",null,null,null,"SIM","NÃO",null,null,null,"SIM","NÃO",null,null,null,"SIM","NÃO",null,null,null,"SIM","NÃO",null,null,null,"SIM","NÃO",null,null,null,"SIM","NÃO",null,null,null,"SIM","NÃO",null,null,null,"SIM","NÃO",null,null,null,"SIM","NÃO",null,null,null,"SIM","NÃO",null,null,null,"SIM","NÃO",null,null,null,"SIM","NÃO",null,null,null,"SIM","NÃO",null,null,null,"SIM","NÃO",null,null,null,"SIM","NÃO"]
["6.3","a)","Existe circulação vertical acessível a pessoas em cadeira de rodas ligando todos os pavimentos? (A circulação vertical pode ser realizada por escadas, rampas ou equipamentos eletromecânicos e é considerada acessível quando atender no mínimo a duas formas de deslocamento vertical).",null,"X",null,null,null,null,"X",null,null,null,null,"X",null,null,null,null,"X"]
[]
[null,null,null,null,"SIM","NÃO","JUSTIFICATIVA",null,null,"SIM","NÃO","JUSTIFICATIVA",null,null,"SIM","NÃO","JUSTIFICATIVA",null,null,"SIM","NÃO","JUSTIFICATIVA",null,null,"SIM","NÃO","JUSTIFICATIVA",null,null,"SIM","NÃO","JUSTIFICATIVA",null,null,"SIM","NÃO","JUSTIFICATIVA",null,null,"SIM","NÃO","JUSTIFICATIVA",null,null,"SIM","NÃO","JUSTIFICATIVA",null,null,"SIM","NÃO","JUSTIFICATIVA",null,null,"SIM","NÃO","JUSTIFICATIVA",null,null,"SIM","NÃO","JUSTIFICATIVA",null,null,"SIM","NÃO","JUSTIFICATIVA",null,null,"SIM","NÃO","JUSTIFICATIVA",null,null,"SIM","NÃO","JUSTIFICATIVA",null,null,"SIM","NÃO","JUSTIFICATIVA",null,null,"SIM","NÃO","JUSTIFICATIVA",null,null,"SIM","NÃO","JUSTIFICATIVA",null,null,"SIM","NÃO","JUSTIFICATIVA",null,null,"SIM","NÃO","JUSTIFICATIVA",null,null,"SIM","NÃO","JUSTIFICATIVA",null,null,"SIM","NÃO","JUSTIFICATIVA",null,null,"SIM","NÃO","JUSTIFICATIVA",null,null,"SIM","NÃO","JUSTIFICATIVA",null,null,"SIM","NÃO","JUSTIFICATIVA"]
[null,null,"NECESSITA PROJETO ?",null,null,"X",null,null,null,null,null,null,null,null,"X",null,null,null,null,null,"X"]

{"sheet":"4.2.1_Rampas","index":3,"n_rows":31,"n_cols":126,"rows_kept":31,"cut":false,"hidden":false,"merged":[[30,104,30,105],[30,109,30,110],[30,114,30,115],[30,119,30,120],[30,124,30,125],[30,79,30,80],[30,84,30,85],[30,89,30,90],[30,94,30,95],[30,99,30,100],[29,104,29,105],[29,109,29,110],[29,114,29,115],[29,119,29,120],[29,124,29,125],[29,79,29,80],[29,84,29,85],[29,89,29,90],[29,94,29,95],[29,99,29,100],[8,119,9,119],[8,120,9,120],[8,122,8,123],[8,124,9,124],[8,125,9,125],[8,110,9,110],[8,112,8,113],[8,114,9,114],[8,115,9,115],[8,117,8,118],[8,102,8,103],[8,104,9,104],[8,105,9,105],[8,107,8,108],[8,109,9,109],[8,94,9,94],[8,95,9,95],[8,97,8,98],[8,99,9,99],[8,100,9,100],[8,85,9,85],[8,87,8,88],[8,89,9,89],[8,90,9,90],[8,92,8,93],[8,77,8,78],[8,79,9,79],[8,80,9,80],[8,82,8,83],[8,84,9,84],[6,102,6,105],[6,107,6,110],[6,112,6,115],[6,117,6,120],[6,122,6,125],[6,77,6,80],[6,82,6,85],[6,87,6,90],[6,92,6,95],[6,97,6,100],[30,16,30,17],[29,6,29,7],[30,6,30,7],[29,11,29,12],[30,11,30,12],[6,57,6,60],[6,62,6,65],[0,0,0,2],[2,0,2,3],[8,9,8,10],[8,11,9,11],[8,14,8,15],[8,7,9,7],[8,12,9,12],[6,14,6,17],[6,4,6,7],[6,9,6,12],[8,4,8,5],[8,6,9,6],[8,17,9,17],[8,16,9,16],[8,32,8,33],[8,34,9,34],[8,60,9,60],[29,16,29,17],[6,52,6,55],[6,19,6,22],[6,24,6,25],[6,27,6,30],[8,19,8,20],[8,21,9,21],[8,24,9,24],[8,27,8,28],[8,29,9,29],[8,22,9,22],[8,25,9,25],[8,30,9,30],[8,47,8,48],[8,45,9,45],[8,49,9,49],[6,32,6,35],[6,37,6,40],[6,42,6,45],[6,47,6,50],[29,21,29,22],[29,24,29,25],[29,29,29,30],[8,54,9,54],[30,21,30,22],[30,24,30,25],[30,29,30,30],[8,39,9,39],[8,42,8,43],[8,44,9,44],[29,59,29,60],[30,59,30,60],[29,34,29,35],[29,39,29,40],[29,44,29,45],[29,49,29,50],[29,54,29,55],[30,34,30,35],[30,39,30,40],[30,44,30,45],[30,49,30,50],[30,54,30,55],[8,35,9,35],[8,40,9,40],[8,37,8,38],[8,50,9,50],[8,55,9,55],[8,52,8,53],[29,64,29,65],[29,69,29,70],[29,74,29,75],[30,64,30,65],[30,69,30,70],[30,74,30,75],[8,65,9,65],[8,57,8,58],[8,59,9,59],[6,67,6,70],[6,72,6,75],[8,62,8,63],[8,64,9,64],[8,67,8,68],[8,69,9,69],[8,72,8,73],[8,74,9,74],[8,75,9,75],[8,70,9,70]]}
[{"$f":"'1_Informações e outros'!C1","v":"Ministério da Mulher, da Família e dos Direitos Humanos\nSecretaria Nacional dos Direitos da Pessoa com Deficiência"}]
[]
["LAUDO / CHECK LIST DE ACESSIBILIDADE PARA AVALIAÇÃO DE CONFORMIDADE ÀS NORMAS DE ACESSIBILIDADE (CONFORME NBR 9050:2020) "]
[]
["UNIDADE / ÓRGÃO",null,{"$f":"'1_Informações e outros'!E5","v":"MINISTÉRIO DA MULHER, DA FAMÍLIA E DOS DIREITOS HUMANOS"}]
[]
[{"$f":"'1_Informações e outros'!M5","v":4},null,null,null,{"$f":"'4.1_Circul'!E7","v":"8º PAVTO"},null,null,null,null,{"$f":"'4.1_Circul'!J7","v":"9º PAVTO"},null,null,null,null,{"$f":"'4.1_Circul'!O7","v":"10º PAVTO"},null,null,null,null,{"$f":"'4.1_Circul'!T7","v":"TÉRREO"},null,null,null,null,null,null,null,{"$f":"'4.1_Circul'!AD7","v":"6º PAVTO"},null,null,null,null,{"$f":"'4.1_Circul'!AI7","v":"7º PAVTO"},null,null,null,null,{"$f":"'4.1_Circul'!AN7","v":"8º PAVTO"},null,null,null,null,{"$f":"'4.1_Circul'!AS7","v":"9º PAVTO"},null,null,null,null,{"$f":"'4.1_Circul'!AX7","v":"10º PAVTO"},null,null,null,null,{"$f":"'4.1_Circul'!BC7","v":"11º PAVTO"},null,null,null,null,{"$f":"'4.1_Circul'!BH7","v":"12º PAVTO"},null,null,null,null,{"$f":"'4.1_Circul'!BM7","v":"13º PAVTO"},null,null,null,null,{"$f":"'4.1_Circul'!BR7","v":"14º PAVTO"},null,null,null,null,{"$f":"'4.1_Circul'!BW7","v":"15º PAVTO"},null,null,null,null,{"$f":"'4.1_Circul'!CB7","v":"16º PAVTO"},null,null,null,null,{"$f":"'4.1_Circul'!CG7","v":"17º PAVTO"},null,null,null,null,{"$f":"'4.1_Circul'!CL7","v":"18º PAVTO"},null,null,null,null,{"$f":"'4.1_Circul'!CQ7","v":"19º PAVTO"},null,null,null,null,{"$f":"'4.1_Circul'!CV7","v":"20º PAVTO"},null,null,null,null,{"$f":"'4.1_Circul'!DA7","v":"21º PAVTO"},null,null,null,null,{"$f":"'4.1_Circul'!DF7","v":"22º PAVTO"},null,null,null,null,{"$f":"'4.1_Circul'!DK7","v":"23º PAVTO"},null,null,null,null,{"$f":"'4.1_Circul'!DP7","v":"24º PAVTO"},null,null,null,null,{"$f":"'4.1_Circul'!DU7","v":"25º PAVTO"}]
[]
[null,null,"4. EDIFICAÇÃO  - CIRCULAÇÃO INTERNA ",null,"ATENDE NBR9050-2020",null,"NÃO SE APLICA","OBSERVAÇÕES",null,"ATENDE NBR9050-2020",null,"NÃO SE APLICA","OBSERVAÇÕES",null,"ATENDE NBR9050-2020",null,"NÃO SE APLICA","OBSERVAÇÕES",null,"ATENDE NBR9050-2020",null,"NÃO SE APLICA","OBSERVAÇÕES",null,"NÃO SE APLICA","OBSERVAÇÕES",null,"ATENDE NBR9050-2020",null,"NÃO SE APLICA","OBSERVAÇÕES",null,"ATENDE NBR9050-2020",null,"NÃO SE APLICA","OBSERVAÇÕES",null,"ATENDE NBR9050-2020",null,"NÃO SE APLICA","OBSERVAÇÕES",null,"ATENDE NBR9050-2020",null,"NÃO SE APLICA","OBSERVAÇÕES",null,"ATENDE NBR9050-2020",null,"NÃO SE APLICA","OBSERVAÇÕES",null,"ATENDE NBR9050-2020",null,"NÃO SE APLICA","OBSERVAÇÕES",null,"ATENDE NBR9050-2020",null,"NÃO SE APLICA","OBSERVAÇÕES",null,"ATENDE NBR9050-2020",null,"NÃO SE APLICA","OBSERVAÇÕES",null,"ATENDE NBR9050-2020",null,"NÃO SE APLICA","OBSERVAÇÕES",null,"ATENDE NBR9050-2020",null,"NÃO SE APLICA","OBSERVAÇÕES",null,"ATENDE NBR9050-2020",null,"NÃO SE APLICA","OBSERVAÇÕES",null,"ATENDE NBR9050-2020",null,"NÃO SE APLICA","OBSERVAÇÕES",null,"ATENDE NBR9050-2020",null,"NÃO SE APLICA","OBSERVAÇÕES",null,"ATENDE NBR9050-2020",null,"NÃO SE APLICA","OBSERVAÇÕES",null,"ATENDE NBR9050-2020",null,"NÃO SE APLICA","OBSERVAÇÕES",null,"ATENDE NBR9050-2020",null,"NÃO SE APLICA","OBSERVAÇÕES",null,"ATENDE NBR9050-2020",null,"NÃO SE APLICA","OBSERVAÇÕES",null,"ATENDE NBR9050-2020",null,"NÃO SE APLICA","OBSERVAÇÕES",null,"ATENDE NBR9050-2020",null,"NÃO SE APLICA","OBSERVAÇÕES",null,"ATENDE NBR9050-2020",null,"NÃO SE APLICA","OBSERVAÇÕES"]
["Item da NBR9050",null,"4.2.1 QUANTO ÀS RAMPAS:",null,"SIM","NÃO",null,null,null,"SIM","NÃO",null,null,null,"SIM","NÃO",null,null,null,"SIM","NÃO",null,null,null,null,null,null,"SIM","NÃO",null,null,null,"SIM","NÃO",null,null,null,"SIM","NÃO",null,null,null,"SIM","NÃO",null,null,null,"SIM","NÃO",null,null,null,"SIM","NÃO",null,null,null,"SIM","NÃO",null,null,null,"SIM","NÃO",null,null,null,"SIM","NÃO",null,null,null,"SIM","NÃO",null,null,null,"SIM","NÃO",null,null,null,"SIM","NÃO",null,null,null,"SIM","NÃO",null,null,null,"SIM","NÃO",null,null,null,"SIM","NÃO",null,null,null,"SIM","NÃO",null,null,null,"SIM","NÃO",null,null,null,"SIM","NÃO",null,null,null,"SIM","NÃO",null,null,null,"SIM","NÃO"]
["6.1.1.2","a)","Existe rampa interna?",null,null,null,"X",null,null,null,null,"X",null,null,null,null,"X",null,null,null,null,"X"]
["6.6.2.5","b)","A rampa atende à largura mínima de 1,20 m?",null,null,null,{"$f":"IF(OR(F$11=\"X\",G$11=\"X\"),\"X\",\"\")","v":"X"},null,null,null,null,{"$f":"IF(OR(K$11=\"X\",L$11=\"X\"),\"X\",\"\")","v":"X"},null,null,null,null,"X",null,null,null,null,{"$f":"IF(OR(U$11=\"X\",V$11=\"X\"),\"X\",\"\")","v":"X"},null,null,{"$f":"IF(OR(#REF!=\"X\",Y$11=\"X\"),\"X\",\"\")","v":{"$error":"#REF!"}},null,null,null,null,{"$f":"IF(OR(AC$11=\"X\",AD$11=\"X\"),\"X\",\"\")","v":""},null,null,null,null,{"$f":"IF(OR(AH$11=\"X\",AI$11=\"X\"),\"X\",\"\")","v":""},null,null,null,null,{"$f":"IF(OR(AM$11=\"X\",AN$11=\"X\"),\"X\",\"\")","v":""},null,null,null,null,{"$f":"IF(OR(AR$11=\"X\",AS$11=\"X\"),\"X\",\"\")","v":""},null,null,null,null,{"$f":"IF(OR(AW$11=\"X\",AX$11=\"X\"),\"X\",\"\")","v":""},null,null,null,null,{"$f":"IF(OR(BB$11=\"X\",BC$11=\"X\"),\"X\",\"\")","v":""},null,null,null,null,{"$f":"IF(OR(BG$11=\"X\",BH$11=\"X\"),\"X\",\"\")","v":""},null,null,null,null,{"$f":"IF(OR(BL$11=\"X\",BM$11=\"X\"),\"X\",\"\")","v":""},null,null,null,null,{"$f":"IF(OR(BQ$11=\"X\",BR$11=\"X\"),\"X\",\"\")","v":""},null,null,null,null,{"$f":"IF(OR(BV$11=\"X\",BW$11=\"X\"),\"X\",\"\")","v":""},null,null,null,null,{"$f":"IF(OR(CA$11=\"X\",CB$11=\"X\"),\"X\",\"\")","v":""},null,null,null,null,{"$f":"IF(OR(CF$11=\"X\",CG$11=\"X\"),\"X\",\"\")","v":""},null,null,null,null,{"$f":"IF(OR(CK$11=\"X\",CL$11=\"X\"),\"X\",\"\")","v":""},null,null,null,null,{"$f":"IF(OR(CP$11=\"X\",CQ$11=\"X\"),\"X\",\"\")","v":""},null,null,null,null,{"$f":"IF(OR(CU$11=\"X\",CV$11=\"X\"),\"X\",\"\")","v":""},null,null,null,null,{"$f":"IF(OR(CZ$11=\"X\",DA$11=\"X\"),\"X\",\"\")","v":""},null,null,null,null,{"$f":"IF(OR(DE$11=\"X\",DF$11=\"X\"),\"X\",\"\")","v":""},null,null,null,null,{"$f":"IF(OR(DJ$11=\"X\",DK$11=\"X\"),\"X\",\"\")","v":""},null,null,null,null,{"$f":"IF(OR(DO$11=\"X\",DP$11=\"X\"),\"X\",\"\")","v":""},null,null,null,null,{"$f":"IF(OR(DT$11=\"X\",DU$11=\"X\"),\"X\",\"\")","v":""}]
["6.3.2","c)","O piso da rampa e dos patamares é revestido com material antiderrapante?",null,null,null,{"$f":"IF(OR(F$11=\"X\",G$11=\"X\"),\"X\",\"\")","v":"X"},null,null,null,null,{"$f":"IF(OR(K$11=\"X\",L$11=\"X\"),\"X\",\"\")","v":"X"},null,null,null,null,"X",null,null,null,null,{"$f":"IF(OR(U$11=\"X\",V$11=\"X\"),\"X\",\"\")","v":"X"},null,null,{"$f":"IF(OR(#REF!=\"X\",Y$11=\"X\"),\"X\",\"\")","v":{"$error":"#REF!"}},null,null,null,null,{"$f":"IF(OR(AC$11=\"X\",AD$11=\"X\"),\"X\",\"\")","v":""},null,null,null,null,{"$f":"IF(OR(AH$11=\"X\",AI$11=\"X\"),\"X\",\"\")","v":""},null,null,null,null,{"$f":"IF(OR(AM$11=\"X\",AN$11=\"X\"),\"X\",\"\")","v":""},null,null,null,null,{"$f":"IF(OR(AR$11=\"X\",AS$11=\"X\"),\"X\",\"\")","v":""},null,null,null,null,{"$f":"IF(OR(AW$11=\"X\",AX$11=\"X\"),\"X\",\"\")","v":""},null,null,null,null,{"$f":"IF(OR(BB$11=\"X\",BC$11=\"X\"),\"X\",\"\")","v":""},null,null,null,null,{"$f":"IF(OR(BG$11=\"X\",BH$11=\"X\"),\"X\",\"\")","v":""},null,null,null,null,{"$f":"IF(OR(BL$11=\"X\",BM$11=\"X\"),\"X\",\"\")","v":""},null,null,null,null,{"$f":"IF(OR(BQ$11=\"X\",BR$11=\"X\"),\"X\",\"\")","v":""},null,null,null,null,{"$f":"IF(OR(BV$11=\"X\",BW$11=\"X\"),\"X\",\"\")","v":""},null,null,null,null,{"$f":"IF(OR(CA$11=\"X\",CB$11=\"X\"),\"X\",\"\")","v":""},null,null,null,null,{"$f":"IF(OR(CF$11=\"X\",CG$11=\"X\"),\"X\",\"\")","v":""},null,null,null,null,{"$f":"IF(OR(CK$11=\"X\",CL$11=\"X\"),\"X\",\"\")","v":""},null,null,null,null,{"$f":"IF(OR(CP$11=\"X\",CQ$11=\"X\"),\"X\",\"\")","v":""},null,null,null,null,{"$f":"IF(OR(CU$11=\"X\",CV$11=\"X\"),\"X\",\"\")","v":""},null,null,null,null,{"$f":"IF(OR(CZ$11=\"X\",DA$11=\"X\"),\"X\",\"\")","v":""},null,null,null,null,{"$f":"IF(OR(DE$11=\"X\",DF$11=\"X\"),\"X\",\"\")","v":""},null,null,null,null,{"$f":"IF(OR(DJ$11=\"X\",DK$11=\"X\"),\"X\",\"\")","v":""},null,null,null,null,{"$f":"IF(OR(DO$11=\"X\",DP$11=\"X\"),\"X\",\"\")","v":""},null,null,null,null,{"$f":"IF(OR(DT$11=\"X\",DU$11=\"X\"),\"X\",\"\")","v":""}]
["6.6.2\n(tabela 4 e 5)","d)","A inclinação da rampa está em conformidade com a tabela de dimensionamento de rampas?",null,null,null,"X",null,null,null,null,"X",null,null,null,null,"X",null,null,null,null,"X",null,null,{"$f":"IF(OR(#REF!=\"X\",Y$11=\"X\"),\"X\",\"\")","v":{"$error":"#REF!"}},null,null,null,null,"",null,null,null,null,"",null,null,null,null,"",null,null,null,null,"",null,null,null,null,"",null,null,null,null,"",null,null,null,null,"",null,null,null,null,"",null,null,null,null,"",null,null,null,null,"",null,null,null,null,"",null,null,null,null,"",null,null,null,null,"",null,null,null,null,"",null,null,null,null,"",null,null,null,null,"",null,null,null,null,"",null,null,null,null,"",null,null,null,null,"",null,null,null,null,""]
["6.6.2.4","e)","A inclinação transversal máxima é de 2% em rampa interna ou 3% em rampa externa?",null,null,null,"X",null,null,null,null,"X",null,null,null,null,"X",null,null,null,null,"X",null,null,{"$f":"IF(OR(#REF!=\"X\",Y$11=\"X\"),\"X\",\"\")","v":{"$error":"#REF!"}},null,null,null,null,"",null,null,null,null,"",null,null,null,null,"",null,null,null,null,"",null,null,null,null,"",null,null,null,null,"",null,null,null,null,"",null,null,null,null,"",null,null,null,null,"",null,null,null,null,"",null,null,null,null,"",null,null,null,null,"",null,null,null,null,"",null,null,null,null,"",null,null,null,null,"",null,null,null,null,"",null,null,null,null,"",null,null,null,null,"",null,null,null,null,"",null,null,null,null,""]
["6.6.4","f)","Existe previsão de patamar com dimensão longitudinal mínima 1,20 m, no início e término da rampa, além da área de circulação adjacente?",null,null,null,"X",null,null,null,null,"X",null,null,null,null,"X",null,null,null,null,"X",null,null,{"$f":"IF(OR(#REF!=\"X\",Y$11=\"X\"),\"X\",\"\")","v":{"$error":"#REF!"}},null,null,null,null,"",null,null,null,null,"",null,null,null,null,"",null,null,null,null,"",null,null,null,null,"",null,null,null,null,"",null,null,null,null,"",null,null,null,null,"",null,null,null,null,"",null,null,null,null,"",null,null,null,null,"",null,null,null,null,"",null,null,null,null,"",null,null,null,null,"",null,null,null,null,"",null,null,null,null,"",null,null,null,null,"",null,null,null,null,"",null,null,null,null,"",null,null,null,null,""]
["6.6.4","g)","Há, entre os segmentos de rampa, um patamar de no mínimo 1,20 m de comprimento, na direção do movimento?",null,null,null,"X",null,null,null,null,"X",null,null,null,null,"X",null,null,null,null,"X",null,null,{"$f":"IF(OR(#REF!=\"X\",Y$11=\"X\"),\"X\",\"\")","v":{"$error":"#REF!"}},null,null,null,null,"",null,null,null,null,"",null,null,null,null,"",null,null,null,null,"",null,null,null,null,"",null,null,null,null,"",null,null,null,null,"",null,null,null,null,"",null,null,null,null,"",null,null,null,null,"",null,null,null,null,"",null,null,null,null,"",null,null,null,null,"",null,null,null,null,"",null,null,null,null,"",null,null,null,null,"",null,null,null,null,"",null,null,null,null,"",null,null,null,null,"",null,null,null,null,""]
["5.4.6","h)","Possui faixa de piso tátil de alerta no início e término da rampa?",null,null,null,"X",null,null,null,null,"X",null,null,null,null,"X",null,null,null,null,"X",null,null,{"$f":"IF(OR(#REF!=\"X\",Y$11=\"X\"),\"X\",\"\")","v":{"$error":"#REF!"}},null,null,null,null,"",null,null,null,null,"",null,null,null,null,"",null,null,null,null,"",null,null,null,null,"",null,null,null,null,"",null,null,null,null,"",null,null,null,null,"",null,null,null,null,"",null,null,null,null,"",null,null,null,null,"",null,null,null,null,"",null,null,null,null,"",null,null,null,null,"",null,null,null,null,"",null,null,null,null,"",null,null,null,null,"",null,null,null,null,"",null,null,null,null,"",null,null,null,null,""]
["6.9.1","i)","Os corrimãos são construídos em materiais rígidos e resistente, firmemente fixados às paredes e oferecem condições de segurança na utilização?",null,null,null,"X",null,null,null,null,"X",null,null,null,null,"X",null,null,null,null,"X",null,null,{"$f":"IF(OR(#REF!=\"X\",Y$11=\"X\"),\"X\",\"\")","v":{"$error":"#REF!"}},null,null,null,null,"",null,null,null,null,"",null,null,null,null,"",null,null,null,null,"",null,null,null,null,"",null,null,null,null,"",null,null,null,null,"",null,null,null,null,"",null,null,null,null,"",null,null,null,null,"",null,null,null,null,"",null,null,null,null,"",null,null,null,null,"",null,null,null,null,"",null,null,null,null,"",null,null,null,null,"",null,null,null,null,"",null,null,null,null,"",null,null,null,null,"",null,null,null,null,""]
["4.6.5","j)","O corrimão possui seção circular entre 30 mm e 45 mm?",null,null,null,"X",null,null,null,null,"X",null,null,null,null,"X",null,null,null,null,"X",null,null,{"$f":"IF(OR(#REF!=\"X\",Y$11=\"X\"),\"X\",\"\")","v":{"$error":"#REF!"}},null,null,null,null,"",null,null,null,null,"",null,null,null,null,"",null,null,null,null,"",null,null,null,null,"",null,null,null,null,"",null,null,null,null,"",null,null,null,null,"",null,null,null,null,"",null,null,null,null,"",null,null,null,null,"",null,null,null,null,"",null,null,null,null,"",null,null,null,null,"",null,null,null,null,"",null,null,null,null,"",null,null,null,null,"",null,null,null,null,"",null,null,null,null,"",null,null,null,null,""]
["6.9.3.2","k)","O corrimão prolonga-se 0,30 m antes do início e após o término da rampa?",null,null,null,"X",null,null,null,null,"X",null,null,null,null,"X",null,null,null,null,"X",null,null,{"$f":"IF(OR(#REF!=\"X\",Y$11=\"X\"),\"X\",\"\")","v":{"$error":"#REF!"}},null,null,null,null,"",null,null,null,null,"",null,null,null,null,"",null,null,null,null,"",null,null,null,null,"",null,null,null,null,"",null,null,null,null,"",null,null,null,null,"",null,null,null,null,"",null,null,null,null,"",null,null,null,null,"",null,null,null,null,"",null,null,null,null,"",null,null,null,null,"",null,null,null,null,"",null,null,null,null,"",null,null,null,null,"",null,null,null,null,"",null,null,null,null,"",null,null,null,null,""]
["6.9.3.4","l)","O corrimão possui extremidades curvadas com desenho contínuo e sem protuberâncias?",null,null,null,"X",null,null,null,null,"X",null,null,null,null,"X",null,null,null,null,"X",null,null,{"$f":"IF(OR(#REF!=\"X\",Y$11=\"X\"),\"X\",\"\")","v":{"$error":"#REF!"}},null,null,null,null,"",null,null,null,null,"",null,null,null,null,"",null,null,null,null,"",null,null,null,null,"",null,null,null,null,"",null,null,null,null,"",null,null,null,null,"",null,null,null,null,"",null,null,null,null,"",null,null,null,null,"",null,null,null,null,"",null,null,null,null,"",null,null,null,null,"",null,null,null,null,"",null,null,null,null,"",null,null,null,null,"",null,null,null,null,"",null,null,null,null,"",null,null,null,null,""]
["4.6.5","m)","Respeita o afastamento mínimo de 40 mm entre a parede e o corrimão?",null,null,null,"X",null,null,null,null,"X",null,null,null,null,"X",null,null,null,null,"X",null,null,{"$f":"IF(OR(#REF!=\"X\",Y$11=\"X\"),\"X\",\"\")","v":{"$error":"#REF!"}},null,null,null,null,"",null,null,null,null,"",null,null,null,null,"",null,null,null,null,"",null,null,null,null,"",null,null,null,null,"",null,null,null,null,"",null,null,null,null,"",null,null,null,null,"",null,null,null,null,"",null,null,null,null,"",null,null,null,null,"",null,null,null,null,"",null,null,null,null,"",null,null,null,null,"",null,null,null,null,"",null,null,null,null,"",null,null,null,null,"",null,null,null,null,"",null,null,null,null,""]
["6.9.3.2","n)","O corrimão é duplo e contínuo nos dois lados da rampa, com alturas de 0,70 m e 0,92 m na face superior?",null,null,null,"X",null,null,null,null,"X",null,null,null,null,"X",null,null,null,null,"X",null,null,{"$f":"IF(OR(#REF!=\"X\",Y$11=\"X\"),\"X\",\"\")","v":{"$error":"#REF!"}},null,null,null,null,"",null,null,null,null,"",null,null,null,null,"",null,null,null,null,"",null,null,null,null,"",null,null,null,null,"",null,null,null,null,"",null,null,null,null,"",null,null,null,null,"",null,null,null,null,"",null,null,null,null,"",null,null,null,null,"",null,null,null,null,"",null,null,null,null,"",null,null,null,null,"",null,null,null,null,"",null,null,null,null,"",null,null,null,null,"",null,null,null,null,"",null,null,null,null,""]
["6.9.3.5","o)","Caso a rampa possua largura igual ou superior a 2,40 m, existe corrimão intermediário ?",null,null,null,"X",null,null,null,null,"X",null,null,null,null,"X",null,null,null,null,"X",null,null,{"$f":"IF(OR(#REF!=\"X\",Y$11=\"X\"),\"X\",\"\")","v":{"$error":"#REF!"}},null,null,null,null,"",null,null,null,null,"",null,null,null,null,"",null,null,null,null,"",null,null,null,null,"",null,null,null,null,"",null,null,null,null,"",null,null,null,null,"",null,null,null,null,"",null,null,null,null,"",null,null,null,null,"",null,null,null,null,"",null,null,null,null,"",null,null,null,null,"",null,null,null,null,"",null,null,null,null,"",null,null,null,null,"",null,null,null,null,"",null,null,null,null,"",null,null,null,null,""]
["6.6.2.8, \n6.9.1, \nNBR 9077 (item 4.8) e NBR14718","p)","Na ausência de paredes, existe guarda-corpo associado na altura exigida pelas normas?",null,null,null,"X",null,null,null,null,"X",null,null,null,null,"X",null,null,null,null,"X",null,null,{"$f":"IF(OR(#REF!=\"X\",Y$11=\"X\"),\"X\",\"\")","v":{"$error":"#REF!"}},null,null,null,null,"",null,null,null,null,"",null,null,null,null,"",null,null,null,null,"",null,null,null,null,"",null,null,null,null,"",null,null,null,null,"",null,null,null,null,"",null,null,null,null,"",null,null,null,null,"",null,null,null,null,"",null,null,null,null,"",null,null,null,null,"",null,null,null,null,"",null,null,null,null,"",null,null,null,null,"",null,null,null,null,"",null,null,null,null,"",null,null,null,null,"",null,null,null,null,""]
["6.6.2.8 e\n6.6.3","q)","Na ausência de paredes laterais, existe guia de balizamento com altura mínima de 5 cm?",null,null,null,"X",null,null,null,null,"X",null,null,null,null,"X",null,null,null,null,"X",null,null,{"$f":"IF(OR(#REF!=\"X\",Y$11=\"X\"),\"X\",\"\")","v":{"$error":"#REF!"}},null,null,null,null,"",null,null,null,null,"",null,null,null,null,"",null,null,null,null,"",null,null,null,null,"",null,null,null,null,"",null,null,null,null,"",null,null,null,null,"",null,null,null,null,"",null,null,null,null,"",null,null,null,null,"",null,null,null,null,"",null,null,null,null,"",null,null,null,null,"",null,null,null,null,"",null,null,null,null,"",null,null,null,null,"",null,null,null,null,"",null,null,null,null,"",null,null,null,null,""]
["5.4.3","r)","Há sinalização em Braille, informando sobre os pavimentos, no início e no final das rampas fixas, instalada na geratriz superior do prolongamento horizontal do corrimão? ",null,null,null,"X",null,null,null,null,"X",null,null,null,null,"X",null,null,null,null,"X",null,null,{"$f":"IF(OR(#REF!=\"X\",Y$11=\"X\"),\"X\",\"\")","v":{"$error":"#REF!"}},null,null,null,null,"",null,null,null,null,"",null,null,null,null,"",null,null,null,null,"",null,null,null,null,"",null,null,null,null,"",null,null,null,null,"",null,null,null,null,"",null,null,null,null,"",null,null,null,null,"",null,null,null,null,"",null,null,null,null,"",null,null,null,null,"",null,null,null,null,"",null,null,null,null,"",null,null,null,null,"",null,null,null,null,"",null,null,null,null,"",null,null,null,null,"",null,null,null,null,""]
[]
[null,null,null,null,"SIM","NÃO","JUSTIFICATIVA",null,null,"SIM","NÃO","JUSTIFICATIVA",null,null,"SIM","NÃO","JUSTIFICATIVA",null,null,"SIM","NÃO","JUSTIFICATIVA",null,null,"JUSTIFICATIVA",null,null,"SIM","NÃO","JUSTIFICATIVA",null,null,"SIM","NÃO","JUSTIFICATIVA",null,null,"SIM","NÃO","JUSTIFICATIVA",null,null,"SIM","NÃO","JUSTIFICATIVA",null,null,"SIM","NÃO","JUSTIFICATIVA",null,null,"SIM","NÃO","JUSTIFICATIVA",null,null,"SIM","NÃO","JUSTIFICATIVA",null,null,"SIM","NÃO","JUSTIFICATIVA",null,null,"SIM","NÃO","JUSTIFICATIVA",null,null,"SIM","NÃO","JUSTIFICATIVA",null,null,"SIM","NÃO","JUSTIFICATIVA",null,null,"SIM","NÃO","JUSTIFICATIVA",null,null,"SIM","NÃO","JUSTIFICATIVA",null,null,"SIM","NÃO","JUSTIFICATIVA",null,null,"SIM","NÃO","JUSTIFICATIVA",null,null,"SIM","NÃO","JUSTIFICATIVA",null,null,"SIM","NÃO","JUSTIFICATIVA",null,null,"SIM","NÃO","JUSTIFICATIVA",null,null,"SIM","NÃO","JUSTIFICATIVA",null,null,"SIM","NÃO","JUSTIFICATIVA"]
[null,null,"NECESSITA PROJETO ?",null,null,"X",null,null,null,null,"X",null,null,null,null,"X",null,null,null,null,"X"]

{"sheet":"4.2.2_Escadas","index":4,"n_rows":37,"n_cols":128,"rows_kept":37,"cut":false,"hidden":false,"merged":[[36,106,36,107],[36,111,36,112],[36,116,36,117],[36,121,36,122],[36,126,36,127],[36,81,36,82],[36,86,36,87],[36,91,36,92],[36,96,36,97],[36,101,36,102],[35,106,35,107],[35,111,35,112],[35,116,35,117],[35,121,35,122],[35,126,35,127],[35,81,35,82],[35,86,35,87],[35,91,35,92],[35,96,35,97],[35,101,35,102],[8,121,9,121],[8,122,9,122],[8,124,8,125],[8,126,9,126],[8,127,9,127],[8,112,9,112],[8,114,8,115],[8,116,9,116],[8,117,9,117],[8,119,8,120],[8,104,8,105],[8,106,9,106],[8,107,9,107],[8,109,8,110],[8,111,9,111],[8,96,9,96],[8,97,9,97],[8,99,8,100],[8,101,9,101],[8,102,9,102],[8,87,9,87],[8,89,8,90],[8,91,9,91],[8,92,9,92],[8,94,8,95],[8,79,8,80],[8,81,9,81],[8,82,9,82],[8,84,8,85],[8,86,9,86],[6,104,6,107],[6,109,6,112],[6,114,6,117],[6,119,6,122],[6,124,6,127],[6,79,6,82],[6,84,6,87],[6,89,6,92],[6,94,6,97],[6,99,6,102],[35,6,35,7],[35,11,35,12],[35,16,35,17],[36,6,36,7],[36,11,36,12],[36,16,36,17],[8,7,9,7],[8,12,9,12],[8,11,9,11],[8,14,8,15],[8,17,9,17],[8,16,9,16],[0,0,0,2],[2,0,2,3],[8,4,8,5],[8,6,9,6],[8,9,8,10],[6,19,6,22],[6,24,6,27],[6,29,6,32],[8,19,8,20],[8,21,9,21],[8,22,9,22],[8,24,8,25],[8,26,9,26],[8,27,9,27],[8,29,8,30],[8,31,9,31],[8,32,9,32],[6,14,6,17],[6,4,6,7],[6,9,6,12],[35,21,35,22],[35,26,35,27],[35,31,35,32],[36,21,36,22],[36,26,36,27],[36,31,36,32],[6,34,6,37],[6,39,6,42],[6,44,6,47],[35,36,35,37],[35,41,35,42],[35,46,35,47],[6,49,6,52],[6,54,6,57],[6,59,6,62],[8,34,8,35],[8,36,9,36],[8,37,9,37],[8,39,8,40],[8,41,9,41],[8,42,9,42],[8,44,8,45],[8,46,9,46],[8,47,9,47],[8,49,8,50],[8,51,9,51],[8,52,9,52],[8,54,8,55],[8,56,9,56],[8,57,9,57],[8,59,8,60],[8,61,9,61],[8,62,9,62],[35,51,35,52],[35,56,35,57],[35,61,35,62],[35,66,35,67],[35,71,35,72],[35,76,35,77],[36,36,36,37],[36,41,36,42],[36,46,36,47],[36,51,36,52],[36,56,36,57],[36,66,36,67],[36,71,36,72],[36,76,36,77],[36,61,36,62],[6,64,6,67],[6,69,6,72],[6,74,6,77],[8,64,8,65],[8,66,9,66],[8,67,9,67],[8,69,8,70],[8,71,9,71],[8,72,9,72],[8,74,8,75],[8,76,9,76],[8,77,9,77]]}
[{"$f":"'1_Informações e outros'!C1","v":"Ministério da Mulher, da Família e dos Direitos Humanos\nSecretaria Nacional dos Direitos da Pessoa com Deficiência"}]
[]
["LAUDO / CHECK LIST DE ACESSIBILIDADE PARA AVALIAÇÃO DE CONFORMIDADE ÀS NORMAS DE ACESSIBILIDADE (CONFORME NBR 9050:2020) "]
[]
["UNIDADE / ÓRGÃO",null,{"$f":"'1_Informações e outros'!E5","v":"MINISTÉRIO DA MULHER, DA FAMÍLIA E DOS DIREITOS HUMANOS"}]
[]
[{"$f":"'1_Informações e outros'!M5","v":4},null,null,null,{"$f":"'4.1_Circul'!E7","v":"8º PAVTO"},null,null,null,null,{"$f":"'4.1_Circul'!J7","v":"9º PAVTO"},null,null,null,null,{"$f":"'4.1_Circul'!O7","v":"10º PAVTO"},null,null,null,null,{"$f":"'4.1_Circul'!T7","v":"TÉRREO"},null,null,null,null,{"$f":"'4.1_Circul'!Y7","v":"5º PAVTO"},null,null,null,null,{"$f":"'4.1_Circul'!AD7","v":"6º PAVTO"},null,null,null,null,{"$f":"'4.1_Circul'!AI7","v":"7º PAVTO"},null,null,null,null,{"$f":"'4.1_Circul'!AN7","v":"8º PAVTO"},null,null,null,null,{"$f":"'4.1_Circul'!AS7","v":"9º PAVTO"},null,null,null,null,{"$f":"'4.1_Circul'!AX7","v":"10º PAVTO"},null,null,null,null,{"$f":"'4.1_Circul'!BC7","v":"11º PAVTO"},null,null,null,null,{"$f":"'4.1_Circul'!BH7","v":"12º PAVTO"},null,null,null,null,{"$f":"'4.1_Circul'!BM7","v":"13º PAVTO"},null,null,null,null,{"$f":"'4.1_Circul'!BR7","v":"14º PAVTO"},null,null,null,null,{"$f":"'4.1_Circul'!BW7","v":"15º PAVTO"},null,null,null,null,{"$f":"'4.1_Circul'!CB7","v":"16º PAVTO"},null,null,null,null,{"$f":"'4.1_Circul'!CG7","v":"17º PAVTO"},null,null,null,null,{"$f":"'4.1_Circul'!CL7","v":"18º PAVTO"},null,null,null,null,{"$f":"'4.1_Circul'!CQ7","v":"19º PAVTO"},null,null,null,null,{"$f":"'4.1_Circul'!CV7","v":"20º PAVTO"},null,null,null,null,{"$f":"'4.1_Circul'!DA7","v":"21º PAVTO"},null,null,null,null,{"$f":"'4.1_Circul'!DF7","v":"22º PAVTO"},null,null,null,null,{"$f":"'4.1_Circul'!DK7","v":"23º PAVTO"},null,null,null,null,{"$f":"'4.1_Circul'!DP7","v":"24º PAVTO"},null,null,null,null,{"$f":"'4.1_Circul'!DU7","v":"25º PAVTO"}]
[]
[null,null,"4. EDIFICAÇÃO  - CIRCULAÇÃO INTERNA ",null,"ATENDE NBR9050-2020",null,"NÃO SE APLICA","OBSERVAÇÕES",null,"ATENDE NBR9050-2020",null,"NÃO SE APLICA","OBSERVAÇÕES",null,"ATENDE NBR9050-2020",null,"NÃO SE APLICA","OBSERVAÇÕES",null,"ATENDE NBR9050-2020",null,"NÃO SE APLICA","OBSERVAÇÕES",null,"ATENDE NBR9050-2020",null,"NÃO SE APLICA","OBSERVAÇÕES",null,"ATENDE NBR9050-2020",null,"NÃO SE APLICA","OBSERVAÇÕES",null,"ATENDE NBR9050-2020",null,"NÃO SE APLICA","OBSERVAÇÕES",null,"ATENDE NBR9050-2020",null,"NÃO SE APLICA","OBSERVAÇÕES",null,"ATENDE NBR9050-2020",null,"NÃO SE APLICA","OBSERVAÇÕES",null,"ATENDE NBR9050-2020",null,"NÃO SE APLICA","OBSERVAÇÕES",null,"ATENDE NBR9050-2020",null,"NÃO SE APLICA","OBSERVAÇÕES",null,"ATENDE NBR9050-2020",null,"NÃO SE APLICA","OBSERVAÇÕES",null,"ATENDE NBR9050-2020",null,"NÃO SE APLICA","OBSERVAÇÕES",null,"ATENDE NBR9050-2020",null,"NÃO SE APLICA","OBSERVAÇÕES",null,"ATENDE NBR9050-2020",null,"NÃO SE APLICA","OBSERVAÇÕES",null,"ATENDE NBR9050-2020",null,"NÃO SE APLICA","OBSERVAÇÕES",null,"ATENDE NBR9050-2020",null,"NÃO SE APLICA","OBSERVAÇÕES",null,"ATENDE NBR9050-2020",null,"NÃO SE APLICA","OBSERVAÇÕES",null,"ATENDE NBR9050-2020",null,"NÃO SE APLICA","OBSERVAÇÕES",null,"ATENDE NBR9050-2020",null,"NÃO SE APLICA","OBSERVAÇÕES",null,"ATENDE NBR9050-2020",null,"NÃO SE APLICA","OBSERVAÇÕES",null,"ATENDE NBR9050-2020",null,"NÃO SE APLICA","OBSERVAÇÕES",null,"ATENDE NBR9050-2020",null,"NÃO SE APLICA","OBSERVAÇÕES",null,"ATENDE NBR9050-2020",null,"NÃO SE APLICA","OBSERVAÇÕES",null,"ATENDE NBR9050-2020",null,"NÃO SE APLICA","OBSERVAÇÕES"]
["Item da NBR9050",null,"4.2.2 QUANTO ÀS ESCADAS:",null,"SIM","NÃO",null,null,null,"SIM","NÃO",null,null,null,"SIM","NÃO",null,null,null,"SIM","NÃO",null,null,null,"SIM","NÃO",null,null,null,"SIM","NÃO",null,null,null,"SIM","NÃO",null,null,null,"SIM","NÃO",null,null,null,"SIM","NÃO",null,null,null,"SIM","NÃO",null,null,null,"SIM","NÃO",null,null,null,"SIM","NÃO",null,null,null,"SIM","NÃO",null,null,null,"SIM","NÃO",null,null,null,"SIM","NÃO",null,null,null,"SIM","NÃO",null,null,null,"SIM","NÃO",null,null,null,"SIM","NÃO",null,null,null,"SIM","NÃO",null,null,null,"SIM","NÃO",null,null,null,"SIM","NÃO",null,null,null,"SIM","NÃO",null,null,null,"SIM","NÃO",null,null,null,"SIM","NÃO",null,null,null,"SIM","NÃO"]
["6.1","a)","Existe escada na edificação?",null,"X",null,null,"Apenas escada de emergência.",null,"X",null,null,"Apenas escada de emergência.",null,"X",null,null,"Apenas escada de emergência.",null,"X",null,null,"Apenas escada de emergência."]
["6.3.2","b)","O piso dos degraus é antiderrapante e estável?",null,"X",null,null,null,null,"X",null,null,null,null,"X",null,null,null,null,"X",null,{"$f":"IF(OR(U$11=\"X\",V$11=\"X\"),\"X\",\"\")","v":""},null,null,null,null,{"$f":"IF(OR(Z$11=\"X\",AA$11=\"X\"),\"X\",\"\")","v":""},null,null,null,null,{"$f":"IF(OR(AE$11=\"X\",AF$11=\"X\"),\"X\",\"\")","v":""},null,null,null,null,{"$f":"IF(OR(AJ$11=\"X\",AK$11=\"X\"),\"X\",\"\")","v":""},null,null,null,null,{"$f":"IF(OR(AO$11=\"X\",AP$11=\"X\"),\"X\",\"\")","v":""},null,null,null,null,{"$f":"IF(OR(AT$11=\"X\",AU$11=\"X\"),\"X\",\"\")","v":""},null,null,null,null,{"$f":"IF(OR(AY$11=\"X\",AZ$11=\"X\"),\"X\",\"\")","v":""},null,null,null,null,{"$f":"IF(OR(BD$11=\"X\",BE$11=\"X\"),\"X\",\"\")","v":""},null,null,null,null,{"$f":"IF(OR(BI$11=\"X\",BJ$11=\"X\"),\"X\",\"\")","v":""},null,null,null,null,{"$f":"IF(OR(BN$11=\"X\",BO$11=\"X\"),\"X\",\"\")","v":""},null,null,null,null,{"$f":"IF(OR(BS$11=\"X\",BT$11=\"X\"),\"X\",\"\")","v":""},null,null,null,null,{"$f":"IF(OR(BX$11=\"X\",BY$11=\"X\"),\"X\",\"\")","v":""},null,null,null,null,{"$f":"IF(OR(CC$11=\"X\",CD$11=\"X\"),\"X\",\"\")","v":""},null,null,null,null,{"$f":"IF(OR(CH$11=\"X\",CI$11=\"X\"),\"X\",\"\")","v":""},null,null,null,null,{"$f":"IF(OR(CM$11=\"X\",CN$11=\"X\"),\"X\",\"\")","v":""},null,null,null,null,{"$f":"IF(OR(CR$11=\"X\",CS$11=\"X\"),\"X\",\"\")","v":""},null,null,null,null,{"$f":"IF(OR(CW$11=\"X\",CX$11=\"X\"),\"X\",\"\")","v":""},null,null,null,null,{"$f":"IF(OR(DB$11=\"X\",DC$11=\"X\"),\"X\",\"\")","v":""},null,null,null,null,{"$f":"IF(OR(DG$11=\"X\",DH$11=\"X\"),\"X\",\"\")","v":""},null,null,null,null,{"$f":"IF(OR(DL$11=\"X\",DM$11=\"X\"),\"X\",\"\")","v":""},null,null,null,null,{"$f":"IF(OR(DQ$11=\"X\",DR$11=\"X\"),\"X\",\"\")","v":""},null,null,null,null,{"$f":"IF(OR(DV$11=\"X\",DW$11=\"X\"),\"X\",\"\")","v":""}]
["6.7.1","c)","A escada integrante da rota acessível não possui espelho vazado?",null,"X",null,null,null,null,"X",null,null,null,null,null,"X",null,null,null,"X",null,null,null,null,null,null,{"$f":"IF(OR(Z$11=\"X\",AA$11=\"X\"),\"X\",\"\")","v":""},null,null,null,null,{"$f":"IF(OR(AE$11=\"X\",AF$11=\"X\"),\"X\",\"\")","v":""},null,null,null,null,{"$f":"IF(OR(AJ$11=\"X\",AK$11=\"X\"),\"X\",\"\")","v":""},null,null,null,null,{"$f":"IF(OR(AO$11=\"X\",AP$11=\"X\"),\"X\",\"\")","v":""},null,null,null,null,{"$f":"IF(OR(AT$11=\"X\",AU$11=\"X\"),\"X\",\"\")","v":""},null,null,null,null,{"$f":"IF(OR(AY$11=\"X\",AZ$11=\"X\"),\"X\",\"\")","v":""},null,null,null,null,{"$f":"IF(OR(BD$11=\"X\",BE$11=\"X\"),\"X\",\"\")","v":""},null,null,null,null,{"$f":"IF(OR(BI$11=\"X\",BJ$11=\"X\"),\"X\",\"\")","v":""},null,null,null,null,{"$f":"IF(OR(BN$11=\"X\",BO$11=\"X\"),\"X\",\"\")","v":""},null,null,null,null,{"$f":"IF(OR(BS$11=\"X\",BT$11=\"X\"),\"X\",\"\")","v":""},null,null,null,null,{"$f":"IF(OR(BX$11=\"X\",BY$11=\"X\"),\"X\",\"\")","v":""},null,null,null,null,{"$f":"IF(OR(CC$11=\"X\",CD$11=\"X\"),\"X\",\"\")","v":""},null,null,null,null,{"$f":"IF(OR(CH$11=\"X\",CI$11=\"X\"),\"X\",\"\")","v":""},null,null,null,null,{"$f":"IF(OR(CM$11=\"X\",CN$11=\"X\"),\"X\",\"\")","v":""},null,null,null,null,{"$f":"IF(OR(CR$11=\"X\",CS$11=\"X\"),\"X\",\"\")","v":""},null,null,null,null,{"$f":"IF(OR(CW$11=\"X\",CX$11=\"X\"),\"X\",\"\")","v":""},null,null,null,null,{"$f":"IF(OR(DB$11=\"X\",DC$11=\"X\"),\"X\",\"\")","v":""},null,null,null,null,{"$f":"IF(OR(DG$11=\"X\",DH$11=\"X\"),\"X\",\"\")","v":""},null,null,null,null,{"$f":"IF(OR(DL$11=\"X\",DM$11=\"X\"),\"X\",\"\")","v":""},null,null,null,null,{"$f":"IF(OR(DQ$11=\"X\",DR$11=\"X\"),\"X\",\"\")","v":""},null,null,null,null,{"$f":"IF(OR(DV$11=\"X\",DW$11=\"X\"),\"X\",\"\")","v":""}]
["6.7.2","d)","Possui largura mínima de 1,20 m?",null,"X",null,null,null,null,"X",null,null,null,null,"X",null,null,null,null,"X",null,{"$f":"IF(OR(U$11=\"X\",V$11=\"X\"),\"X\",\"\")","v":""},null,null,null,null,"",null,null,null,null,"",null,null,null,null,"",null,null,null,null,"",null,null,null,null,"",null,null,null,null,"",null,null,null,null,"",null,null,null,null,"",null,null,null,null,"",null,null,null,null,"",null,null,null,null,"",null,null,null,null,"",null,null,null,null,"",null,null,null,null,"",null,null,null,null,"",null,null,null,null,"",null,null,null,null,"",null,null,null,null,"",null,null,null,null,"",null,null,null,null,"",null,null,null,null,""]
["6.8.7","e)","Possui, no mínimo, um patamar a cada 3,20 m de desnível ou onde houver mudança de direção?",null,"X",null,null,null,null,"X",null,null,null,null,"X",null,null,null,null,"X",null,"",null,null,null,null,"",null,null,null,null,"",null,null,null,null,"",null,null,null,null,"",null,null,null,null,"",null,null,null,null,"",null,null,null,null,"",null,null,null,null,"",null,null,null,null,"",null,null,null,null,"",null,null,null,null,"",null,null,null,null,"",null,null,null,null,"",null,null,null,null,"",null,null,null,null,"",null,null,null,null,"",null,null,null,null,"",null,null,null,null,"",null,null,null,null,"",null,null,null,null,"",null,null,null,null,""]
["6.8.8","f)","Entre os lances existem patamares com dimensão longitudinal mínima de 1,20 m?",null,"X",null,null,null,null,"X",null,null,null,null,"X",null,null,null,null,"X",null,"",null,null,null,null,"",null,null,null,null,"",null,null,null,null,"",null,null,null,null,"",null,null,null,null,"",null,null,null,null,"",null,null,null,null,"",null,null,null,null,"",null,null,null,null,"",null,null,null,null,"",null,null,null,null,"",null,null,null,null,"",null,null,null,null,"",null,null,null,null,"",null,null,null,null,"",null,null,null,null,"",null,null,null,null,"",null,null,null,null,"",null,null,null,null,"",null,null,null,null,"",null,null,null,null,""]
["5.4.6 e\nNBR 16537 (Seção 6)","g)","Possui faixa de piso tátil de alerta no início e no término da escada?",null,null,"X",null,"Não há sinalização tátil de alerta. Deve haver sinalização tátil de alerta no início e no final de cada trecho de escada.",null,null,"X",null,"Não há sinalização tátil de alerta. Deve haver sinalização tátil de alerta no início e no final de cada trechode escada.",null,null,"X",null,"Não há sinalização tátil de alerta. Deve haver sinalização tátil de alerta no início e no final de cada trechode escada.",null,null,"X","","Não há sinalização tátil de alerta. Deve haver sinalização tátil de alerta no início e no final de cada trechode escada.",null,null,null,"",null,null,null,null,"",null,null,null,null,"",null,null,null,null,"",null,null,null,null,"",null,null,null,null,"",null,null,null,null,"",null,null,null,null,"",null,null,null,null,"",null,null,null,null,"",null,null,null,null,"",null,null,null,null,"",null,null,null,null,"",null,null,null,null,"",null,null,null,null,"",null,null,null,null,"",null,null,null,null,"",null,null,null,null,"",null,null,null,null,"",null,null,null,null,"",null,null,null,null,""]
["6.9.3.2","h)","O corrimão é duplo e contínuo nos dois lados da escada, com alturas de 0,70 m e 0,92 m na face superior?",null,null,"X",null,"Na versão anterior admitia-se a instalação de um único corrimão ou corrimãos isolados. A emenda da NBR 9050:2020 resgatou diretrizes de 2004, determinando em ambos os lados, um corrimão com duas alturas.",null,null,"X",null,"Na versão anterior admitia-se a instalação de um único corrimão ou corrimãos isolados. A emenda da NBR 9050:2020 resgatou diretrizes de 2004, determinando em ambos os lados, um corrimão com duas alturas.",null,null,"X",null,"Na versão anterior admitia-se a instalação de um único corrimão ou corrimãos isolados. A emenda da NBR 9050:2020 resgatou diretrizes de 2004, determinando em ambos os lados, um corrimão com duas alturas.",null,null,"X",null,"Na versão anterior admitia-se a instalação de um único corrimão ou corrimãos isolados. A emenda da NBR 9050:2020 resgatou diretrizes de 2004, determinando em ambos os lados, um corrimão com duas alturas.",null,null,null,"",null,null,null,null,"",null,null,null,null,"",null,null,null,null,"",null,null,null,null,"",null,null,null,null,"",null,null,null,null,"",null,null,null,null,"",null,null,null,null,"",null,null,null,null,"",null,null,null,null,"",null,null,null,null,"",null,null,null,null,"",null,null,null,null,"",null,null,null,null,"",null,null,null,null,"",null,null,null,null,"",null,null,null,null,"",null,null,null,null,"",null,null,null,null,"",null,null,null,null,""]
["6.9.1","i)","Os corrimãos são construídos em materiais rígidos e resistentes, firmemente fixados às paredes e oferecem condições de segurança na utilização?",null,"X",null,null,null,null,"X",null,null,null,null,"X",null,null,null,null,"X",null,"",null,null,null,null,"",null,null,null,null,"",null,null,null,null,"",null,null,null,null,"",null,null,null,null,"",null,null,null,null,"",null,null,null,null,"",null,null,null,null,"",null,null,null,null,"",null,null,null,null,"",null,null,null,null,"",null,null,null,null,"",null,null,null,null,"",null,null,null,null,"",null,null,null,null,"",null,null,null,null,"",null,null,null,null,"",null,null,null,null,"",null,null,null,null,"",null,null,null,null,"",null,null,null,null,""]
["4.6.5","j)","O corrimão possui seção circular entre 30 mm e 45 mm?",null,"X",null,null,null,null,"X",null,null,null,null,"X",null,null,null,null,"X",null,"",null,null,null,null,"",null,null,null,null,"",null,null,null,null,"",null,null,null,null,"",null,null,null,null,"",null,null,null,null,"",null,null,null,null,"",null,null,null,null,"",null,null,null,null,"",null,null,null,null,"",null,null,null,null,"",null,null,null,null,"",null,null,null,null,"",null,null,null,null,"",null,null,null,null,"",null,null,null,null,"",null,null,null,null,"",null,null,null,null,"",null,null,null,null,"",null,null,null,null,"",null,null,null,null,""]
["4.6.5","k)","Respeita o afastamento mínimo de 40 mm entre a parede e o corrimão?",null,"X",null,null,null,null,"X",null,null,null,null,"X",null,null,null,null,"X",null,"",null,null,null,null,"",null,null,null,null,"",null,null,null,null,"",null,null,null,null,"",null,null,null,null,"",null,null,null,null,"",null,null,null,null,"",null,null,null,null,"",null,null,null,null,"",null,null,null,null,"",null,null,null,null,"",null,null,null,null,"",null,null,null,null,"",null,null,null,null,"",null,null,null,null,"",null,null,null,null,"",null,null,null,null,"",null,null,null,null,"",null,null,null,null,"",null,null,null,null,"",null,null,null,null,""]
["6.9.3.2","l)","O corrimão prolonga-se 0,30 m antes do início e após o término da escada?",null,"X",null,null,null,null,"X",null,null,null,null,"X",null,null,null,null,"X",null,"",null,null,null,null,"",null,null,null,null,"",null,null,null,null,"",null,null,null,null,"",null,null,null,null,"",null,null,null,null,"",null,null,null,null,"",null,null,null,null,"",null,null,null,null,"",null,null,null,null,"",null,null,null,null,"",null,null,null,null,"",null,null,null,null,"",null,null,null,null,"",null,null,null,null,"",null,null,null,null,"",null,null,null,null,"",null,null,null,null,"",null,null,null,null,"",null,null,null,null,"",null,null,null,null,""]
["6.9.3.4","m)","O corrimão possui extremidades curvadas com desenho contínuo e sem protuberâncias?",null,"X",null,null,null,null,"X",null,null,null,null,"X",null,null,null,null,"X",null,"",null,null,null,null,"",null,null,null,null,"",null,null,null,null,"",null,null,null,null,"",null,null,null,null,"",null,null,null,null,"",null,null,null,null,"",null,null,null,null,"",null,null,null,null,"",null,null,null,null,"",null,null,null,null,"",null,null,null,null,"",null,null,null,null,"",null,null,null,null,"",null,null,null,null,"",null,null,null,null,"",null,null,null,null,"",null,null,null,null,"",null,null,null,null,"",null,null,null,null,"",null,null,null,null,""]
["6.9.3.5","n)","Caso a escada possua largura igual ou superior a 2,40 m, existe corrimão intermediário?",null,null,null,"X",null,null,null,null,"X",null,null,null,null,"X",null,null,null,null,"X",null,null,null,null,"",null,null,null,null,"",null,null,null,null,"",null,null,null,null,"",null,null,null,null,"",null,null,null,null,"",null,null,null,null,"",null,null,null,null,"",null,null,null,null,"",null,null,null,null,"",null,null,null,null,"",null,null,null,null,"",null,null,null,null,"",null,null,null,null,"",null,null,null,null,"",null,null,null,null,"",null,null,null,null,"",null,null,null,null,"",null,null,null,null,"",null,null,null,null,"",null,null,null,null,""]
["6.9.3.6","o)","Caso existam corrimãos intermediários, estes somente são interrompidos quando o comprimento\ndo patamar for superior a 1,40 m, garantindo o espaçamento mínimo de 0,80 m entre o término de um\nsegmento e o início do seguinte, conforme Figura 77 da norma?",null,null,null,"X",null,null,null,null,"X",null,null,null,null,"X",null,null,null,null,"X",null,null,null,null,"",null,null,null,null,"",null,null,null,null,"",null,null,null,null,"",null,null,null,null,"",null,null,null,null,"",null,null,null,null,"",null,null,null,null,"",null,null,null,null,"",null,null,null,null,"",null,null,null,null,"",null,null,null,null,"",null,null,null,null,"",null,null,null,null,"",null,null,null,null,"",null,null,null,null,"",null,null,null,null,"",null,null,null,null,"",null,null,null,null,"",null,null,null,null,"",null,null,null,null,""]
["6.6.2.8, 6.9.1,\nNBR 9077 (item 4.8) e NBR 14718","p)","Na ausência de paredes, existe guarda-corpo associado na altura exigida pelas normas?",null,null,null,"X",null,null,null,null,"X",null,null,null,null,"X",null,null,null,null,"X",null,null,null,null,"",null,null,null,null,"",null,null,null,null,"",null,null,null,null,"",null,null,null,null,"",null,null,null,null,"",null,null,null,null,"",null,null,null,null,"",null,null,null,null,"",null,null,null,null,"",null,null,null,null,"",null,null,null,null,"",null,null,null,null,"",null,null,null,null,"",null,null,null,null,"",null,null,null,null,"",null,null,null,null,"",null,null,null,null,"",null,null,null,null,"",null,null,null,null,"",null,null,null,null,""]
["5.4.4.2","q)","Possui sinalização visual aplicada aos pisos e espelhos em suas bordas laterais e/ou nas projeções dos corrimãos, contrastante com o piso adjacente, preferencialmente fotoluminescente ou retroiluminada?",null,null,"X",null,"Não possui aplicação de sinalização visual nos pisos e espelhos da escada.",null,null,"X",null,"Não possui aplicação de sinalização visual nos pisos e espelhos da escada.",null,null,"X",null,"Não possui aplicação de sinalização visual nos pisos e espelhos da escada.",null,null,"X","","Não possui aplicação de sinalização visual nos pisos e espelhos da escada.",null,null,null,"",null,null,null,null,"",null,null,null,null,"",null,null,null,null,"",null,null,null,null,"",null,null,null,null,"",null,null,null,null,"",null,null,null,null,"",null,null,null,null,"",null,null,null,null,"",null,null,null,null,"",null,null,null,null,"",null,null,null,null,"",null,null,null,null,"",null,null,null,null,"",null,null,null,null,"",null,null,null,null,"",null,null,null,null,"",null,null,null,null,"",null,null,null,null,"",null,null,null,null,""]
["6.4.2","r)","No caso de existirem escadas compondo as rotas de fuga, são previstas, fora do fluxo de circulação, áreas de resgate com espaço reservado e demarcado para o posicionamento de pessoas em cadeira de rodas?",null,null,"X",null,"Não há demarcação do modulo de referência para pessoas em cadeira de rodas.",null,null,"X",null,"Não há demarcação do modulo de referência para pessoas em cadeira de rodas.",null,null,"X",null,"Não há demarcação do modulo de referência para pessoas em cadeira de rodas.",null,null,null,"X",null,null,null,null,"",null,null,null,null,"",null,null,null,null,"",null,null,null,null,"",null,null,null,null,"",null,null,null,null,"",null,null,null,null,"",null,null,null,null,"",null,null,null,null,"",null,null,null,null,"",null,null,null,null,"",null,null,null,null,"",null,null,null,null,"",null,null,null,null,"",null,null,null,null,"",null,null,null,null,"",null,null,null,null,"",null,null,null,null,"",null,null,null,null,"",null,null,null,null,"",null,null,null,null,""]
["5.5.1.3","s)","Nas escadas interligando vários pavimentos há, junto às portas corta-fogo, sinalização tátil, visual e/ou sonora, informando o número do pavimento?",null,null,"X",null,"Não há sinalização tátil. Nas escadas de emergência que interligam os diversos pavimentos, deve haver sinalização tátil junto às portas corta-fogo.",null,null,"X",null,"Não há sinalização tátil. Nas escadas de emergência que interligam os diversos pavimentos, deve haver sinalização tátil junto às portas corta-fogo.",null,null,"X",null,"Não há sinalização tátil. Nas escadas de emergência que interligam os diversos pavimentos, deve haver sinalização tátil junto às portas corta-fogo.",null,null,"X","","Não há sinalização tátil. Nas escadas de emergência que interligam os diversos pavimentos, deve haver sinalização tátil junto às portas corta-fogo.",null,null,null,"",null,null,null,null,"",null,null,null,null,"",null,null,null,null,"",null,null,null,null,"",null,null,null,null,"",null,null,null,null,"",null,null,null,null,"",null,null,null,null,"",null,null,null,null,"",null,null,null,null,"",null,null,null,null,"",null,null,null,null,"",null,null,null,null,"",null,null,null,null,"",null,null,null,null,"",null,null,null,null,"",null,null,null,null,"",null,null,null,null,"",null,null,null,null,"",null,null,null,null,""]
["5.5.2.1 e\n NBR16820","t)","O acesso às áreas de resgate está identificado conforme o disposto na ABNT NBR16820?",null,null,null,"X",null,null,null,null,"X",null,null,null,null,"X",null,null,null,null,"X",null,null,null,null,"",null,null,null,null,"",null,null,null,null,"",null,null,null,null,"",null,null,null,null,"",null,null,null,null,"",null,null,null,null,"",null,null,null,null,"",null,null,null,null,"",null,null,null,null,"",null,null,null,null,"",null,null,null,null,"",null,null,null,null,"",null,null,null,null,"",null,null,null,null,"",null,null,null,null,"",null,null,null,null,"",null,null,null,null,"",null,null,null,null,"",null,null,null,null,"",null,null,null,null,""]
["5.5.2.2","u)","A área de resgate possui sinalização horizontal, com o SIA com dimensões mínimas de 15 × 15 cm, junto à demarcação da área de espera para cadeira de rodas, nas dimensões do M.R. (0,80 m x 1,20 m)?",null,null,null,"X",null,null,null,null,"X",null,null,null,null,"X",null,null,null,null,"X",null,null,null,null,"",null,null,null,null,"",null,null,null,null,"",null,null,null,null,"",null,null,null,null,"",null,null,null,null,"",null,null,null,null,"",null,null,null,null,"",null,null,null,null,"",null,null,null,null,"",null,null,null,null,"",null,null,null,null,"",null,null,null,null,"",null,null,null,null,"",null,null,null,null,"",null,null,null,null,"",null,null,null,null,"",null,null,null,null,"",null,null,null,null,"",null,null,null,null,"",null,null,null,null,""]
["5.4.3","v)","Há sinalização em Braille, informando sobre os pavimentos, no início e no final das escadas, instalada na geratriz superior do prolongamento horizontal do corrimão?  ",null,null,null,"X",null,null,null,null,"X",null,null,null,null,"X",null,null,null,null,"X",null,null,null,null,"",null,null,null,null,"",null,null,null,null,"",null,null,null,null,"",null,null,null,null,"",null,null,null,null,"",null,null,null,null,"",null,null,null,null,"",null,null,null,null,"",null,null,null,null,"",null,null,null,null,"",null,null,null,null,"",null,null,null,null,"",null,null,null,null,"",null,null,null,null,"",null,null,null,null,"",null,null,null,null,"",null,null,null,null,"",null,null,null,null,"",null,null,null,null,"",null,null,null,null,""]
["6.8.2","w)","As dimensões dos pisos e espelhos dos degraus são constantes em toda a escada ou degraus\nisolados, atendendo ao seguinte:\na) 0,63 m ≤ p + 2e ≤ 0,65 m,\nb) pisos (p): 0,28 m ≤ p ≤ 0,32 m e\nc) espelhos (e): 0,16 m ≤ e ≤ 0,18 m",null,"X",null,null,null,null,"X",null,null,null,null,"X",null,null,null,null,"X",null,"",null,null,null,null,"",null,null,null,null,"",null,null,null,null,"",null,null,null,null,"",null,null,null,null,"",null,null,null,null,"",null,null,null,null,"",null,null,null,null,"",null,null,null,null,"",null,null,null,null,"",null,null,null,null,"",null,null,null,null,"",null,null,null,null,"",null,null,null,null,"",null,null,null,null,"",null,null,null,null,"",null,null,null,null,"",null,null,null,null,"",null,null,null,null,"",null,null,null,null,"",null,null,null,null,""]
["6.8.4","x)","Em construções novas, o primeiro e o último degraus de um lance de escada distam no mínimo 0,30 m da área de circulação adjacente?",null,"X",null,null,null,null,"X",null,null,null,null,"X",null,null,null,null,"X",null,"",null,null,null,null,"",null,null,null,null,"",null,null,null,null,"",null,null,null,null,"",null,null,null,null,"",null,null,null,null,"",null,null,null,null,"",null,null,null,null,"",null,null,null,null,"",null,null,null,null,"",null,null,null,null,"",null,null,null,null,"",null,null,null,null,"",null,null,null,null,"",null,null,null,null,"",null,null,null,null,"",null,null,null,null,"",null,null,null,null,"",null,null,null,null,"",null,null,null,null,"",null,null,null,null,""]
[]
[null,null,null,null,"SIM","NÃO","JUSTIFICATIVA",null,null,"SIM","NÃO","JUSTIFICATIVA",null,null,"SIM","NÃO","JUSTIFICATIVA",null,null,"SIM","NÃO","JUSTIFICATIVA",null,null,"SIM","NÃO","JUSTIFICATIVA",null,null,"SIM","NÃO","JUSTIFICATIVA",null,null,"SIM","NÃO","JUSTIFICATIVA",null,null,"SIM","NÃO","JUSTIFICATIVA",null,null,"SIM","NÃO","JUSTIFICATIVA",null,null,"SIM","NÃO","JUSTIFICATIVA",null,null,"SIM","NÃO","JUSTIFICATIVA",null,null,"SIM","NÃO","JUSTIFICATIVA",null,null,"SIM","NÃO","JUSTIFICATIVA",null,null,"SIM","NÃO","JUSTIFICATIVA",null,null,"SIM","NÃO","JUSTIFICATIVA",null,null,"SIM","NÃO","JUSTIFICATIVA",null,null,"SIM","NÃO","JUSTIFICATIVA",null,null,"SIM","NÃO","JUSTIFICATIVA",null,null,"SIM","NÃO","JUSTIFICATIVA",null,null,"SIM","NÃO","JUSTIFICATIVA",null,null,"SIM","NÃO","JUSTIFICATIVA",null,null,"SIM","NÃO","JUSTIFICATIVA",null,null,"SIM","NÃO","JUSTIFICATIVA",null,null,"SIM","NÃO","JUSTIFICATIVA",null,null,"SIM","NÃO","JUSTIFICATIVA"]
[null,null,"NECESSITA PROJETO ?",null,null,"X","É necessário a demarcação do modulo de referência para resgate de pessoas em cadeira de rodas. Deve haver sinalização tátil de alerta no início e no final de cada trecho de escada, sinalização visual nos pisos e espelhos da escada e deve haver sinalização tátil junto às portas corta-fogo. ",null,null,null,"X","É necessário a demarcação do modulo de referência para resgate de pessoas em cadeira de rodas. Deve haver sinalização tátil de alerta no início e no final de cada trecho de escada, sinalização visual nos pisos e espelhos da escada e deve haver sinalização tátil junto às portas corta-fogo. ",null,null,"X",null,"É necessário a demarcação do modulo de referência para resgate de pessoas em cadeira de rodas. Deve haver sinalização tátil de alerta no início e no final de cada trecho de escada, sinalização visual nos pisos e espelhos da escada e deve haver sinalização tátil junto às portas corta-fogo. ",null,null,null,"X","Deve haver sinalização tátil de alerta no início e no final de cada trecho de escada, sinalização visual nos pisos e espelhos da escada e deve haver sinalização tátil junto às portas corta-fogo."]

{"sheet":"4.2.3_Elevadores","index":5,"n_rows":31,"n_cols":128,"rows_kept":31,"cut":false,"hidden":false,"merged":[[30,106,30,107],[30,111,30,112],[30,116,30,117],[30,121,30,122],[30,126,30,127],[30,81,30,82],[30,86,30,87],[30,91,30,92],[30,96,30,97],[30,101,30,102],[29,106,29,107],[29,111,29,112],[29,116,29,117],[29,121,29,122],[29,126,29,127],[29,81,29,82],[29,86,29,87],[29,91,29,92],[29,96,29,97],[29,101,29,102],[8,121,9,121],[8,122,9,122],[8,124,8,125],[8,126,9,126],[8,127,9,127],[8,112,9,112],[8,114,8,115],[8,116,9,116],[8,117,9,117],[8,119,8,120],[8,104,8,105],[8,106,9,106],[8,107,9,107],[8,109,8,110],[8,111,9,111],[8,96,9,96],[8,97,9,97],[8,99,8,100],[8,101,9,101],[8,102,9,102],[8,87,9,87],[8,89,8,90],[8,91,9,91],[8,92,9,92],[8,94,8,95],[8,79,8,80],[8,81,9,81],[8,82,9,82],[8,84,8,85],[8,86,9,86],[6,104,6,107],[6,109,6,112],[6,114,6,117],[6,119,6,122],[6,124,6,127],[6,79,6,82],[6,84,6,87],[6,89,6,92],[6,94,6,97],[6,99,6,102],[29,6,29,7],[29,11,29,12],[29,16,29,17],[30,6,30,7],[30,11,30,12],[30,16,30,17],[8,12,9,12],[6,4,6,7],[6,9,6,12],[6,14,6,17],[8,11,9,11],[8,14,8,15],[8,16,9,16],[8,17,9,17],[0,0,0,2],[2,0,2,3],[8,4,8,5],[8,6,9,6],[8,9,8,10],[8,7,9,7],[6,19,6,22],[6,24,6,27],[6,29,6,32],[8,19,8,20],[8,21,9,21],[8,22,9,22],[8,24,8,25],[8,26,9,26],[8,27,9,27],[8,29,8,30],[8,31,9,31],[8,32,9,32],[29,21,29,22],[29,26,29,27],[29,31,29,32],[30,21,30,22],[30,26,30,27],[30,31,30,32],[6,34,6,37],[6,39,6,42],[6,44,6,47],[29,36,29,37],[29,41,29,42],[29,46,29,47],[6,49,6,52],[6,54,6,57],[6,59,6,62],[8,34,8,35],[8,36,9,36],[8,37,9,37],[8,39,8,40],[8,41,9,41],[8,42,9,42],[8,44,8,45],[8,46,9,46],[8,47,9,47],[8,49,8,50],[8,51,9,51],[8,52,9,52],[8,54,8,55],[8,56,9,56],[8,57,9,57],[8,59,8,60],[8,61,9,61],[8,62,9,62],[29,51,29,52],[29,56,29,57],[29,61,29,62],[29,66,29,67],[29,71,29,72],[29,76,29,77],[30,36,30,37],[30,41,30,42],[30,46,30,47],[30,51,30,52],[30,56,30,57],[30,66,30,67],[30,71,30,72],[30,76,30,77],[30,61,30,62],[6,64,6,67],[6,69,6,72],[6,74,6,77],[8,64,8,65],[8,66,9,66],[8,67,9,67],[8,69,8,70],[8,71,9,71],[8,72,9,72],[8,74,8,75],[8,76,9,76],[8,77,9,77]]}
[{"$f":"'1_Informações e outros'!C1","v":"Ministério da Mulher, da Família e dos Direitos Humanos\nSecretaria Nacional dos Direitos da Pessoa com Deficiência"}]
[]
["LAUDO / CHECK LIST DE ACESSIBILIDADE PARA AVALIAÇÃO DE CONFORMIDADE ÀS NORMAS DE ACESSIBILIDADE (CONFORME NBR 9050:2020) "]
[]
["UNIDADE / ÓRGÃO",null,{"$f":"'1_Informações e outros'!E5","v":"MINISTÉRIO DA MULHER, DA FAMÍLIA E DOS DIREITOS HUMANOS"}]
[]
[{"$f":"'1_Informações e outros'!M5","v":4},null,null,null,{"$f":"'4.1_Circul'!E7","v":"8º PAVTO"},null,null,null,null,{"$f":"'4.1_Circul'!J7","v":"9º PAVTO"},null,null,null,null,{"$f":"'4.1_Circul'!O7","v":"10º PAVTO"},null,null,null,null,{"$f":"'4.1_Circul'!T7","v":"TÉRREO"},null,null,null,null,{"$f":"'4.1_Circul'!Y7","v":"5º PAVTO"},null,null,null,null,{"$f":"'4.1_Circul'!AD7","v":"6º PAVTO"},null,null,null,null,{"$f":"'4.1_Circul'!AI7","v":"7º PAVTO"},null,null,null,null,{"$f":"'4.1_Circul'!AN7","v":"8º PAVTO"},null,null,null,null,{"$f":"'4.1_Circul'!AS7","v":"9º PAVTO"},null,null,null,null,{"$f":"'4.1_Circul'!AX7","v":"10º PAVTO"},null,null,null,null,{"$f":"'4.1_Circul'!BC7","v":"11º PAVTO"},null,null,null,null,{"$f":"'4.1_Circul'!BH7","v":"12º PAVTO"},null,null,null,null,{"$f":"'4.1_Circul'!BM7","v":"13º PAVTO"},null,null,null,null,{"$f":"'4.1_Circul'!BR7","v":"14º PAVTO"},null,null,null,null,{"$f":"'4.1_Circul'!BW7","v":"15º PAVTO"},null,null,null,null,{"$f":"'4.1_Circul'!CB7","v":"16º PAVTO"},null,null,null,null,{"$f":"'4.1_Circul'!CG7","v":"17º PAVTO"},null,null,null,null,{"$f":"'4.1_Circul'!CL7","v":"18º PAVTO"},null,null,null,null,{"$f":"'4.1_Circul'!CQ7","v":"19º PAVTO"},null,null,null,null,{"$f":"'4.1_Circul'!CV7","v":"20º PAVTO"},null,null,null,null,{"$f":"'4.1_Circul'!DA7","v":"21º PAVTO"},null,null,null,null,{"$f":"'4.1_Circul'!DF7","v":"22º PAVTO"},null,null,null,null,{"$f":"'4.1_Circul'!DK7","v":"23º PAVTO"},null,null,null,null,{"$f":"'4.1_Circul'!DP7","v":"24º PAVTO"},null,null,null,null,{"$f":"'4.1_Circul'!DU7","v":"25º PAVTO"}]
[]
[null,null,"4. EDIFICAÇÃO  - CIRCULAÇÃO INTERNA ",null,"ATENDE NBR9050-2020",null,"NÃO SE APLICA","OBSERVAÇÕES",null,"ATENDE NBR9050-2020",null,"NÃO SE APLICA","OBSERVAÇÕES",null,"ATENDE NBR9050-2020",null,"NÃO SE APLICA","OBSERVAÇÕES",null,"ATENDE NBR9050-2020",null,"NÃO SE APLICA","OBSERVAÇÕES",null,"ATENDE NBR9050-2020",null,"NÃO SE APLICA","OBSERVAÇÕES",null,"ATENDE NBR9050-2020",null,"NÃO SE APLICA","OBSERVAÇÕES",null,"ATENDE NBR9050-2020",null,"NÃO SE APLICA","OBSERVAÇÕES",null,"ATENDE NBR9050-2020",null,"NÃO SE APLICA","OBSERVAÇÕES",null,"ATENDE NBR9050-2020",null,"NÃO SE APLICA","OBSERVAÇÕES",null,"ATENDE NBR9050-2020",null,"NÃO SE APLICA","OBSERVAÇÕES",null,"ATENDE NBR9050-2020",null,"NÃO SE APLICA","OBSERVAÇÕES",null,"ATENDE NBR9050-2020",null,"NÃO SE APLICA","OBSERVAÇÕES",null,"ATENDE NBR9050-2020",null,"NÃO SE APLICA","OBSERVAÇÕES",null,"ATENDE NBR9050-2020",null,"NÃO SE APLICA","OBSERVAÇÕES",null,"ATENDE NBR9050-2020",null,"NÃO SE APLICA","OBSERVAÇÕES",null,"ATENDE NBR9050-2020",null,"NÃO SE APLICA","OBSERVAÇÕES",null,"ATENDE NBR9050-2020",null,"NÃO SE APLICA","OBSERVAÇÕES",null,"ATENDE NBR9050-2020",null,"NÃO SE APLICA","OBSERVAÇÕES",null,"ATENDE NBR9050-2020",null,"NÃO SE APLICA","OBSERVAÇÕES",null,"ATENDE NBR9050-2020",null,"NÃO SE APLICA","OBSERVAÇÕES",null,"ATENDE NBR9050-2020",null,"NÃO SE APLICA","OBSERVAÇÕES",null,"ATENDE NBR9050-2020",null,"NÃO SE APLICA","OBSERVAÇÕES",null,"ATENDE NBR9050-2020",null,"NÃO SE APLICA","OBSERVAÇÕES",null,"ATENDE NBR9050-2020",null,"NÃO SE APLICA","OBSERVAÇÕES",null,"ATENDE NBR9050-2020",null,"NÃO SE APLICA","OBSERVAÇÕES"]
["Item da NBR 9050",null,"4.2.3 QUANTO AOS ELEVADORES (NBR9050 E ABNT NBR NM 313) :",null,"SIM","NÃO",null,null,null,"SIM","NÃO",null,null,null,"SIM","NÃO",null,null,null,"SIM","NÃO",null,null,null,"SIM","NÃO",null,null,null,"SIM","NÃO",null,null,null,"SIM","NÃO",null,null,null,"SIM","NÃO",null,null,null,"SIM","NÃO",null,null,null,"SIM","NÃO",null,null,null,"SIM","NÃO",null,null,null,"SIM","NÃO",null,null,null,"SIM","NÃO",null,null,null,"SIM","NÃO",null,null,null,"SIM","NÃO",null,null,null,"SIM","NÃO",null,null,null,"SIM","NÃO",null,null,null,"SIM","NÃO",null,null,null,"SIM","NÃO",null,null,null,"SIM","NÃO",null,null,null,"SIM","NÃO",null,null,null,"SIM","NÃO",null,null,null,"SIM","NÃO",null,null,null,"SIM","NÃO",null,null,null,"SIM","NÃO"]
["6.1.1.2","a)","Existe elevador na edificação interligando todos os pavimentos?",null,"X",null,null,null,null,"X",null,null,null,null,"X",null,null,null,null,"X"]
["6.3.1","b)","O piso da cabine possui superfície rígida e antiderrapante?",null,"X",null,{"$f":"IF(OR(F$11=\"X\",G$11=\"X\"),\"X\",\"\")","v":""},null,null,"X",null,{"$f":"IF(OR(K$11=\"X\",L$11=\"X\"),\"X\",\"\")","v":""},null,null,"X",null,{"$f":"IF(OR(P$11=\"X\",Q$11=\"X\"),\"X\",\"\")","v":""},null,null,"X",null,{"$f":"IF(OR(U$11=\"X\",V$11=\"X\"),\"X\",\"\")","v":""},null,null,null,null,{"$f":"IF(OR(Z$11=\"X\",AA$11=\"X\"),\"X\",\"\")","v":""},null,null,null,null,{"$f":"IF(OR(AE$11=\"X\",AF$11=\"X\"),\"X\",\"\")","v":""},null,null,null,null,{"$f":"IF(OR(AJ$11=\"X\",AK$11=\"X\"),\"X\",\"\")","v":""},null,null,null,null,{"$f":"IF(OR(AO$11=\"X\",AP$11=\"X\"),\"X\",\"\")","v":""},null,null,null,null,{"$f":"IF(OR(AT$11=\"X\",AU$11=\"X\"),\"X\",\"\")","v":""},null,null,null,null,{"$f":"IF(OR(AY$11=\"X\",AZ$11=\"X\"),\"X\",\"\")","v":""},null,null,null,null,{"$f":"IF(OR(BD$11=\"X\",BE$11=\"X\"),\"X\",\"\")","v":""},null,null,null,null,{"$f":"IF(OR(BI$11=\"X\",BJ$11=\"X\"),\"X\",\"\")","v":""},null,null,null,null,{"$f":"IF(OR(BN$11=\"X\",BO$11=\"X\"),\"X\",\"\")","v":""},null,null,null,null,{"$f":"IF(OR(BS$11=\"X\",BT$11=\"X\"),\"X\",\"\")","v":""},null,null,null,null,{"$f":"IF(OR(BX$11=\"X\",BY$11=\"X\"),\"X\",\"\")","v":""},null,null,null,null,{"$f":"IF(OR(CC$11=\"X\",CD$11=\"X\"),\"X\",\"\")","v":""},null,null,null,null,{"$f":"IF(OR(CH$11=\"X\",CI$11=\"X\"),\"X\",\"\")","v":""},null,null,null,null,{"$f":"IF(OR(CM$11=\"X\",CN$11=\"X\"),\"X\",\"\")","v":""},null,null,null,null,{"$f":"IF(OR(CR$11=\"X\",CS$11=\"X\"),\"X\",\"\")","v":""},null,null,null,null,{"$f":"IF(OR(CW$11=\"X\",CX$11=\"X\"),\"X\",\"\")","v":""},null,null,null,null,{"$f":"IF(OR(DB$11=\"X\",DC$11=\"X\"),\"X\",\"\")","v":""},null,null,null,null,{"$f":"IF(OR(DG$11=\"X\",DH$11=\"X\"),\"X\",\"\")","v":""},null,null,null,null,{"$f":"IF(OR(DL$11=\"X\",DM$11=\"X\"),\"X\",\"\")","v":""},null,null,null,null,{"$f":"IF(OR(DQ$11=\"X\",DR$11=\"X\"),\"X\",\"\")","v":""},null,null,null,null,{"$f":"IF(OR(DV$11=\"X\",DW$11=\"X\"),\"X\",\"\")","v":""}]
["Anexo B\n(informativo)","c)","O piso da cabine contrasta com o da circulação?",null,"X",null,{"$f":"IF(OR(F$11=\"X\",G$11=\"X\"),\"X\",\"\")","v":""},null,null,"X",null,{"$f":"IF(OR(K$11=\"X\",L$11=\"X\"),\"X\",\"\")","v":""},null,null,"X",null,{"$f":"IF(OR(P$11=\"X\",Q$11=\"X\"),\"X\",\"\")","v":""},null,null,"X",null,{"$f":"IF(OR(U$11=\"X\",V$11=\"X\"),\"X\",\"\")","v":""},null,null,null,null,{"$f":"IF(OR(Z$11=\"X\",AA$11=\"X\"),\"X\",\"\")","v":""},null,null,null,null,{"$f":"IF(OR(AE$11=\"X\",AF$11=\"X\"),\"X\",\"\")","v":""},null,null,null,null,{"$f":"IF(OR(AJ$11=\"X\",AK$11=\"X\"),\"X\",\"\")","v":""},null,null,null,null,{"$f":"IF(OR(AO$11=\"X\",AP$11=\"X\"),\"X\",\"\")","v":""},null,null,null,null,{"$f":"IF(OR(AT$11=\"X\",AU$11=\"X\"),\"X\",\"\")","v":""},null,null,null,null,{"$f":"IF(OR(AY$11=\"X\",AZ$11=\"X\"),\"X\",\"\")","v":""},null,null,null,null,{"$f":"IF(OR(BD$11=\"X\",BE$11=\"X\"),\"X\",\"\")","v":""},null,null,null,null,{"$f":"IF(OR(BI$11=\"X\",BJ$11=\"X\"),\"X\",\"\")","v":""},null,null,null,null,{"$f":"IF(OR(BN$11=\"X\",BO$11=\"X\"),\"X\",\"\")","v":""},null,null,null,null,{"$f":"IF(OR(BS$11=\"X\",BT$11=\"X\"),\"X\",\"\")","v":""},null,null,null,null,{"$f":"IF(OR(BX$11=\"X\",BY$11=\"X\"),\"X\",\"\")","v":""},null,null,null,null,{"$f":"IF(OR(CC$11=\"X\",CD$11=\"X\"),\"X\",\"\")","v":""},null,null,null,null,{"$f":"IF(OR(CH$11=\"X\",CI$11=\"X\"),\"X\",\"\")","v":""},null,null,null,null,{"$f":"IF(OR(CM$11=\"X\",CN$11=\"X\"),\"X\",\"\")","v":""},null,null,null,null,{"$f":"IF(OR(CR$11=\"X\",CS$11=\"X\"),\"X\",\"\")","v":""},null,null,null,null,{"$f":"IF(OR(CW$11=\"X\",CX$11=\"X\"),\"X\",\"\")","v":""},null,null,null,null,{"$f":"IF(OR(DB$11=\"X\",DC$11=\"X\"),\"X\",\"\")","v":""},null,null,null,null,{"$f":"IF(OR(DG$11=\"X\",DH$11=\"X\"),\"X\",\"\")","v":""},null,null,null,null,{"$f":"IF(OR(DL$11=\"X\",DM$11=\"X\"),\"X\",\"\")","v":""},null,null,null,null,{"$f":"IF(OR(DQ$11=\"X\",DR$11=\"X\"),\"X\",\"\")","v":""},null,null,null,null,{"$f":"IF(OR(DV$11=\"X\",DW$11=\"X\"),\"X\",\"\")","v":""}]
["Anexo B\n(informativo)","d)"," As portas do elevador contrastam com o acabamento da parede circundante?",null,"X",null,"",null,null,"X",null,"",null,null,"X",null,"",null,null,"X",null,"",null,null,null,null,"",null,null,null,null,"",null,null,null,null,"",null,null,null,null,"",null,null,null,null,"",null,null,null,null,"",null,null,null,null,"",null,null,null,null,"",null,null,null,null,"",null,null,null,null,"",null,null,null,null,"",null,null,null,null,"",null,null,null,null,"",null,null,null,null,"",null,null,null,null,"",null,null,null,null,"",null,null,null,null,"",null,null,null,null,"",null,null,null,null,"",null,null,null,null,"",null,null,null,null,""]
["NBR NM 313 \n(5.3.1)","e)","Os elevadores, quando projetados para 1 cadeira de rodas e 1 outro usuário, possuem cabine com dimensões mínimas de 1,40 m x 1,10 m?",null,"X",null,"",null,null,"X",null,"",null,null,"X",null,"",null,null,"X",null,"",null,null,null,null,"",null,null,null,null,"",null,null,null,null,"",null,null,null,null,"",null,null,null,null,"",null,null,null,null,"",null,null,null,null,"",null,null,null,null,"",null,null,null,null,"",null,null,null,null,"",null,null,null,null,"",null,null,null,null,"",null,null,null,null,"",null,null,null,null,"",null,null,null,null,"",null,null,null,null,"",null,null,null,null,"",null,null,null,null,"",null,null,null,null,"",null,null,null,null,"",null,null,null,null,""]
[" NBR NM 313 (Tabela 1) ","f)","Em elevadores, quando projetados para 1 cadeira de rodas e 1 outro usuário, as portas, quando abertas, possuem vão livre de 0,80 m x 2,10 m?",null,"X",null,"",null,null,"X",null,"",null,null,"X",null,"",null,null,"X",null,"",null,null,null,null,"",null,null,null,null,"",null,null,null,null,"",null,null,null,null,"",null,null,null,null,"",null,null,null,null,"",null,null,null,null,"",null,null,null,null,"",null,null,null,null,"",null,null,null,null,"",null,null,null,null,"",null,null,null,null,"",null,null,null,null,"",null,null,null,null,"",null,null,null,null,"",null,null,null,null,"",null,null,null,null,"",null,null,null,null,"",null,null,null,null,"",null,null,null,null,"",null,null,null,null,""]
["6.10.1 e \nNBR16537 (Seção 6)","g)","Possui sinalização com piso tátil de alerta junto à porta do elevador?",null,null,"X","","A sinalização tátil de alerta deve ser aplicada em todos os elevadores na largura do vão da porta do equipamento. Deve haver sinalização tátil e visual, a sinalização tátil direcional deve levar para um ou mais elevadores, e o direcionamento com o piso tátil, deve direcionar a pessoa com deficiência visual dos equipamentos para áreas de atendimento. O elevador deve possuir a sinalização visual, com o símbolo internacional de acesso - SIA, e o elevador com a sinalização preferencial deve indicar os beneficiários. O piso tátil direcional existente no pavimento está de forma ERRADA, não leva a pessoa com deficiência visual do elevador até o local de informações, pois o piso tátil está finalizado antes de chegar ao balcão. Todos os pavimentos devem ser padronizados, a sinalização tátil direcional deve encontrar a sinalização tátil de alerta do elevador, sendo posicionada no lado onde se encontra a botoeira. ",null,null,"X","","A sinalização tátil de alerta deve ser aplicada em todos os elevadores na largura do vão da porta do equipamento. Deve haver sinalização tátil e visual, a sinalização tátil direcional deve levar para um ou mais elevadores, e o direcionamento com o piso tátil, deve direcionar a pessoa com deficiência visual dos equipamentos para áreas de atendimento. O elevador deve possuir a sinalização visual, com o símbolo internacional de acesso - SIA, e o elevador com a sinalização preferencial deve indicar os beneficiários. O piso tátil direcional existente no pavimento está de forma ERRADA, não leva a pessoa com deficiência visual do elevador até o local de informações, pois o piso tátil está finalizado antes de chegar ao balcão. Todos os pavimentos devem ser padronizados, a sinalização tátil direcional deve encontrar a sinalização tátil de alerta do elevador, sendo posicionada no lado onde se encontra a botoeira. ",null,null,"X","","A sinalização tátil de alerta deve ser aplicada em todos os elevadores na largura do vão da porta do equipamento. Deve haver sinalização tátil e visual, a sinalização tátil direcional deve levar para um ou mais elevadores, e o direcionamento com o piso tátil, deve direcionar a pessoa com deficiência visual dos equipamentos para áreas de atendimento. O elevador deve possuir a sinalização visual, com o símbolo internacional de acesso - SIA, e o elevador com a sinalização preferencial deve indicar os beneficiários. O piso tátil direcional existente no pavimento está de forma ERRADA, não leva a pessoa com deficiência visual do elevador até o local de informações, pois o piso tátil está finalizado antes de chegar ao balcão. Todos os pavimentos devem ser padronizados, a sinalização tátil direcional deve encontrar a sinalização tátil de alerta do elevador, sendo posicionada no lado onde se encontra a botoeira. ",null,null,"X","","Deve haver sinalização tátil e visual, a sinalização deve ser com o símbolo internacional de acesso - SIA. O elevador com a sinalização preferencial deve indicar os beneficiários. A sinalização tátil de alerta deve ser aplicada em todos os elevadores na largura do vão da porta do equipamento e a sinalização tátil direcional deve encontrar a sinalização tátil de alerta do elevador, sendo posicionada no lado onde se encontra a botoeira.",null,null,null,"",null,null,null,null,"",null,null,null,null,"",null,null,null,null,"",null,null,null,null,"",null,null,null,null,"",null,null,null,null,"",null,null,null,null,"",null,null,null,null,"",null,null,null,null,"",null,null,null,null,"",null,null,null,null,"",null,null,null,null,"",null,null,null,null,"",null,null,null,null,"",null,null,null,null,"",null,null,null,null,"",null,null,null,null,"",null,null,null,null,"",null,null,null,null,"",null,null,null,null,""]
["NBR NM 313 (5.3.2.3)","h)","Há espelho ou vidro que permita ao usuário de cadeira de rodas observar obstáculos enquanto se move para trás ao sair do elevador?",null,"X",null,"",null,null,"X",null,"",null,null,"X",null,"",null,null,"X",null,"",null,null,null,null,"",null,null,null,null,"",null,null,null,null,"",null,null,null,null,"",null,null,null,null,"",null,null,null,null,"",null,null,null,null,"",null,null,null,null,"",null,null,null,null,"",null,null,null,null,"",null,null,null,null,"",null,null,null,null,"",null,null,null,null,"",null,null,null,null,"",null,null,null,null,"",null,null,null,null,"",null,null,null,null,"",null,null,null,null,"",null,null,null,null,"",null,null,null,null,"",null,null,null,null,""]
["NBR NM 313 (5.3.2.1)","i)","Possui corrimão fixado nos painéis laterais e de fundo atendendo a altura entre 0,85 m e 0,90 m da sua face superior ao piso?",null,"X",null,"","Apenas um dos elevadores possui corrimão nas laterais de seção circular, o elevador preferencial. O corrimão deve ser entre 40 mm e 45 mm, com extremidades fechadas e não ter cantos vivos. Sendo preferencialmente de seção circular.",null,"X",null,"","Apenas um dos elevadores possui corrimão nas laterais de seção circular, o elevador preferencial. O corrimão deve ser entre 40 mm e 45 mm, com extremidades fechadas e não ter cantos vivos. Sendo preferencialmente de seção circular.",null,"X",null,"","Apenas um dos elevadores possui corrimão nas laterais de seção circular, o elevador preferencial. O corrimão deve ser entre 40 mm e 45 mm, com extremidades fechadas e não ter cantos vivos. Sendo preferencialmente de seção circular.",null,"X",null,"","Apenas um dos elevadores possui corrimão nas laterais de seção circular, o elevador preferencial. O corrimão deve ser entre 40 mm e 45 mm, com extremidades fechadas e não ter cantos vivos. Sendo preferencialmente de seção circular.",null,null,null,"",null,null,null,null,"",null,null,null,null,"",null,null,null,null,"",null,null,null,null,"",null,null,null,null,"",null,null,null,null,"",null,null,null,null,"",null,null,null,null,"",null,null,null,null,"",null,null,null,null,"",null,null,null,null,"",null,null,null,null,"",null,null,null,null,"",null,null,null,null,"",null,null,null,null,"",null,null,null,null,"",null,null,null,null,"",null,null,null,null,"",null,null,null,null,"",null,null,null,null,""]
["6.10.1","j)","Possui sinalização sonora informando o pavimento em equipamentos com mais de duas paradas?",null,"X",null,"","É necessário ter sinalização sonora nas botoeiras externa para a identificação da letra que o elevador estará disponível.",null,"X",null,"","É necessário ter sinalização sonora nas botoeiras externa para a identificação da letra que o elevador estará disponível.",null,"X",null,"","É necessário ter sinalização sonora nas botoeiras externa para a identificação da letra que o elevador estará disponível.",null,"X",null,"","É necessário ter sinalização sonora nas botoeiras externa para a identificação da letra que o elevador estará disponível.",null,null,null,"",null,null,null,null,"",null,null,null,null,"",null,null,null,null,"",null,null,null,null,"",null,null,null,null,"",null,null,null,null,"",null,null,null,null,"",null,null,null,null,"",null,null,null,null,"",null,null,null,null,"",null,null,null,null,"",null,null,null,null,"",null,null,null,null,"",null,null,null,null,"",null,null,null,null,"",null,null,null,null,"",null,null,null,null,"",null,null,null,null,"",null,null,null,null,"",null,null,null,null,""]
["NBR NM 313\n(5.4.3)","k)","Junto à porta do elevador há dispositivo entre 1,80 m e 2,50 m que emite sinais sonoro e visual, indicando o sentido em que a cabine se movimenta?",null,"X",null,"",null,null,"X",null,"",null,null,"X",null,"",null,null,"X",null,"",null,null,null,null,"",null,null,null,null,"",null,null,null,null,"",null,null,null,null,"",null,null,null,null,"",null,null,null,null,"",null,null,null,null,"",null,null,null,null,"",null,null,null,null,"",null,null,null,null,"",null,null,null,null,"",null,null,null,null,"",null,null,null,null,"",null,null,null,null,"",null,null,null,null,"",null,null,null,null,"",null,null,null,null,"",null,null,null,null,"",null,null,null,null,"",null,null,null,null,"",null,null,null,null,""]
["NBR NM 313\n(Tabela 2)","l)","A botoeira do pavimento está localizada entre 0,90 m e 1,10 m do piso?",null,"X",null,"",null,null,"X",null,"",null,null,"X",null,"",null,null,"X",null,"","",null,null,null,"",null,null,null,null,"",null,null,null,null,"",null,null,null,null,"",null,null,null,null,"",null,null,null,null,"",null,null,null,null,"",null,null,null,null,"",null,null,null,null,"",null,null,null,null,"",null,null,null,null,"",null,null,null,null,"",null,null,null,null,"",null,null,null,null,"",null,null,null,null,"",null,null,null,null,"",null,null,null,null,"",null,null,null,null,"",null,null,null,null,"",null,null,null,null,"",null,null,null,null,""]
["NBR NM 313\n(Tabela 2)","m)","A botoeira da cabine está localizada entre 0,90 m e 1,30 m do piso?",null,"X",null,"",null,null,"X",null,"",null,null,"X",null,"",null,null,"X",null,"",null,null,null,null,"",null,null,null,null,"",null,null,null,null,"",null,null,null,null,"",null,null,null,null,"",null,null,null,null,"",null,null,null,null,"",null,null,null,null,"",null,null,null,null,"",null,null,null,null,"",null,null,null,null,"",null,null,null,null,"",null,null,null,null,"",null,null,null,null,"",null,null,null,null,"",null,null,null,null,"",null,null,null,null,"",null,null,null,null,"",null,null,null,null,"",null,null,null,null,"",null,null,null,null,""]
["5.4.5.1","n)"," As botoeiras têm informações em relevo e em Braille de sua operação e estão compatíveis com a ABNT NM 313 e ABNT NBR ISO 9386-1?",null,null,"X","","As botoeiras externas e internas nas cabines devem indicando os andares em relevo e em braile.",null,null,"X","","As botoeiras externas e internas nas cabines devem indicando os andares em relevo e em braile.",null,null,"X","","As botoeiras externas e internas nas cabines devem indicando os andares em relevo e em braile.",null,null,"X","","As botoeiras externas e internas nas cabines devem indicando os andares em relevo e em braile.",null,null,null,"",null,null,null,null,"",null,null,null,null,"",null,null,null,null,"",null,null,null,null,"",null,null,null,null,"",null,null,null,null,"",null,null,null,null,"",null,null,null,null,"",null,null,null,null,"",null,null,null,null,"",null,null,null,null,"",null,null,null,null,"",null,null,null,null,"",null,null,null,null,"",null,null,null,null,"",null,null,null,null,"",null,null,null,null,"",null,null,null,null,"",null,null,null,null,"",null,null,null,null,""]
["NBR NM 313\n(5.3.3.1)","o)","O desnível entre o piso da cabine e o piso externo é de no máximo 15 mm?",null,"X",null,"",null,null,"X",null,"",null,null,"X",null,"",null,null,"X",null,"",null,null,null,null,"",null,null,null,null,"",null,null,null,null,"",null,null,null,null,"",null,null,null,null,"",null,null,null,null,"",null,null,null,null,"",null,null,null,null,"",null,null,null,null,"",null,null,null,null,"",null,null,null,null,"",null,null,null,null,"",null,null,null,null,"",null,null,null,null,"",null,null,null,null,"",null,null,null,null,"",null,null,null,null,"",null,null,null,null,"",null,null,null,null,"",null,null,null,null,"",null,null,null,null,""]
["NBR NM 313\n(5.3.3.2)","p)","A distância horizontal entre o piso da cabine e o piso externo é de no máximo 35 mm?",null,"X",null,"",null,null,"X",null,"",null,null,"X",null,"",null,null,"X",null,"",null,null,null,null,"",null,null,null,null,"",null,null,null,null,"",null,null,null,null,"",null,null,null,null,"",null,null,null,null,"",null,null,null,null,"",null,null,null,null,"",null,null,null,null,"",null,null,null,null,"",null,null,null,null,"",null,null,null,null,"",null,null,null,null,"",null,null,null,null,"",null,null,null,null,"",null,null,null,null,"",null,null,null,null,"",null,null,null,null,"",null,null,null,null,"",null,null,null,null,"",null,null,null,null,""]
["5.4.5.2","q)","O número do pavimento está localizado nos batentes externos, indicando o andar, em relevo e em Braille e instalado a uma altura entre 1,20 m e 1,60 m medida do piso?",null,null,"X","","As botoeiras externas e internas nas cabines devem indicando os andares em relevo e em braile.",null,null,"X","","As botoeiras externas e internas nas cabines devem indicando os andares em relevo e em braile.",null,null,"X","","As botoeiras externas e internas nas cabines devem indicando os andares em relevo e em braile.",null,null,"X","","As botoeiras externas e internas nas cabines devem indicando os andares em relevo e em braile.",null,null,null,"",null,null,null,null,"",null,null,null,null,"",null,null,null,null,"",null,null,null,null,"",null,null,null,null,"",null,null,null,null,"",null,null,null,null,"",null,null,null,null,"",null,null,null,null,"",null,null,null,null,"",null,null,null,null,"",null,null,null,null,"",null,null,null,null,"",null,null,null,null,"",null,null,null,null,"",null,null,null,null,"",null,null,null,null,"",null,null,null,null,"",null,null,null,null,"",null,null,null,null,""]
["NBR NM 313\n(5.4.4.3)","r)","Há interfone ou outra forma de comunicação para solicitar auxílio?  ",null,"X",null,"",null,null,"X",null,"",null,null,"X",null,"",null,null,"X",null,"",null,null,null,null,"",null,null,null,null,"",null,null,null,null,"",null,null,null,null,"",null,null,null,null,"",null,null,null,null,"",null,null,null,null,"",null,null,null,null,"",null,null,null,null,"",null,null,null,null,"",null,null,null,null,"",null,null,null,null,"",null,null,null,null,"",null,null,null,null,"",null,null,null,null,"",null,null,null,null,"",null,null,null,null,"",null,null,null,null,"",null,null,null,null,"",null,null,null,null,"",null,null,null,null,""]
[]
[null,null,null,null,"SIM","NÃO","JUSTIFICATIVA",null,null,"SIM","NÃO","JUSTIFICATIVA",null,null,"SIM","NÃO","JUSTIFICATIVA",null,null,"SIM","NÃO","JUSTIFICATIVA",null,null,"SIM","NÃO","JUSTIFICATIVA",null,null,"SIM","NÃO","JUSTIFICATIVA",null,null,"SIM","NÃO","JUSTIFICATIVA",null,null,"SIM","NÃO","JUSTIFICATIVA",null,null,"SIM","NÃO","JUSTIFICATIVA",null,null,"SIM","NÃO","JUSTIFICATIVA",null,null,"SIM","NÃO","JUSTIFICATIVA",null,null,"SIM","NÃO","JUSTIFICATIVA",null,null,"SIM","NÃO","JUSTIFICATIVA",null,null,"SIM","NÃO","JUSTIFICATIVA",null,null,"SIM","NÃO","JUSTIFICATIVA",null,null,"SIM","NÃO","JUSTIFICATIVA",null,null,"SIM","NÃO","JUSTIFICATIVA",null,null,"SIM","NÃO","JUSTIFICATIVA",null,null,"SIM","NÃO","JUSTIFICATIVA",null,null,"SIM","NÃO","JUSTIFICATIVA",null,null,"SIM","NÃO","JUSTIFICATIVA",null,null,"SIM","NÃO","JUSTIFICATIVA",null,null,"SIM","NÃO","JUSTIFICATIVA",null,null,"SIM","NÃO","JUSTIFICATIVA",null,null,"SIM","NÃO","JUSTIFICATIVA"]
[null,null,"NECESSITA PROJETO ?",null,null,"X","Deve ser feita todas as adaptações de sinalizações visual, táteis de alerta e direcional nos elevadores. A sinalização tátil direcional deve levar para um ou mais elevadores, e o direcionamento com o piso tátil, deve direcionar a pessoa com deficiência visual dos equipamentos para áreas de atendimento ou informações. O elevador deve ter a sinalização visual com o símbolo internacional de acesso – SIA, e as botoeiras devem possuir o relevo em braile. Fazer todos os ajustem apontados nos itens.",null,null,null,"X","Deve ser feita todas as adaptações de sinalizações visual, táteis de alerta e direcional nos elevadores. A sinalização tátil direcional deve levar para um ou mais elevadores, e o direcionamento com o piso tátil, deve direcionar a pessoa com deficiência visual dos equipamentos para áreas de atendimento ou informações. O elevador deve ter a sinalização visual com o símbolo internacional de acesso – SIA, e as botoeiras devem possuir o relevo em braile. Fazer todos os ajustem apontados nos itens.",null,null,null,"X","Deve ser feita todas as adaptações de sinalizações visual, táteis de alerta e direcional nos elevadores. A sinalização tátil direcional deve levar para um ou mais elevadores, e o direcionamento com o piso tátil, deve direcionar a pessoa com deficiência visual dos equipamentos para áreas de atendimento ou informações. O elevador deve ter a sinalização visual com o símbolo internacional de acesso – SIA, e as botoeiras devem possuir o relevo em braile. Fazer todos os ajustem apontados nos itens.",null,null,null,"X","Deve ser feita todas as adaptações de sinalizações táteis de alerta nas portas de todos os elevadores. O elevador deve ter a sinalização visual com o símbolo internacional de acesso – SIA, e as botoeiras devem possuir o relevo em braile. Fazer todos os ajustem apontados nos itens."]

{"sheet":"4.2.4_Plataformas","index":6,"n_rows":25,"n_cols":128,"rows_kept":25,"cut":false,"hidden":false,"merged":[[24,106,24,107],[24,111,24,112],[24,116,24,117],[24,121,24,122],[24,126,24,127],[24,81,24,82],[24,86,24,87],[24,91,24,92],[24,96,24,97],[24,101,24,102],[23,106,23,107],[23,111,23,112],[23,116,23,117],[23,121,23,122],[23,126,23,127],[23,81,23,82],[23,86,23,87],[23,91,23,92],[23,96,23,97],[23,101,23,102],[8,121,9,121],[8,122,9,122],[8,124,8,125],[8,126,9,126],[8,127,9,127],[8,112,9,112],[8,114,8,115],[8,116,9,116],[8,117,9,117],[8,119,8,120],[8,104,8,105],[8,106,9,106],[8,107,9,107],[8,109,8,110],[8,111,9,111],[8,96,9,96],[8,97,9,97],[8,99,8,100],[8,101,9,101],[8,102,9,102],[8,87,9,87],[8,89,8,90],[8,91,9,91],[8,92,9,92],[8,94,8,95],[8,79,8,80],[8,81,9,81],[8,82,9,82],[8,84,8,85],[8,86,9,86],[6,104,6,107],[6,109,6,112],[6,114,6,117],[6,119,6,122],[6,124,6,127],[6,79,6,82],[6,84,6,87],[6,89,6,92],[6,94,6,97],[6,99,6,102],[23,6,23,7],[23,11,23,12],[23,16,23,17],[24,6,24,7],[24,11,24,12],[24,16,24,17],[0,0,0,2],[2,0,2,3],[6,4,6,7],[6,9,6,12],[6,14,6,17],[8,4,8,5],[8,6,9,6],[8,9,8,10],[8,11,9,11],[8,14,8,15],[8,16,9,16],[8,7,9,7],[8,12,9,12],[8,17,9,17],[23,21,23,22],[23,26,23,27],[23,31,23,32],[24,21,24,22],[24,26,24,27],[24,31,24,32],[6,34,6,37],[6,39,6,42],[6,44,6,47],[23,36,23,37],[23,41,23,42],[23,46,23,47],[6,19,6,22],[6,24,6,27],[6,29,6,32],[8,19,8,20],[8,21,9,21],[8,22,9,22],[8,24,8,25],[8,26,9,26],[8,27,9,27],[8,29,8,30],[8,31,9,31],[8,32,9,32],[6,49,6,52],[6,54,6,57],[6,59,6,62],[8,34,8,35],[8,36,9,36],[8,37,9,37],[8,39,8,40],[8,41,9,41],[8,42,9,42],[8,44,8,45],[8,46,9,46],[8,47,9,47],[8,49,8,50],[8,51,9,51],[8,52,9,52],[8,54,8,55],[8,56,9,56],[8,57,9,57],[8,59,8,60],[8,61,9,61],[8,62,9,62],[23,51,23,52],[23,56,23,57],[23,61,23,62],[23,66,23,67],[23,71,23,72],[23,76,23,77],[24,36,24,37],[24,41,24,42],[24,46,24,47],[24,51,24,52],[24,56,24,57],[24,66,24,67],[24,71,24,72],[24,76,24,77],[24,61,24,62],[6,64,6,67],[6,69,6,72],[6,74,6,77],[8,64,8,65],[8,66,9,66],[8,67,9,67],[8,69,8,70],[8,71,9,71],[8,72,9,72],[8,74,8,75],[8,76,9,76],[8,77,9,77]]}
[{"$f":"'1_Informações e outros'!C1","v":"Ministério da Mulher, da Família e dos Direitos Humanos\nSecretaria Nacional dos Direitos da Pessoa com Deficiência"}]
[]
["LAUDO / CHECK LIST DE ACESSIBILIDADE PARA AVALIAÇÃO DE CONFORMIDADE ÀS NORMAS DE ACESSIBILIDADE (CONFORME NBR 9050:2020) "]
[]
["UNIDADE / ÓRGÃO",null,{"$f":"'1_Informações e outros'!E5","v":"MINISTÉRIO DA MULHER, DA FAMÍLIA E DOS DIREITOS HUMANOS"}]
[]
[{"$f":"'1_Informações e outros'!M5","v":4},null,null,null,{"$f":"'4.1_Circul'!E7","v":"8º PAVTO"},null,null,null,null,{"$f":"'4.1_Circul'!J7","v":"9º PAVTO"},null,null,null,null,{"$f":"'4.1_Circul'!O7","v":"10º PAVTO"},null,null,null,null,{"$f":"'4.1_Circul'!T7","v":"TÉRREO"},null,null,null,null,{"$f":"'4.1_Circul'!Y7","v":"5º PAVTO"},null,null,null,null,{"$f":"'4.1_Circul'!AD7","v":"6º PAVTO"},null,null,null,null,{"$f":"'4.1_Circul'!AI7","v":"7º PAVTO"},null,null,null,null,{"$f":"'4.1_Circul'!AN7","v":"8º PAVTO"},null,null,null,null,{"$f":"'4.1_Circul'!AS7","v":"9º PAVTO"},null,null,null,null,{"$f":"'4.1_Circul'!AX7","v":"10º PAVTO"},null,null,null,null,{"$f":"'4.1_Circul'!BC7","v":"11º PAVTO"},null,null,null,null,{"$f":"'4.1_Circul'!BH7","v":"12º PAVTO"},null,null,null,null,{"$f":"'4.1_Circul'!BM7","v":"13º PAVTO"},null,null,null,null,{"$f":"'4.1_Circul'!BR7","v":"14º PAVTO"},null,null,null,null,{"$f":"'4.1_Circul'!BW7","v":"15º PAVTO"},null,null,null,null,{"$f":"'4.1_Circul'!CB7","v":"16º PAVTO"},null,null,null,null,{"$f":"'4.1_Circul'!CG7","v":"17º PAVTO"},null,null,null,null,{"$f":"'4.1_Circul'!CL7","v":"18º PAVTO"},null,null,null,null,{"$f":"'4.1_Circul'!CQ7","v":"19º PAVTO"},null,null,null,null,{"$f":"'4.1_Circul'!CV7","v":"20º PAVTO"},null,null,null,null,{"$f":"'4.1_Circul'!DA7","v":"21º PAVTO"},null,null,null,null,{"$f":"'4.1_Circul'!DF7","v":"22º PAVTO"},null,null,null,null,{"$f":"'4.1_Circul'!DK7","v":"23º PAVTO"},null,null,null,null,{"$f":"'4.1_Circul'!DP7","v":"24º PAVTO"},null,null,null,null,{"$f":"'4.1_Circul'!DU7","v":"25º PAVTO"}]
[]
[null,null,"4. EDIFICAÇÃO  - CIRCULAÇÃO INTERNA ",null,"ATENDE NBR9050-2020",null,"NÃO SE APLICA","OBSERVAÇÕES",null,"ATENDE NBR9050-2020",null,"NÃO SE APLICA","OBSERVAÇÕES",null,"ATENDE NBR9050-2020",null,"NÃO SE APLICA","OBSERVAÇÕES",null,"ATENDE NBR9050-2020",null,"NÃO SE APLICA","OBSERVAÇÕES",null,"ATENDE NBR9050-2020",null,"NÃO SE APLICA","OBSERVAÇÕES",null,"ATENDE NBR9050-2020",null,"NÃO SE APLICA","OBSERVAÇÕES",null,"ATENDE NBR9050-2020",null,"NÃO SE APLICA","OBSERVAÇÕES",null,"ATENDE NBR9050-2020",null,"NÃO SE APLICA","OBSERVAÇÕES",null,"ATENDE NBR9050-2020",null,"NÃO SE APLICA","OBSERVAÇÕES",null,"ATENDE NBR9050-2020",null,"NÃO SE APLICA","OBSERVAÇÕES",null,"ATENDE NBR9050-2020",null,"NÃO SE APLICA","OBSERVAÇÕES",null,"ATENDE NBR9050-2020",null,"NÃO SE APLICA","OBSERVAÇÕES",null,"ATENDE NBR9050-2020",null,"NÃO SE APLICA","OBSERVAÇÕES",null,"ATENDE NBR9050-2020",null,"NÃO SE APLICA","OBSERVAÇÕES",null,"ATENDE NBR9050-2020",null,"NÃO SE APLICA","OBSERVAÇÕES",null,"ATENDE NBR9050-2020",null,"NÃO SE APLICA","OBSERVAÇÕES",null,"ATENDE NBR9050-2020",null,"NÃO SE APLICA","OBSERVAÇÕES",null,"ATENDE NBR9050-2020",null,"NÃO SE APLICA","OBSERVAÇÕES",null,"ATENDE NBR9050-2020",null,"NÃO SE APLICA","OBSERVAÇÕES",null,"ATENDE NBR9050-2020",null,"NÃO SE APLICA","OBSERVAÇÕES",null,"ATENDE NBR9050-2020",null,"NÃO SE APLICA","OBSERVAÇÕES",null,"ATENDE NBR9050-2020",null,"NÃO SE APLICA","OBSERVAÇÕES",null,"ATENDE NBR9050-2020",null,"NÃO SE APLICA","OBSERVAÇÕES",null,"ATENDE NBR9050-2020",null,"NÃO SE APLICA","OBSERVAÇÕES",null,"ATENDE NBR9050-2020",null,"NÃO SE APLICA","OBSERVAÇÕES"]
["Item da NBR9050\nISO 9386",null,"4.2.4 QUANTO ÀS PLATAFORMAS ELEVATÓRIAS ISO 9386:",null,"SIM","NÃO",null,null,null,"SIM","NÃO",null,null,null,"SIM","NÃO",null,null,null,"SIM","NÃO",null,null,null,"SIM","NÃO",null,null,null,"SIM","NÃO",null,null,null,"SIM","NÃO",null,null,null,"SIM","NÃO",null,null,null,"SIM","NÃO",null,null,null,"SIM","NÃO",null,null,null,"SIM","NÃO",null,null,null,"SIM","NÃO",null,null,null,"SIM","NÃO",null,null,null,"SIM","NÃO",null,null,null,"SIM","NÃO",null,null,null,"SIM","NÃO",null,null,null,"SIM","NÃO",null,null,null,"SIM","NÃO",null,null,null,"SIM","NÃO",null,null,null,"SIM","NÃO",null,null,null,"SIM","NÃO",null,null,null,"SIM","NÃO",null,null,null,"SIM","NÃO",null,null,null,"SIM","NÃO",null,null,null,"SIM","NÃO"]
["NBR 9050\n6.1.1.2","a)","Existe plataforma elevatória na edificação?",null,null,null,"X",null,null,null,null,"X",null,null,null,null,"X",null,null,null,null,"X"]
["ISO 9386\n9.1.1.4.3 (a)","b)","Possui entrada livre mínima de 0,90 m (Edificações com acesso público)?",null,null,null,{"$f":"IF(OR(F$11=\"X\",G11=\"X\"),\"X\",\"\")","v":"X"},null,null,null,null,{"$f":"IF(OR(K$11=\"X\",L11=\"X\"),\"X\",\"\")","v":"X"},null,null,null,null,{"$f":"IF(OR(P$11=\"X\",Q$11=\"X\"),\"X\",\"\")","v":"X"},null,null,null,null,{"$f":"IF(OR(U$11=\"X\",V$11=\"X\"),\"X\",\"\")","v":"X"},null,null,null,null,{"$f":"IF(OR(Z$11=\"X\",AA$11=\"X\"),\"X\",\"\")","v":""},null,null,null,null,{"$f":"IF(OR(AE$11=\"X\",AF$11=\"X\"),\"X\",\"\")","v":""},null,null,null,null,{"$f":"IF(OR(AJ$11=\"X\",AK$11=\"X\"),\"X\",\"\")","v":""},null,null,null,null,{"$f":"IF(OR(AO$11=\"X\",AP$11=\"X\"),\"X\",\"\")","v":""},null,null,null,null,{"$f":"IF(OR(AT$11=\"X\",AU$11=\"X\"),\"X\",\"\")","v":""},null,null,null,null,{"$f":"IF(OR(AY$11=\"X\",AZ$11=\"X\"),\"X\",\"\")","v":""},null,null,null,null,{"$f":"IF(OR(BD$11=\"X\",BE$11=\"X\"),\"X\",\"\")","v":""},null,null,null,null,{"$f":"IF(OR(BI$11=\"X\",BJ$11=\"X\"),\"X\",\"\")","v":""},null,null,null,null,{"$f":"IF(OR(BN$11=\"X\",BO$11=\"X\"),\"X\",\"\")","v":""},null,null,null,null,{"$f":"IF(OR(BS$11=\"X\",BT$11=\"X\"),\"X\",\"\")","v":""},null,null,null,null,{"$f":"IF(OR(BX$11=\"X\",BY$11=\"X\"),\"X\",\"\")","v":""},null,null,null,null,{"$f":"IF(OR(CC$11=\"X\",CD$11=\"X\"),\"X\",\"\")","v":""},null,null,null,null,{"$f":"IF(OR(CH$11=\"X\",CI$11=\"X\"),\"X\",\"\")","v":""},null,null,null,null,{"$f":"IF(OR(CM$11=\"X\",CN$11=\"X\"),\"X\",\"\")","v":""},null,null,null,null,{"$f":"IF(OR(CR$11=\"X\",CS$11=\"X\"),\"X\",\"\")","v":""},null,null,null,null,{"$f":"IF(OR(CW$11=\"X\",CX$11=\"X\"),\"X\",\"\")","v":""},null,null,null,null,{"$f":"IF(OR(DB$11=\"X\",DC$11=\"X\"),\"X\",\"\")","v":""},null,null,null,null,{"$f":"IF(OR(DG$11=\"X\",DH$11=\"X\"),\"X\",\"\")","v":""},null,null,null,null,{"$f":"IF(OR(DL$11=\"X\",DM$11=\"X\"),\"X\",\"\")","v":""},null,null,null,null,{"$f":"IF(OR(DQ$11=\"X\",DR$11=\"X\"),\"X\",\"\")","v":""},null,null,null,null,{"$f":"IF(OR(DV$11=\"X\",DW$11=\"X\"),\"X\",\"\")","v":""}]
["ISO 9386\n9.2.1.3 / 9.2.1.4","c)","A cabine tem dimensão mínima de 0,90 m x 1,40 m?",null,null,null,{"$f":"IF(OR(F$11=\"X\",G12=\"X\"),\"X\",\"\")","v":"X"},null,null,null,null,{"$f":"IF(OR(K$11=\"X\",L12=\"X\"),\"X\",\"\")","v":"X"},null,null,null,null,{"$f":"IF(OR(P$11=\"X\",Q$11=\"X\"),\"X\",\"\")","v":"X"},null,null,null,null,{"$f":"IF(OR(U$11=\"X\",V$11=\"X\"),\"X\",\"\")","v":"X"},null,null,null,null,{"$f":"IF(OR(Z$11=\"X\",AA$11=\"X\"),\"X\",\"\")","v":""},null,null,null,null,{"$f":"IF(OR(AE$11=\"X\",AF$11=\"X\"),\"X\",\"\")","v":""},null,null,null,null,{"$f":"IF(OR(AJ$11=\"X\",AK$11=\"X\"),\"X\",\"\")","v":""},null,null,null,null,{"$f":"IF(OR(AO$11=\"X\",AP$11=\"X\"),\"X\",\"\")","v":""},null,null,null,null,{"$f":"IF(OR(AT$11=\"X\",AU$11=\"X\"),\"X\",\"\")","v":""},null,null,null,null,{"$f":"IF(OR(AY$11=\"X\",AZ$11=\"X\"),\"X\",\"\")","v":""},null,null,null,null,{"$f":"IF(OR(BD$11=\"X\",BE$11=\"X\"),\"X\",\"\")","v":""},null,null,null,null,{"$f":"IF(OR(BI$11=\"X\",BJ$11=\"X\"),\"X\",\"\")","v":""},null,null,null,null,{"$f":"IF(OR(BN$11=\"X\",BO$11=\"X\"),\"X\",\"\")","v":""},null,null,null,null,{"$f":"IF(OR(BS$11=\"X\",BT$11=\"X\"),\"X\",\"\")","v":""},null,null,null,null,{"$f":"IF(OR(BX$11=\"X\",BY$11=\"X\"),\"X\",\"\")","v":""},null,null,null,null,{"$f":"IF(OR(CC$11=\"X\",CD$11=\"X\"),\"X\",\"\")","v":""},null,null,null,null,{"$f":"IF(OR(CH$11=\"X\",CI$11=\"X\"),\"X\",\"\")","v":""},null,null,null,null,{"$f":"IF(OR(CM$11=\"X\",CN$11=\"X\"),\"X\",\"\")","v":""},null,null,null,null,{"$f":"IF(OR(CR$11=\"X\",CS$11=\"X\"),\"X\",\"\")","v":""},null,null,null,null,{"$f":"IF(OR(CW$11=\"X\",CX$11=\"X\"),\"X\",\"\")","v":""},null,null,null,null,{"$f":"IF(OR(DB$11=\"X\",DC$11=\"X\"),\"X\",\"\")","v":""},null,null,null,null,{"$f":"IF(OR(DG$11=\"X\",DH$11=\"X\"),\"X\",\"\")","v":""},null,null,null,null,{"$f":"IF(OR(DL$11=\"X\",DM$11=\"X\"),\"X\",\"\")","v":""},null,null,null,null,{"$f":"IF(OR(DQ$11=\"X\",DR$11=\"X\"),\"X\",\"\")","v":""},null,null,null,null,{"$f":"IF(OR(DV$11=\"X\",DW$11=\"X\"),\"X\",\"\")","v":""}]
["NBR9050\n6.10.3.2","d)","Se a plataforma é vertical e de percurso aberto, o desnível a ser vencido é de até 2,00 m?",null,null,null,"X",null,null,null,null,"X",null,null,null,null,"X",null,null,null,null,"X",null,null,null,null,"",null,null,null,null,"",null,null,null,null,"",null,null,null,null,"",null,null,null,null,"",null,null,null,null,"",null,null,null,null,"",null,null,null,null,"",null,null,null,null,"",null,null,null,null,"",null,null,null,null,"",null,null,null,null,"",null,null,null,null,"",null,null,null,null,"",null,null,null,null,"",null,null,null,null,"",null,null,null,null,"",null,null,null,null,"",null,null,null,null,"",null,null,null,null,"",null,null,null,null,""]
["NBR9050\n6.10.3.1","e)","Se a plataforma é vertical de percurso aberto, possui fechamento lateral até a altura de 1,10 m?",null,null,null,"X",null,null,null,null,"X",null,null,null,null,"X",null,null,null,null,"X",null,null,null,null,"",null,null,null,null,"",null,null,null,null,"",null,null,null,null,"",null,null,null,null,"",null,null,null,null,"",null,null,null,null,"",null,null,null,null,"",null,null,null,null,"",null,null,null,null,"",null,null,null,null,"",null,null,null,null,"",null,null,null,null,"",null,null,null,null,"",null,null,null,null,"",null,null,null,null,"",null,null,null,null,"",null,null,null,null,"",null,null,null,null,"",null,null,null,null,"",null,null,null,null,""]
["ISO 9386\nseção 1 c)","f)","Se a plataforma é vertical e de percurso fechado, o desnível a ser vencido é de até 4,00 m?",null,null,null,"X",null,null,null,null,"X",null,null,null,null,"X",null,null,null,null,"X",null,null,null,null,"",null,null,null,null,"",null,null,null,null,"",null,null,null,null,"",null,null,null,null,"",null,null,null,null,"",null,null,null,null,"",null,null,null,null,"",null,null,null,null,"",null,null,null,null,"",null,null,null,null,"",null,null,null,null,"",null,null,null,null,"",null,null,null,null,"",null,null,null,null,"",null,null,null,null,"",null,null,null,null,"",null,null,null,null,"",null,null,null,null,"",null,null,null,null,"",null,null,null,null,""]
["NBR9050\n6.10.3.3","g)","Se a plataforma é vertical, possui dispositivo de comunicação para solicitação de auxílio nos equipamentos e nos pavimentos atendidos para utilização assistida?",null,null,null,"X",null,null,null,null,"X",null,null,null,null,"X",null,null,null,null,"X",null,null,null,null,"",null,null,null,null,"",null,null,null,null,"",null,null,null,null,"",null,null,null,null,"",null,null,null,null,"",null,null,null,null,"",null,null,null,null,"",null,null,null,null,"",null,null,null,null,"",null,null,null,null,"",null,null,null,null,"",null,null,null,null,"",null,null,null,null,"",null,null,null,null,"",null,null,null,null,"",null,null,null,null,"",null,null,null,null,"",null,null,null,null,"",null,null,null,null,"",null,null,null,null,""]
["NBR9050\n6.2.5","h)","Se a plataforma é vertical, existe dispositivo de segurança (cancelas) isolando os locais de chegada e saída do equipamento?",null,null,null,"X",null,null,null,null,"X",null,null,null,null,"X",null,null,null,null,"X",null,null,null,null,"",null,null,null,null,"",null,null,null,null,"",null,null,null,null,"",null,null,null,null,"",null,null,null,null,"",null,null,null,null,"",null,null,null,null,"",null,null,null,null,"",null,null,null,null,"",null,null,null,null,"",null,null,null,null,"",null,null,null,null,"",null,null,null,null,"",null,null,null,null,"",null,null,null,null,"",null,null,null,null,"",null,null,null,null,"",null,null,null,null,"",null,null,null,null,"",null,null,null,null,""]
["NBR9050\n6.10.4.2","i)","Se a plataforma é de percurso inclinado, existe assento escamoteável para uso de pessoa com mobilidade reduzida?",null,null,null,"X",null,null,null,null,"X",null,null,null,null,"X",null,null,null,null,"X",null,null,null,null,"",null,null,null,null,"",null,null,null,null,"",null,null,null,null,"",null,null,null,null,"",null,null,null,null,"",null,null,null,null,"",null,null,null,null,"",null,null,null,null,"",null,null,null,null,"",null,null,null,null,"",null,null,null,null,"",null,null,null,null,"",null,null,null,null,"",null,null,null,null,"",null,null,null,null,"",null,null,null,null,"",null,null,null,null,"",null,null,null,null,"",null,null,null,null,"",null,null,null,null,""]
["NBR9050\n6.10.4.3","j)","Se a plataforma é de percurso inclinado, existe, na área de espera, sinalização tátil e visual informando a obrigatoriedade de acompanhamento por pessoal habilitado durante sua utilização e dispositivo de solicitação para tal auxílio a uma altura de 0,80 m a 1,00 m do piso?",null,null,null,"X",null,null,null,null,"X",null,null,null,null,"X",null,null,null,null,"X",null,null,null,null,"",null,null,null,null,"",null,null,null,null,"",null,null,null,null,"",null,null,null,null,"",null,null,null,null,"",null,null,null,null,"",null,null,null,null,"",null,null,null,null,"",null,null,null,null,"",null,null,null,null,"",null,null,null,null,"",null,null,null,null,"",null,null,null,null,"",null,null,null,null,"",null,null,null,null,"",null,null,null,null,"",null,null,null,null,"",null,null,null,null,"",null,null,null,null,"",null,null,null,null,""]
["NBR9050\n6.10.4.4","k)","Se a plataforma é de percurso inclinado, a projeção do seu percurso está sinalizada no piso?",null,null,null,"X",null,null,null,null,"X",null,null,null,null,"X",null,null,null,null,"X",null,null,null,null,"",null,null,null,null,"",null,null,null,null,"",null,null,null,null,"",null,null,null,null,"",null,null,null,null,"",null,null,null,null,"",null,null,null,null,"",null,null,null,null,"",null,null,null,null,"",null,null,null,null,"",null,null,null,null,"",null,null,null,null,"",null,null,null,null,"",null,null,null,null,"",null,null,null,null,"",null,null,null,null,"",null,null,null,null,"",null,null,null,null,"",null,null,null,null,"",null,null,null,null,""]
["NBR9050 6.10.4.4 e\n5.5.2","l)","Para qualquer tipo de plataforma: a área de espera de embarque está demarcada?",null,null,null,"X",null,null,null,null,"X",null,null,null,null,"X",null,null,null,null,"X",null,null,null,null,"",null,null,null,null,"",null,null,null,null,"",null,null,null,null,"",null,null,null,null,"",null,null,null,null,"",null,null,null,null,"",null,null,null,null,"",null,null,null,null,"",null,null,null,null,"",null,null,null,null,"",null,null,null,null,"",null,null,null,null,"",null,null,null,null,"",null,null,null,null,"",null,null,null,null,"",null,null,null,null,"",null,null,null,null,"",null,null,null,null,"",null,null,null,null,"",null,null,null,null,""]
[]
[null,null,null,null,"SIM","NÃO","JUSTIFICATIVA",null,null,"SIM","NÃO","JUSTIFICATIVA",null,null,"SIM","NÃO","JUSTIFICATIVA",null,null,"SIM","NÃO","JUSTIFICATIVA",null,null,"SIM","NÃO","JUSTIFICATIVA",null,null,"SIM","NÃO","JUSTIFICATIVA",null,null,"SIM","NÃO","JUSTIFICATIVA",null,null,"SIM","NÃO","JUSTIFICATIVA",null,null,"SIM","NÃO","JUSTIFICATIVA",null,null,"SIM","NÃO","JUSTIFICATIVA",null,null,"SIM","NÃO","JUSTIFICATIVA",null,null,"SIM","NÃO","JUSTIFICATIVA",null,null,"SIM","NÃO","JUSTIFICATIVA",null,null,"SIM","NÃO","JUSTIFICATIVA",null,null,"SIM","NÃO","JUSTIFICATIVA",null,null,"SIM","NÃO","JUSTIFICATIVA",null,null,"SIM","NÃO","JUSTIFICATIVA",null,null,"SIM","NÃO","JUSTIFICATIVA",null,null,"SIM","NÃO","JUSTIFICATIVA",null,null,"SIM","NÃO","JUSTIFICATIVA",null,null,"SIM","NÃO","JUSTIFICATIVA",null,null,"SIM","NÃO","JUSTIFICATIVA",null,null,"SIM","NÃO","JUSTIFICATIVA",null,null,"SIM","NÃO","JUSTIFICATIVA",null,null,"SIM","NÃO","JUSTIFICATIVA"]
[null,null,"NECESSITA PROJETO ?",null,null,"X",null,null,null,null,"X",null,null,null,null,"X",null,null,null,null,"X"]

{"sheet":"5_Esquadrias","index":7,"n_rows":30,"n_cols":128,"rows_kept":30,"cut":false,"hidden":false,"merged":[[29,106,29,107],[29,111,29,112],[29,116,29,117],[29,121,29,122],[29,126,29,127],[29,81,29,82],[29,86,29,87],[29,91,29,92],[29,96,29,97],[29,101,29,102],[28,106,28,107],[28,111,28,112],[28,116,28,117],[28,121,28,122],[28,126,28,127],[28,81,28,82],[28,86,28,87],[28,91,28,92],[28,96,28,97],[28,101,28,102],[8,121,9,121],[8,122,9,122],[8,124,8,125],[8,126,9,126],[8,127,9,127],[8,112,9,112],[8,114,8,115],[8,116,9,116],[8,117,9,117],[8,119,8,120],[8,104,8,105],[8,106,9,106],[8,107,9,107],[8,109,8,110],[8,111,9,111],[8,96,9,96],[8,97,9,97],[8,99,8,100],[8,101,9,101],[8,102,9,102],[8,87,9,87],[8,89,8,90],[8,91,9,91],[8,92,9,92],[8,94,8,95],[8,79,8,80],[8,81,9,81],[8,82,9,82],[8,84,8,85],[8,86,9,86],[6,104,6,107],[6,109,6,112],[6,114,6,117],[6,119,6,122],[6,124,6,127],[6,79,6,82],[6,84,6,87],[6,89,6,92],[6,94,6,97],[6,99,6,102],[0,0,0,2],[2,0,2,3],[8,2,9,2],[8,0,9,0],[8,4,8,5],[6,4,6,7],[8,6,9,6],[8,7,9,7],[6,9,6,12],[6,14,6,17],[8,17,9,17],[6,19,6,22],[6,24,6,27],[8,9,8,10],[8,11,9,11],[8,14,8,15],[8,16,9,16],[8,12,9,12],[6,29,6,32],[8,19,8,20],[8,21,9,21],[8,22,9,22],[8,24,8,25],[8,26,9,26],[8,27,9,27],[8,29,8,30],[8,31,9,31],[8,32,9,32],[29,76,29,77],[8,41,9,41],[8,42,9,42],[8,61,9,61],[8,62,9,62],[8,51,9,51],[8,67,9,67],[8,69,8,70],[8,71,9,71],[8,52,9,52],[8,54,8,55],[8,56,9,56],[8,57,9,57],[8,59,8,60],[8,72,9,72],[28,56,28,57],[28,51,28,52],[29,51,29,52],[29,56,29,57],[29,61,29,62],[29,66,29,67],[29,71,29,72],[8,34,8,35],[8,36,9,36],[8,37,9,37],[8,39,8,40],[6,34,6,37],[6,39,6,42],[6,44,6,47],[6,49,6,52],[6,54,6,57],[8,44,8,45],[8,46,9,46],[8,47,9,47],[8,49,8,50],[28,6,28,7],[28,11,28,12],[28,16,28,17],[28,21,28,22],[28,26,28,27],[28,31,28,32],[28,36,28,37],[28,41,28,42],[28,46,28,47],[29,6,29,7],[29,11,29,12],[29,16,29,17],[29,21,29,22],[29,26,29,27],[29,31,29,32],[29,36,29,37],[29,41,29,42],[29,46,29,47],[6,74,6,77],[8,74,8,75],[8,76,9,76],[8,77,9,77],[28,76,28,77],[28,61,28,62],[28,66,28,67],[8,64,8,65],[8,66,9,66],[28,71,28,72],[6,59,6,62],[6,64,6,67],[6,69,6,72]]}
[{"$f":"'1_Informações e outros'!C1","v":"Ministério da Mulher, da Família e dos Direitos Humanos\nSecretaria Nacional dos Direitos da Pessoa com Deficiência"}]
[]
["LAUDO / CHECK LIST DE ACESSIBILIDADE PARA AVALIAÇÃO DE CONFORMIDADE ÀS NORMAS DE ACESSIBILIDADE (CONFORME NBR 9050:2020) "]
[]
["UNIDADE / ÓRGÃO",null,{"$f":"'1_Informações e outros'!E5","v":"MINISTÉRIO DA MULHER, DA FAMÍLIA E DOS DIREITOS HUMANOS"}]
[]
[{"$f":"'1_Informações e outros'!M5","v":4},null,null,null,{"$f":"'4.1_Circul'!E7","v":"8º PAVTO"},null,null,null,null,{"$f":"'4.1_Circul'!J7","v":"9º PAVTO"},null,null,null,null,{"$f":"'4.1_Circul'!O7","v":"10º PAVTO"},null,null,null,null,{"$f":"'4.1_Circul'!T7","v":"TÉRREO"},null,null,null,null,{"$f":"'4.1_Circul'!Y7","v":"5º PAVTO"},null,null,null,null,{"$f":"'4.1_Circul'!AD7","v":"6º PAVTO"},null,null,null,null,{"$f":"'4.1_Circul'!AI7","v":"7º PAVTO"},null,null,null,null,{"$f":"'4.1_Circul'!AN7","v":"8º PAVTO"},null,null,null,null,{"$f":"'4.1_Circul'!AS7","v":"9º PAVTO"},null,null,null,null,{"$f":"'4.1_Circul'!AX7","v":"10º PAVTO"},null,null,null,null,{"$f":"'4.1_Circul'!BC7","v":"11º PAVTO"},null,null,null,null,{"$f":"'4.1_Circul'!BH7","v":"12º PAVTO"},null,null,null,null,{"$f":"'4.1_Circul'!BM7","v":"13º PAVTO"},null,null,null,null,{"$f":"'4.1_Circul'!BR7","v":"14º PAVTO"},null,null,null,null,{"$f":"'4.1_Circul'!BW7","v":"15º PAVTO"},null,null,null,null,{"$f":"'4.1_Circul'!CB7","v":"16º PAVTO"},null,null,null,null,{"$f":"'4.1_Circul'!CG7","v":"17º PAVTO"},null,null,null,null,{"$f":"'4.1_Circul'!CL7","v":"18º PAVTO"},null,null,null,null,{"$f":"'4.1_Circul'!CQ7","v":"19º PAVTO"},null,null,null,null,{"$f":"'4.1_Circul'!CV7","v":"20º PAVTO"},null,null,null,null,{"$f":"'4.1_Circul'!DA7","v":"21º PAVTO"},null,null,null,null,{"$f":"'4.1_Circul'!DF7","v":"22º PAVTO"},null,null,null,null,{"$f":"'4.1_Circul'!DK7","v":"23º PAVTO"},null,null,null,null,{"$f":"'4.1_Circul'!DP7","v":"24º PAVTO"},null,null,null,null,{"$f":"'4.1_Circul'!DU7","v":"25º PAVTO"}]
[]
["Item da NBR9050",null,"5. ESQUADRIAS (identificar no campo observações os locais das portas inconformes e informar as quantidades a serem adaptadas ou instaladas)",null,"ATENDE NBR9050-2020",null,"NÃO SE APLICA","OBSERVAÇÕES",null,"ATENDE NBR9050-2020",null,"NÃO SE APLICA","OBSERVAÇÕES",null,"ATENDE NBR9050-2020",null,"NÃO SE APLICA","OBSERVAÇÕES",null,"ATENDE NBR9050-2020",null,"NÃO SE APLICA","OBSERVAÇÕES",null,"ATENDE NBR9050-2020",null,"NÃO SE APLICA","OBSERVAÇÕES",null,"ATENDE NBR9050-2020",null,"NÃO SE APLICA","OBSERVAÇÕES",null,"ATENDE NBR9050-2020",null,"NÃO SE APLICA","OBSERVAÇÕES",null,"ATENDE NBR9050-2020",null,"NÃO SE APLICA","OBSERVAÇÕES",null,"ATENDE NBR9050-2020",null,"NÃO SE APLICA","OBSERVAÇÕES",null,"ATENDE NBR9050-2020",null,"NÃO SE APLICA","OBSERVAÇÕES",null,"ATENDE NBR9050-2020",null,"NÃO SE APLICA","OBSERVAÇÕES",null,"ATENDE NBR9050-2020",null,"NÃO SE APLICA","OBSERVAÇÕES",null,"ATENDE NBR9050-2020",null,"NÃO SE APLICA","OBSERVAÇÕES",null,"ATENDE NBR9050-2020",null,"NÃO SE APLICA","OBSERVAÇÕES",null,"ATENDE NBR9050-2020",null,"NÃO SE APLICA","OBSERVAÇÕES",null,"ATENDE NBR9050-2020",null,"NÃO SE APLICA","OBSERVAÇÕES",null,"ATENDE NBR9050-2020",null,"NÃO SE APLICA","OBSERVAÇÕES",null,"ATENDE NBR9050-2020",null,"NÃO SE APLICA","OBSERVAÇÕES",null,"ATENDE NBR9050-2020",null,"NÃO SE APLICA","OBSERVAÇÕES",null,"ATENDE NBR9050-2020",null,"NÃO SE APLICA","OBSERVAÇÕES",null,"ATENDE NBR9050-2020",null,"NÃO SE APLICA","OBSERVAÇÕES",null,"ATENDE NBR9050-2020",null,"NÃO SE APLICA","OBSERVAÇÕES",null,"ATENDE NBR9050-2020",null,"NÃO SE APLICA","OBSERVAÇÕES",null,"ATENDE NBR9050-2020",null,"NÃO SE APLICA","OBSERVAÇÕES",null,"ATENDE NBR9050-2020",null,"NÃO SE APLICA","OBSERVAÇÕES"]
[null,null,null,null,"SIM","NÃO",null,null,null,"SIM","NÃO",null,null,null,"SIM","NÃO",null,null,null,"SIM","NÃO",null,null,null,"SIM","NÃO",null,null,null,"SIM","NÃO",null,null,null,"SIM","NÃO",null,null,null,"SIM","NÃO",null,null,null,"SIM","NÃO",null,null,null,"SIM","NÃO",null,null,null,"SIM","NÃO",null,null,null,"SIM","NÃO",null,null,null,"SIM","NÃO",null,null,null,"SIM","NÃO",null,null,null,"SIM","NÃO",null,null,null,"SIM","NÃO",null,null,null,"SIM","NÃO",null,null,null,"SIM","NÃO",null,null,null,"SIM","NÃO",null,null,null,"SIM","NÃO",null,null,null,"SIM","NÃO",null,null,null,"SIM","NÃO",null,null,null,"SIM","NÃO",null,null,null,"SIM","NÃO",null,null,null,"SIM","NÃO"]
["6.11.2.4","a)","As portas atendem à largura livre mínima de 0,80 m e altura de 2,10 m?",null,null,"X",null,"Todas as portas de uma folha possuem vão livre de 0,75m abaixo do mínimo exigido pela norma, admite-se menos 20mm nas dimensões dos vãos livres, portanto o mínimo de vão livre aceitável é 0,78m. As portas que atendem o vão livre são as portas de saída de emergência e acesso aos sanitários e as salas, 803A - Gabinete da secretaria nacional dos direitos da criança e do adolescente - SNDCA, 812 - Chefe de gabinete e assessoria SNDPD, 813A - Chefe de gabinete - SNDCA, 816 - Sala de cópias e impressões.",null,null,"X",null,"Todas as portas de uma folha possuem vão livre de 0,75m abaixo do mínimo exigido pela norma, admite-se menos 20mm nas dimensões dos vãos livres, portanto o mínimo de vão livre aceitável é 0,78m. As portas que atendem o vão livre são as portas de saída de emergência e acesso aos sanitários e as salas, 926 - Mecanismo nacional de prevenção e combate a tortura - MNPCT, 926A - Acessória técnica e administrativa - MNPCT, 926B - Perícia, 926C - Perícia, 926D - Perícia, 926E - Coordenação-geral do mecanismo nacional de prevenção e combate a tortura - MNPCT, 922A - Gabinete da coordenação-geral de tecnologia da informação - CGTI, 916A - Gabinete da coordenação-geral de orçamento e finanças - CGOF, 901C - Coordenação-geral do conselho nacional dos direitos do idoso - CNDI, 901B - chefe de gabinete da secretaria nacional de promoção e defesa dos direitos da pessoa idosa - SNDPI, 901D - Gabinete da diretoria do departamento de políticas temáticas dos direitos da pessoas IDOSA - DPDPI.",null,null,"X",null,"Todas as portas de uma folha possuem vão livre de 0,75m abaixo do mínimo exigido pela norma, admite-se menos 20mm nas dimensões dos vãos livres, portanto o mínimo de vão livre aceitável é 0,78m. As portas que atendem o vão livre são as portas de saída de emergência e acesso aos sanitários e as salas, 1045 - ambiente de educação corporativa, 100D - coordenação geral de contabilidade e transferências - CGCONT e a sala de acesso principal ao - SOAD.",null,"X"]
["6.11.2.4","b)","Nas portas com duas folhas, pelo menos uma delas possui o vão livre de 0,80 m?",null,"X",null,null,null,null,"X",null,null,null,null,"X",null,null,null,null,"X",null,{"$f":"IF(OR(U$11=\"X\",V$11=\"X\"),\"X\",\"\")","v":""},null,null,null,null,{"$f":"IF(OR(Z$11=\"X\",AA$11=\"X\"),\"X\",\"\")","v":""},null,null,null,null,{"$f":"IF(OR(AE$11=\"X\",AF$11=\"X\"),\"X\",\"\")","v":""},null,null,null,null,{"$f":"IF(OR(AJ$11=\"X\",AK$11=\"X\"),\"X\",\"\")","v":""},null,null,null,null,{"$f":"IF(OR(AO$11=\"X\",AP$11=\"X\"),\"X\",\"\")","v":""},null,null,null,null,{"$f":"IF(OR(AT$11=\"X\",AU$11=\"X\"),\"X\",\"\")","v":""},null,null,null,null,{"$f":"IF(OR(AY$11=\"X\",AZ$11=\"X\"),\"X\",\"\")","v":""},null,null,null,null,{"$f":"IF(OR(BD$11=\"X\",BE$11=\"X\"),\"X\",\"\")","v":""},null,null,null,null,{"$f":"IF(OR(BI$11=\"X\",BJ$11=\"X\"),\"X\",\"\")","v":""},null,null,null,null,{"$f":"IF(OR(BN$11=\"X\",BO$11=\"X\"),\"X\",\"\")","v":""},null,null,null,null,{"$f":"IF(OR(BS$11=\"X\",BT$11=\"X\"),\"X\",\"\")","v":""},null,null,null,null,{"$f":"IF(OR(BX$11=\"X\",BY$11=\"X\"),\"X\",\"\")","v":""},null,null,null,null,{"$f":"IF(OR(CC$11=\"X\",CD$11=\"X\"),\"X\",\"\")","v":""},null,null,null,null,{"$f":"IF(OR(CH$11=\"X\",CI$11=\"X\"),\"X\",\"\")","v":""},null,null,null,null,{"$f":"IF(OR(CM$11=\"X\",CN$11=\"X\"),\"X\",\"\")","v":""},null,null,null,null,{"$f":"IF(OR(CR$11=\"X\",CS$11=\"X\"),\"X\",\"\")","v":""},null,null,null,null,{"$f":"IF(OR(CW$11=\"X\",CX$11=\"X\"),\"X\",\"\")","v":""},null,null,null,null,{"$f":"IF(OR(DB$11=\"X\",DC$11=\"X\"),\"X\",\"\")","v":""},null,null,null,null,{"$f":"IF(OR(DG$11=\"X\",DH$11=\"X\"),\"X\",\"\")","v":""},null,null,null,null,{"$f":"IF(OR(DL$11=\"X\",DM$11=\"X\"),\"X\",\"\")","v":""},null,null,null,null,{"$f":"IF(OR(DQ$11=\"X\",DR$11=\"X\"),\"X\",\"\")","v":""},null,null,null,null,{"$f":"IF(OR(DV$11=\"X\",DW$11=\"X\"),\"X\",\"\")","v":""}]
["6.11.2.8","c)","As portas do tipo vai e vem têm visor com largura mínima de 0,20 m, tendo sua face inferior situada entre 0,40 m e 0,90 m do piso, e a face superior no mínimo a 1,50 m do piso?",null,null,null,{"$f":"IF(OR(F$11=\"X\",G$11=\"X\"),\"X\",\"\")","v":"X"},null,null,null,null,{"$f":"IF(OR(K$11=\"X\",L$11=\"X\"),\"X\",\"\")","v":"X"},null,null,null,null,{"$f":"IF(OR(P$11=\"X\",Q$11=\"X\"),\"X\",\"\")","v":"X"},null,null,null,null,"X",null,null,null,null,{"$f":"IF(OR(Z$11=\"X\",AA$11=\"X\"),\"X\",\"\")","v":""},null,null,null,null,{"$f":"IF(OR(AE$11=\"X\",AF$11=\"X\"),\"X\",\"\")","v":""},null,null,null,null,{"$f":"IF(OR(AJ$11=\"X\",AK$11=\"X\"),\"X\",\"\")","v":""},null,null,null,null,{"$f":"IF(OR(AO$11=\"X\",AP$11=\"X\"),\"X\",\"\")","v":""},null,null,null,null,{"$f":"IF(OR(AT$11=\"X\",AU$11=\"X\"),\"X\",\"\")","v":""},null,null,null,null,{"$f":"IF(OR(AY$11=\"X\",AZ$11=\"X\"),\"X\",\"\")","v":""},null,null,null,null,{"$f":"IF(OR(BD$11=\"X\",BE$11=\"X\"),\"X\",\"\")","v":""},null,null,null,null,{"$f":"IF(OR(BI$11=\"X\",BJ$11=\"X\"),\"X\",\"\")","v":""},null,null,null,null,{"$f":"IF(OR(BN$11=\"X\",BO$11=\"X\"),\"X\",\"\")","v":""},null,null,null,null,{"$f":"IF(OR(BS$11=\"X\",BT$11=\"X\"),\"X\",\"\")","v":""},null,null,null,null,{"$f":"IF(OR(BX$11=\"X\",BY$11=\"X\"),\"X\",\"\")","v":""},null,null,null,null,{"$f":"IF(OR(CC$11=\"X\",CD$11=\"X\"),\"X\",\"\")","v":""},null,null,null,null,{"$f":"IF(OR(CH$11=\"X\",CI$11=\"X\"),\"X\",\"\")","v":""},null,null,null,null,{"$f":"IF(OR(CM$11=\"X\",CN$11=\"X\"),\"X\",\"\")","v":""},null,null,null,null,{"$f":"IF(OR(CR$11=\"X\",CS$11=\"X\"),\"X\",\"\")","v":""},null,null,null,null,{"$f":"IF(OR(CW$11=\"X\",CX$11=\"X\"),\"X\",\"\")","v":""},null,null,null,null,{"$f":"IF(OR(DB$11=\"X\",DC$11=\"X\"),\"X\",\"\")","v":""},null,null,null,null,{"$f":"IF(OR(DG$11=\"X\",DH$11=\"X\"),\"X\",\"\")","v":""},null,null,null,null,{"$f":"IF(OR(DL$11=\"X\",DM$11=\"X\"),\"X\",\"\")","v":""},null,null,null,null,{"$f":"IF(OR(DQ$11=\"X\",DR$11=\"X\"),\"X\",\"\")","v":""},null,null,null,null,{"$f":"IF(OR(DV$11=\"X\",DW$11=\"X\"),\"X\",\"\")","v":""}]
["6.11.2.6","d)","Possui maçaneta tipo alavanca e com altura entre 0,80 m e 1,10 m?",null,"X",null,null,null,null,"X",null,null,null,null,"X",null,null,null,null,"X",null,null,"Nas portas dos sanitários e todas as outras que não são por abertura automática.",null,null,null,"",null,null,null,null,"",null,null,null,null,"",null,null,null,null,"",null,null,null,null,"",null,null,null,null,"",null,null,null,null,"",null,null,null,null,"",null,null,null,null,"",null,null,null,null,"",null,null,null,null,"",null,null,null,null,"",null,null,null,null,"",null,null,null,null,"",null,null,null,null,"",null,null,null,null,"",null,null,null,null,"",null,null,null,null,"",null,null,null,null,"",null,null,null,null,"",null,null,null,null,""]
["4.6.6.1","e)","A maçaneta possui acabamento sem arestas e recurvado na extremidade?",null,"X",null,null,null,null,"X",null,null,null,null,"X",null,null,null,null,"X",null,null,null,null,null,null,"",null,null,null,null,"",null,null,null,null,"",null,null,null,null,"",null,null,null,null,"",null,null,null,null,"",null,null,null,null,"",null,null,null,null,"",null,null,null,null,"",null,null,null,null,"",null,null,null,null,"",null,null,null,null,"",null,null,null,null,"",null,null,null,null,"",null,null,null,null,"",null,null,null,null,"",null,null,null,null,"",null,null,null,null,"",null,null,null,null,"",null,null,null,null,"",null,null,null,null,""]
["6.11.2.2","f)","No deslocamento frontal do usuário, quando as portas abrirem no sentido do deslocamento do usuário, há um espaço livre de 0,30 m contíguo à maçaneta, com profundidade de 1,20 m?",null,null,"X",null,"Todas as portas que abrem no sentido frontal em relação ao usuário devem garantir ao lado da maçaneta uma largura de 0,30m entre a parede e a porta e 1,20m de espaço livre para trás, garantindo assim o movimento de rotação da cadeira de rodas e para abertura da porta. As salas: 801 - Conselho nacional dos direitos da criança e do adolescente - CNANDA, 801A - Secretaria executiva do conselho nacional dos direitos da criança e do adolescente - CONANDA, 803c1 - Coordenação de gestão - SNDCA, 803B - Gabinete da secretaria nacional dos direitos da criança e do adolescente,  812A - Chefe de gabinete - SNDPD, 813A - Chefe de gabinete - SNDCA, 826A - Assessoria - DPTDPD, 826B - Gabinete da coordenação geral de dados e informações da pessoa com deficiência - CGDIPD, 826C - Gabinete da coordenação geral de acessibilidade e tecnologia assistiva - CGATA e 826D - Gabinete da coordenação-geral de promoção dos direitos da pessoa com deficiência - CGPDPD, não atende os espaços livres mínimos exigidos em norma que garante o deslocamento adequado para uma pessoa em cadeira de rodas.",null,"X",null,null,"Todas as portas que abrem no sentido frontal em relação ao usuário devem garantir ao lado da maçaneta uma largura de 0,30m entre a parede e a porta e 1,20m de espaço livre para trás, garantindo assim o movimento de rotação da cadeira de rodas e para abertura da porta. As salas: 932 - Coordenação de acompanhamento de programas - COAPR, 922A - Gabinete da coordenação-geral de tecnologia da informação - CGTI, 939 - Departamento de proteção e defesa dos direitos humanos - DEPDDH, 939E - Gabinete da coordenação-geral de combate a tortura e à violência institucional – CGCT, 901A - Gabinete da secretaria nacional de promoção e defesa dos direitos de pessoas idosas - SNDPI, 900C1 - Assessoria, 900C2 - Assessoria, 900A - Gabinete da secretaria nacional de proteção global - SNPG e a sala ao lado  que está sem a identificação no centro da porta (Gabinete da SNPG), não atende as dimensões mínimas para o deslocamento de pessoas em cadeira de rodas quando as portas abrem no sentido frontal. E a salas 926E - Coordenação geral de tecnologia da informação – CGTI, 926F - Sala de reunião – NMPCT, 931B - Gabinete da coordenação-geral dos direitos das populações em situações de risco - CGRIS e ao lado dessa sala também existe uma sala sem identificação, não atende os espaços livres mínimos exigidos em norma que garante o deslocamento adequado para uma pessoa em cadeira de rodas.    ",null,"X",null,null,"Todas as portas que abrem no sentido frontal em relação ao usuário devem garantir ao lado da maçaneta uma largura de 0,30m entre a parede e a porta e 1,20m de espaço livre para trás, garantindo assim o movimento de rotação da cadeira de rodas e para abertura da porta. As salas: 1000A - Gabinete da secretaria de orçamento e administração - SOAD, 1001A - Gabinete da coordenação-geral de conselhos - CGCON, 1032A - Gabinete da coordenação de gestão documental e eventos - COGEDE, 1016A - Sala de reunião da coordenação-geral de gestão de pessoas - CGGP, 1020A - Gabinete da coordenação de procedimentos licitatórios - CPL, 1025A - Gabinete da coordenação-geral de políticas étnico-raciais - CGPER, 1036 - coordenação de logística - COLOG, 1029 - Departamento de monitoramento de políticas étnico-raciais - DIMOPE, na sala 1003C - Secretaria nacional de políticas de promoção da igualdade racial - SNPIR existem duas salas sem identificação que não atendem as exigências mínimas para o deslocamento adequado para uma pessoa em cadeira de rodas. ",null,"X",null,null,null,null,null,null,"",null,null,null,null,"",null,null,null,null,"",null,null,null,null,"",null,null,null,null,"",null,null,null,null,"",null,null,null,null,"",null,null,null,null,"",null,null,null,null,"",null,null,null,null,"",null,null,null,null,"",null,null,null,null,"",null,null,null,null,"",null,null,null,null,"",null,null,null,null,"",null,null,null,null,"",null,null,null,null,"",null,null,null,null,"",null,null,null,null,"",null,null,null,null,"",null,null,null,null,""]
["6.11.2.2","g)","Nas portas que abrem no sentido oposto ao deslocamento do usuário, há espaço livre de 0,60 m, contíguo à maçaneta, com profundidade de 1,50 m?",null,null,"X",null,"Todas as portas que abrem no sentido oposto ao deslocamento do usuário devem garantir ao lado da maçaneta uma largura de 0,60m entre a parede e a porta e 1,50m de espaço livre para trás, garantindo assim o movimento de abertura da porta por uma pessoa em cadeira de rodas. As salas 832A - Gabinete da coordenação geral do conselho nacional dos direitos da pessoa com deficiência - CONADE, 832B - Gabinete da presidência - CONADE, 814 - Coordenação de comunicação - CCM, 813 - Coordenação geral de políticas temáticas - CGPTDC/Chefe de gabinete - SNDCA,  803c1 - Coordenação de gestão - SNDCA, 803c2 - Assessoria - SNDCA, 803 - Secretaria nacional dos direitos da criança e do adolescente - SNDCA, 813A - Gabinete da secretaria nacional dos direitos da pessoa com deficiência - SNDPD, 801 - Conselho nacional dos direitos da criança e do adolescente - CONANDA, 804A – Copa, 812B - Assessoria - ANDPD de acesso ao tocador e banheiro privativo, 823A1 - Coordenação geral de defesa e do direito da criança e do adolescente - CGDDEA, 823A2 – Gabinete da coordenação-geral de assuntos socioeducativos – CGAS,  NÃO estão atendendo as medidas mínimas que garante o deslocamento adequado para uma pessoa em cadeira de rodas.",null,null,null,null,"Todas as portas que abrem no sentido oposto ao deslocamento do usuário devem garantir ao lado da maçaneta uma largura de 0,60m entre a parede e a porta e 1,50m de espaço livre para trás, garantindo assim o movimento de abertura da porta por uma pessoa em cadeira de rodas. As salas 932 - Coordenação de acompanhamento de programas - COAPR, 926 - Mecanismo nacional de prevenção e combate a tortura - MNPCT, 926A - Acessória técnica e administrativa - MNPCT, 926B - Perícia, 926C - Perícia, 926D - Perícia, 926E - Coordenação-geral do mecanismo nacional de prevenção e combate a tortura - MNPCT, 926F - Sala de reunião – NMPCT,  916 - Coordenação-geral de orçamentos e finanças - CGOF, 900C - Chefe de gabinete e assessoria - SNPG, 939B - Diretoria de departamento de proteção e defesa dos direitos humanos - DEPDDH, 939C - Gabinete da coordenação-geral de proteção à testemunha e aos defensores de direitos humanos -CGPTDDH, 939D - Gabinete da coordenação-geral de combate ao trabalho escravo - CGCTE, 939E - Gabinete da coordenação-geral de combate a tortura e à violência institucional – CGCT, 923 - Depart. de promoção dos direitos de lésbicas, gays, bissexuais, travestis e transexuais – DELGBT e dentro dessa sala existem duas salas sem identificação, 931B – Gabinete da coordenação-geral dos direitos das populações em situação  de risco, 927 - Suporte técnico - CGTI, a sala de acesso principal para as salas 939, 927 e 923 sem identificação, 922 - Coordenação-geral de tecnologia da informação - CGTI, 904B - Copa NÃO estão atendendo as medidas mínimas que garante o deslocamento adequado para uma pessoa em cadeira de rodas.",null,null,null,null,"Todas as portas que abrem no sentido oposto ao deslocamento do usuário devem garantir ao lado da maçaneta uma largura de 0,60m entre a parede e a porta e 1,50m de espaço livre para trás, garantindo assim o movimento de abertura da porta por uma pessoa em cadeira de rodas. As salas 1020A - Gabinete da coordenação de procedimentos licitatórios - CPL, 1036 - Coordenação de logística - COLOG, 1032A - Gabinete da coordenação de gestão de documental e eventos - COGEDE, 1026 - Coordenação de contratos e gestão de atas - CCGA, 1000C1 - Assessoria da subsecretaria de orçamento e administração - SOAD, 1000C2 - Assessoria da subsecretaria de orçamento e administração - SOAD, 1018 - Divisão de serviços gerais - DIVSE/COLOG, 1018A - Gabinete da divisão de serviços gerais - DIVSER/LOG, 1016 - Coordenação geral de gestão de pessoas – CGGP, 1029 - Departamento de monitoramento de políticas étnico racial - DIMOPE, 1029A - Gabinete da coordenação-geral de elaboração de estudos e diagnósticos - CGLAD, 1029B - Gabinete da coordenação-geral de monitoramento - CGMONT, 1025 - Departamento de políticas étnico-raciais - DIFER, 1025A - Gabinete da coordenação-geral de políticas étnico-racial - CGPER, 1029B - Gabinete da coord-geral de promoção de políticas pra povos e comunidade tradicionais de matriz africana, terreiros, indígenas e povos ciganos - CGMAT  e a copa, NÃO estão atendendo as medidas mínimas que garante o deslocamento adequado para uma pessoa em cadeira de rodas.",null,null,"X",null,"As porta do sanitário coletivo feminimo onde está o sanitário acessível, não há espaço livre de 0,60m contíguo à maçaneta.",null,null,null,"",null,null,null,null,"",null,null,null,null,"",null,null,null,null,"",null,null,null,null,"",null,null,null,null,"",null,null,null,null,"",null,null,null,null,"",null,null,null,null,"",null,null,null,null,"",null,null,null,null,"",null,null,null,null,"",null,null,null,null,"",null,null,null,null,"",null,null,null,null,"",null,null,null,null,"",null,null,null,null,"",null,null,null,null,"",null,null,null,null,"",null,null,null,null,"",null,null,null,null,""]
["6.11.2.3","h)","No deslocamento lateral do usuário, existe 0,60 m de espaço livre de cada um dos lados da porta?",null,"X",null,null,null,null,"X",null,null,null,null,"X",null,null,null,null,null,null,"X",null,null,null,null,"",null,null,null,null,"",null,null,null,null,"",null,null,null,null,"",null,null,null,null,"",null,null,null,null,"",null,null,null,null,"",null,null,null,null,"",null,null,null,null,"",null,null,null,null,"",null,null,null,null,"",null,null,null,null,"",null,null,null,null,"",null,null,null,null,"",null,null,null,null,"",null,null,null,null,"",null,null,null,null,"",null,null,null,null,"",null,null,null,null,"",null,null,null,null,"",null,null,null,null,""]
["5.4.1","i)","Possui sinalização visual no centro da porta ou na parede ao lado da maçaneta (1,20 m - 1,60 m) no lado externo, informando o ambiente?",null,"X",null,null,"Algumas salas não possuem a sinalização correta no centro da porta e na parede ao lado, é a porta de acesso principal a secretaria nacional dos direitos da pessoa com deficiência, 836B – Gabinete da coordenação geral da comissão interministerial de avaliação – CGCIA, 818B – Gabinete da coordenação-geral de relações interinstitucionais – CGRI, não está com sinalização na parede ao lado, 818A – Sala de reunião, 803c1 - Coordenação de gestão - SNDCA está com a sinalização do lado oposto a maçaneta. Na porta de acesso principal as salas 843 - Auditório Ana Paula Crosara de Resende e 841 - Estúdio de filmagem, não possui nenhuma sinalização no centro da porta e na parede do lado, com sinalização tátil, 812 - Assessoria - SNDPD e a sala de publicações.  ",null,"X",null,null,"Algumas salas não possuem a sinalização correta no centro da porta e na parede ao lado, a porta de acesso principal as salas 900, 922, 932, 936 e a porta de acesso principal as salas 923, 927 e 939 NÃO tem a sinalização no cetro da posta e na lateral. 916A - Gabinete da coordenação-geral de orçamentos e finanças - CGOF, 926E - Coordenação-geral do mecanismo nacional de prevenção e combate à tortura - MNPCT, 900A - Gabinete da secretaria nacional de proteção global - SNPG e sala ao lado sem identificação Gabinete da SNPG, 923a - Coordenação-geral de desaparecimento - CGD, 923b - Coordenação-geral de promoções de registro civil de nascimento - CGRCN, 923F – Diretoria do departamento de promoção e educação em direitos humanos - DEPEDH, 923D - Sala de reunião, 923e - Coordenação-geral de educação em direitos da pessoa idosa - SNDPI, 939 - Departamento de proteção e defesa dos direitos humanos – DEPDDH, 939A - Recepção da sala de acolhimento e dentro dela a sala de “ acolhimento” está sem identificação. Na sala 939 - Departamento de proteção e defesa dos direitos humanos – DEPDDH existem duas salas sem identificação, 901D - Gabinete da diretoria do departamento de políticas temáticas dos direitos da pessoa idosa - DPDPI, sala sem identificação dentro da sala 901 - Secretaria nacional de promoção e defesa dos direitos de pessoas idosa - SNDPI. A sala 901C - Coordenação-geral do conselho nacional dos direitos do idoso - CNDI está sala não possui acesso localizada no corredor principal, sala técnica - quadro de distribuição com sinalização divergente e sala de acesso restrito também com sinalização divergente. A 923 - Depart. de promoção dos direitos de lésbicas, gays, bissexuais, travestis e transexuais - DELGBT e a sala 923 - Departamento de promoção e educação em direitos humanos – DEPEDH estão com sinalização divergente, é necessário fazer a retirada das placas que não condizem com as indicações e modificar o número das salas, pois utiliza a mesma numeração 923.  Dentro da sala 923 - Depart. de promoção dos direitos de lésbicas, gays, bissexuais, travestis e transexuais – DELGBT existem três salas faltando sinalização, e na sala 923 - Departamento de promoção e educação em direitos humanos – DEPEDH existe uma sala sem sinalização “depósito”, 936A - Gabinete da coordenação-geral do conselho nacional de direitos humanos - CNDH e a sala 932 - Coordenação de acompanhamento de programas - COAPR.",null,"X",null,null,"Algumas salas não possuem a sinalização correta no centro da porta e na parede ao lado. A porta de acesso principal as salas de 1016 a 1036, e na porta que dá acesso as salas 1029, 1041 e 1045 não atende as sinalizações. E na sala 1003c - Secretaria nacional de políticas de promoção da igualdade racial - SNPIR, existem seis salas sem nenhuma identificação.",null,null,"X",{"$f":"IF(OR(U$11=\"X\",V$11=\"X\"),\"X\",\"\")","v":""},"No térreo as portas dos sanitários masculino e feminino, não existem a sinalização tátil na parede ao lado.",null,null,null,"",null,null,null,null,"",null,null,null,null,"",null,null,null,null,"",null,null,null,null,"",null,null,null,null,"",null,null,null,null,"",null,null,null,null,"",null,null,null,null,"",null,null,null,null,"",null,null,null,null,"",null,null,null,null,"",null,null,null,null,"",null,null,null,null,"",null,null,null,null,"",null,null,null,null,"",null,null,null,null,"",null,null,null,null,"",null,null,null,null,"",null,null,null,null,"",null,null,null,null,""]
["5.4.1","j)","A sinalização visual está associada à sinalização tátil em relevo e Braille (instalada na parede adjacente ou batente em altura entre 0,90 m - 1,20 m) ou sonora?",null,"X",null,null,null,null,"X",null,null,null,null,"X",null,null,null,null,null,"X","","Nas portas dos sanitários não existe a sinalização tátil na parede ao lado.",null,null,null,"",null,null,null,null,"",null,null,null,null,"",null,null,null,null,"",null,null,null,null,"",null,null,null,null,"",null,null,null,null,"",null,null,null,null,"",null,null,null,null,"",null,null,null,null,"",null,null,null,null,"",null,null,null,null,"",null,null,null,null,"",null,null,null,null,"",null,null,null,null,"",null,null,null,null,"",null,null,null,null,"",null,null,null,null,"",null,null,null,null,"",null,null,null,null,"",null,null,null,null,""]
[" 6.11.2.13","k)","Portas e paredes envidraçadas têm faixa com no mínimo 50 mm de espessura, instalada a uma altura entre 0,90 m e 1,00 m ou elementos gráficos equivalentes?",null,null,null,"X",null,null,null,null,"X",null,null,null,null,"X",null,null,null,null,"X",null,null,null,null,"",null,null,null,null,"",null,null,null,null,"",null,null,null,null,"",null,null,null,null,"",null,null,null,null,"",null,null,null,null,"",null,null,null,null,"",null,null,null,null,"",null,null,null,null,"",null,null,null,null,"",null,null,null,null,"",null,null,null,null,"",null,null,null,null,"",null,null,null,null,"",null,null,null,null,"",null,null,null,null,"",null,null,null,null,"",null,null,null,null,"",null,null,null,null,"",null,null,null,null,""]
[" 6.11.2.13","l)","Nas portas das paredes envidraçadas que façam parte de rotas acessíveis,existe faixa de sinalização visual emoldurando-as, com dimensão mínima de 50 mm de largura?",null,null,null,"X",null,null,null,null,"X",null,null,null,null,"X",null,null,"X",null,"",null,null,null,null,"",null,null,null,null,"",null,null,null,null,"",null,null,null,null,"",null,null,null,null,"",null,null,null,null,"",null,null,null,null,"",null,null,null,null,"",null,null,null,null,"",null,null,null,null,"",null,null,null,null,"",null,null,null,null,"",null,null,null,null,"",null,null,null,null,"",null,null,null,null,"",null,null,null,null,"",null,null,null,null,"",null,null,null,null,"",null,null,null,null,"",null,null,null,null,"",null,null,null,null,""]
[" 6.11.3","m)","A altura do peitoril respeita o cone visual de pessoa em cadeira rodas (aprox. 60 cm)?",null,"X",null,null,null,null,"X",null,null,null,null,"X",null,null,null,null,null,null,"X",null,null,null,null,"",null,null,null,null,"",null,null,null,null,"",null,null,null,null,"",null,null,null,null,"",null,null,null,null,"",null,null,null,null,"",null,null,null,null,"",null,null,null,null,"",null,null,null,null,"",null,null,null,null,"",null,null,null,null,"",null,null,null,null,"",null,null,null,null,"",null,null,null,null,"",null,null,null,null,"",null,null,null,null,"",null,null,null,null,"",null,null,null,null,"",null,null,null,null,"",null,null,null,null,""]
[" 6.11.3","n)","Os comandos das janelas são entre 0,60 m e 1,20 m do piso?",null,null,null,"X","Abertura das janelas são vedadas ao usuário, abrindo automaticamente em caso de emergência",null,null,null,{"$f":"IF(OR(K$11=\"X\",L$11=\"X\"),\"X\",\"\")","v":"X"},"Abertura das janelas são vedadas ao usuário, abrindo automaticamente em caso de emergência",null,null,null,{"$f":"IF(OR(P$11=\"X\",Q$11=\"X\"),\"X\",\"\")","v":"X"},"Abertura das janelas são vedadas ao usuário, abrindo automaticamente em caso de emergência",null,null,null,"X",null,null,null,null,"",null,null,null,null,"",null,null,null,null,"",null,null,null,null,"",null,null,null,null,"",null,null,null,null,"",null,null,null,null,"",null,null,null,null,"",null,null,null,null,"",null,null,null,null,"",null,null,null,null,"",null,null,null,null,"",null,null,null,null,"",null,null,null,null,"",null,null,null,null,"",null,null,null,null,"",null,null,null,null,"",null,null,null,null,"",null,null,null,null,"",null,null,null,null,"",null,null,null,null,""]
["6.11.2.6","o)","As portas podem ser abertas com um único movimento?",null,"X",null,null,null,null,"X",null,null,null,null,"X",null,null," ",null,"X",null,"",null,null,null,null,"",null,null,null,null,"",null,null,null,null,"",null,null,null,null,"",null,null,null,null,"",null,null,null,null,"",null,null,null,null,"",null,null,null,null,"",null,null,null,null,"",null,null,null,null,"",null,null,null,null,"",null,null,null,null,"",null,null,null,null,"",null,null,null,null,"",null,null,null,null,"",null,null,null,null,"",null,null,null,null,"",null,null,null,null,"",null,null,null,null,"",null,null,null,null,"",null,null,null,null,""]
["6.11.2.1","p)","No caso de portas em sequência, existe um espaço de transposição com um círculo de 1,50 m de diâmetro entre as portas abertas?",null,null,null,"X",null,null,null,null,{"$f":"IF(OR(K$11=\"X\",L$11=\"X\"),\"X\",\"\")","v":"X"},null,null,null,null,{"$f":"IF(OR(P$11=\"X\",Q$11=\"X\"),\"X\",\"\")","v":"X"},null,null,null,null,"X",null,null,null,null,"",null,null,null,null,"",null,null,null,null,"",null,null,null,null,"",null,null,null,null,"",null,null,null,null,"",null,null,null,null,"",null,null,null,null,"",null,null,null,null,"",null,null,null,null,"",null,null,null,null,"",null,null,null,null,"",null,null,null,null,"",null,null,null,null,"",null,null,null,null,"",null,null,null,null,"",null,null,null,null,"",null,null,null,null,"",null,null,null,null,"",null,null,null,null,"",null,null,null,null,""]
["6.3.4","q)","A soleira da porta não apresenta desnível ou o desnível é chanfrado quando este estiver entre 5 a 20 mm?",null,"X",null,null,null,null,"X",null,null,null,null,"X",null,null,null,null,"X",null,"",null,null,null,null,"",null,null,null,null,"",null,null,null,null,"",null,null,null,null,"",null,null,null,null,"",null,null,null,null,"",null,null,null,null,"",null,null,null,null,"",null,null,null,null,"",null,null,null,null,"",null,null,null,null,"",null,null,null,null,"",null,null,null,null,"",null,null,null,null,"",null,null,null,null,"",null,null,null,null,"",null,null,null,null,"",null,null,null,null,"",null,null,null,null,"",null,null,null,null,"",null,null,null,null,""]
[]
[null,null,null,null,"SIM","NÃO","JUSTIFICATIVA",null,null,"SIM","NÃO","JUSTIFICATIVA",null,null,"SIM","NÃO","JUSTIFICATIVA",null,null,"SIM","NÃO","JUSTIFICATIVA",null,null,"SIM","NÃO","JUSTIFICATIVA",null,null,"SIM","NÃO","JUSTIFICATIVA",null,null,"SIM","NÃO","JUSTIFICATIVA",null,null,"SIM","NÃO","JUSTIFICATIVA",null,null,"SIM","NÃO","JUSTIFICATIVA",null,null,"SIM","NÃO","JUSTIFICATIVA",null,null,"SIM","NÃO","JUSTIFICATIVA",null,null,"SIM","NÃO","JUSTIFICATIVA",null,null,"SIM","NÃO","JUSTIFICATIVA",null,null,"SIM","NÃO","JUSTIFICATIVA",null,null,"SIM","NÃO","JUSTIFICATIVA",null,null,"SIM","NÃO","JUSTIFICATIVA",null,null,"SIM","NÃO","JUSTIFICATIVA",null,null,"SIM","NÃO","JUSTIFICATIVA",null,null,"SIM","NÃO","JUSTIFICATIVA",null,null,"SIM","NÃO","JUSTIFICATIVA",null,null,"SIM","NÃO","JUSTIFICATIVA",null,null,"SIM","NÃO","JUSTIFICATIVA",null,null,"SIM","NÃO","JUSTIFICATIVA",null,null,"SIM","NÃO","JUSTIFICATIVA",null,null,"SIM","NÃO","JUSTIFICATIVA"]
[null,null,"NECESSITA PROJETO ?",null,null,"X","Adaptação das portas, para que estas tenham vão livre mínimo de 0,80m, colocar nas portas e nas paredes ao lado a sinalização tátil associada a sinalização visual, adequar o layout das salas porque o mobiliário não pode interferir nas circulações, deve garantir os espaços livres de circulação estabelecido por norma.",null,null,null,"X","Adaptação das portas, para que estas tenham vão livre mínimo de 0,80m, colocar nas portas e nas paredes ao lado a sinalização tátil associada a sinalização visual, adequar o layout das salas porque o mobiliário não pode interferir nas circulações, deve garantir os espaços livres de circulação estabelecido por norma.",null,null,null,"X","Adaptação das portas, para que estas tenham vão livre mínimo de 0,80m, colocar nas portas e nas paredes ao lado a sinalização tátil associada a sinalização visual, adequar o layout das salas porque o mobiliário não pode interferir nas circulações, deve garantir os espaços livres de circulação estabelecido por norma.",null,null,null,"X","Deve ser aplicado nas paredes ao lado das portas dos sanitários a sinalização tátil associada a sinalização visual."]

{"sheet":"6_Sanitários Acessíveis","index":8,"n_rows":88,"n_cols":127,"rows_kept":88,"cut":false,"hidden":false,"merged":[[87,60,87,61],[87,65,87,66],[87,70,87,71],[87,75,87,76],[87,80,87,81],[87,85,87,86],[87,90,87,91],[51,2,52,2],[76,65,77,65],[76,36,77,36],[76,38,76,39],[76,40,77,40],[76,41,77,41],[76,43,76,44],[76,45,77,45],[76,46,77,46],[76,48,76,49],[76,50,77,50],[66,91,67,91],[66,61,67,61],[66,63,66,64],[66,65,67,65],[66,66,67,66],[66,68,66,69],[30,0,31,0],[51,0,52,0],[30,2,31,2],[66,2,67,2],[66,0,67,0],[76,2,77,2],[76,0,77,0],[87,50,87,51],[86,90,86,91],[76,81,77,81],[76,83,76,84],[76,85,77,85],[76,86,77,86],[76,88,76,89],[76,90,77,90],[76,91,77,91],[76,51,77,51],[76,53,76,54],[76,55,77,55],[76,56,77,56],[76,58,76,59],[76,60,77,60],[76,61,77,61],[76,63,76,64],[86,95,86,96],[86,100,86,101],[86,105,86,106],[86,110,86,111],[86,115,86,116],[86,120,86,121],[86,125,86,126],[87,6,87,7],[87,11,87,12],[87,16,87,17],[87,21,87,22],[87,25,87,26],[87,30,87,31],[87,35,87,36],[87,40,87,41],[87,45,87,46],[87,95,87,96],[87,100,87,101],[87,105,87,106],[87,110,87,111],[87,115,87,116],[87,120,87,121],[87,125,87,126],[87,55,87,56],[74,95,74,96],[74,100,74,101],[74,105,74,106],[74,110,74,111],[74,115,74,116],[74,120,74,121],[74,125,74,126],[86,6,86,7],[86,11,86,12],[86,16,86,17],[86,21,86,22],[86,25,86,26],[86,30,86,31],[86,35,86,36],[86,40,86,41],[86,45,86,46],[86,50,86,51],[86,55,86,56],[86,60,86,61],[86,65,86,66],[86,70,86,71],[86,75,86,76],[86,80,86,81],[86,85,86,86],[73,100,73,101],[73,105,73,106],[73,110,73,111],[73,115,73,116],[73,120,73,121],[73,125,73,126],[74,6,74,7],[74,11,74,12],[74,16,74,17],[74,21,74,22],[74,25,74,26],[74,30,74,31],[74,35,74,36],[74,40,74,41],[74,45,74,46],[74,50,74,51],[74,55,74,56],[74,60,74,61],[74,65,74,66],[74,70,74,71],[74,75,74,76],[74,80,74,81],[74,85,74,86],[74,90,74,91],[64,105,64,106],[64,110,64,111],[64,115,64,116],[64,120,64,121],[64,125,64,126],[73,6,73,7],[73,11,73,12],[73,16,73,17],[73,21,73,22],[73,25,73,26],[73,30,73,31],[73,35,73,36],[73,40,73,41],[73,45,73,46],[73,50,73,51],[73,55,73,56],[73,60,73,61],[73,65,73,66],[73,70,73,71],[73,75,73,76],[73,80,73,81],[73,85,73,86],[73,90,73,91],[73,95,73,96],[63,110,63,111],[63,115,63,116],[63,120,63,121],[63,125,63,126],[64,6,64,7],[64,11,64,12],[64,16,64,17],[64,21,64,22],[64,25,64,26],[64,30,64,31],[64,35,64,36],[64,40,64,41],[64,45,64,46],[64,50,64,51],[64,55,64,56],[64,60,64,61],[64,65,64,66],[64,70,64,71],[64,75,64,76],[64,80,64,81],[64,85,64,86],[64,90,64,91],[64,95,64,96],[64,100,64,101],[49,115,49,116],[49,120,49,121],[49,125,49,126],[63,6,63,7],[63,11,63,12],[63,16,63,17],[63,21,63,22],[63,25,63,26],[63,30,63,31],[63,35,63,36],[63,40,63,41],[63,45,63,46],[63,50,63,51],[63,55,63,56],[63,60,63,61],[63,65,63,66],[63,70,63,71],[63,75,63,76],[63,80,63,81],[63,85,63,86],[63,90,63,91],[63,95,63,96],[63,100,63,101],[63,105,63,106],[48,120,48,121],[48,125,48,126],[49,6,49,7],[49,11,49,12],[49,16,49,17],[49,21,49,22],[49,25,49,26],[49,30,49,31],[49,35,49,36],[49,40,49,41],[49,45,49,46],[49,50,49,51],[49,55,49,56],[49,60,49,61],[49,65,49,66],[49,70,49,71],[49,75,49,76],[49,80,49,81],[49,85,49,86],[49,90,49,91],[49,95,49,96],[49,100,49,101],[49,105,49,106],[49,110,49,111],[76,126,77,126],[48,6,48,7],[48,11,48,12],[48,16,48,17],[48,21,48,22],[48,25,48,26],[48,30,48,31],[48,35,48,36],[48,40,48,41],[48,45,48,46],[48,50,48,51],[48,55,48,56],[48,60,48,61],[48,65,48,66],[48,70,48,71],[48,75,48,76],[48,80,48,81],[48,85,48,86],[48,90,48,91],[48,95,48,96],[48,100,48,101],[48,105,48,106],[48,110,48,111],[48,115,48,116],[76,111,77,111],[76,113,76,114],[76,115,77,115],[76,116,77,116],[76,118,76,119],[76,120,77,120],[76,121,77,121],[76,123,76,124],[76,125,77,125],[76,96,77,96],[76,98,76,99],[76,100,77,100],[76,101,77,101],[76,103,76,104],[76,105,77,105],[76,106,77,106],[76,108,76,109],[76,110,77,110],[76,93,76,94],[76,95,77,95],[76,66,77,66],[76,68,76,69],[76,70,77,70],[76,71,77,71],[76,73,76,74],[76,75,77,75],[76,76,77,76],[76,78,76,79],[76,80,77,80],[66,121,67,121],[66,123,66,124],[66,125,67,125],[66,126,67,126],[76,4,76,5],[76,6,77,6],[76,7,77,7],[76,9,76,10],[76,11,77,11],[76,12,77,12],[76,14,76,15],[76,16,77,16],[76,17,77,17],[76,19,76,20],[76,21,77,21],[76,22,77,22],[76,25,77,25],[76,26,77,26],[76,28,76,29],[76,30,77,30],[76,31,77,31],[76,33,76,34],[76,35,77,35],[66,106,67,106],[66,108,66,109],[66,110,67,110],[66,111,67,111],[66,113,66,114],[66,115,67,115],[66,116,67,116],[66,118,66,119],[66,120,67,120],[66,93,66,94],[66,95,67,95],[66,96,67,96],[66,98,66,99],[66,100,67,100],[66,101,67,101],[66,103,66,104],[66,105,67,105],[66,76,67,76],[66,78,66,79],[66,80,67,80],[66,81,67,81],[66,83,66,84],[66,85,67,85],[66,86,67,86],[66,88,66,89],[66,90,67,90],[66,70,67,70],[66,71,67,71],[66,73,66,74],[66,75,67,75],[66,46,67,46],[66,48,66,49],[66,50,67,50],[66,51,67,51],[66,53,66,54],[66,55,67,55],[66,56,67,56],[66,58,66,59],[66,60,67,60],[66,31,67,31],[66,33,66,34],[66,35,67,35],[66,36,67,36],[66,38,66,39],[66,40,67,40],[66,41,67,41],[66,43,66,44],[66,45,67,45],[51,116,52,116],[51,118,51,119],[51,120,52,120],[51,121,52,121],[51,123,51,124],[51,125,52,125],[51,126,52,126],[66,4,66,5],[66,6,67,6],[66,7,67,7],[66,9,66,10],[66,11,67,11],[66,12,67,12],[66,14,66,15],[66,16,67,16],[66,17,67,17],[66,19,66,20],[66,21,67,21],[66,22,67,22],[66,25,67,25],[66,26,67,26],[66,28,66,29],[66,30,67,30],[51,101,52,101],[51,103,51,104],[51,105,52,105],[51,106,52,106],[51,108,51,109],[51,110,52,110],[51,111,52,111],[51,113,51,114],[51,115,52,115],[51,86,52,86],[51,88,51,89],[51,90,52,90],[51,91,52,91],[51,93,51,94],[51,95,52,95],[51,96,52,96],[51,98,51,99],[51,100,52,100],[51,71,52,71],[51,73,51,74],[51,75,52,75],[51,76,52,76],[51,78,51,79],[51,80,52,80],[51,81,52,81],[51,83,51,84],[51,85,52,85],[51,56,52,56],[51,58,51,59],[51,60,52,60],[51,61,52,61],[51,63,51,64],[51,65,52,65],[51,66,52,66],[51,68,51,69],[51,70,52,70],[51,41,52,41],[51,43,51,44],[51,45,52,45],[51,46,52,46],[51,48,51,49],[51,50,52,50],[51,51,52,51],[51,53,51,54],[51,55,52,55],[30,126,31,126],[51,4,51,5],[51,6,52,6],[51,7,52,7],[51,9,51,10],[51,11,52,11],[51,12,52,12],[51,14,51,15],[51,16,52,16],[51,17,52,17],[51,19,51,20],[51,21,52,21],[51,22,52,22],[51,25,52,25],[51,26,52,26],[51,28,51,29],[51,30,52,30],[51,31,52,31],[51,33,51,34],[51,35,52,35],[51,36,52,36],[51,38,51,39],[51,40,52,40],[30,111,31,111],[30,95,31,95],[30,113,30,114],[30,115,31,115],[30,116,31,116],[30,118,30,119],[30,120,31,120],[30,121,31,121],[30,123,30,124],[30,125,31,125],[30,96,31,96],[30,98,30,99],[30,100,31,100],[30,101,31,101],[30,103,30,104],[30,105,31,105],[30,106,31,106],[30,108,30,109],[30,110,31,110],[30,80,31,80],[30,81,31,81],[30,83,30,84],[30,85,31,85],[30,86,31,86],[30,88,30,89],[30,90,31,90],[30,91,31,91],[30,93,30,94],[30,65,31,65],[30,66,31,66],[30,68,30,69],[30,70,31,70],[30,71,31,71],[30,73,30,74],[30,75,31,75],[30,76,31,76],[30,78,30,79],[30,50,31,50],[30,51,31,51],[30,53,30,54],[30,55,31,55],[30,56,31,56],[30,58,30,59],[30,60,31,60],[30,61,31,61],[30,63,30,64],[30,4,30,5],[30,36,31,36],[30,38,30,39],[30,40,31,40],[30,41,31,41],[30,43,30,44],[30,45,31,45],[30,46,31,46],[30,48,30,49],[28,105,28,106],[28,110,28,111],[28,115,28,116],[28,120,28,121],[28,125,28,126],[28,80,28,81],[28,85,28,86],[28,90,28,91],[28,95,28,96],[28,100,28,101],[28,35,28,36],[28,40,28,41],[28,45,28,46],[30,6,31,6],[30,7,31,7],[30,9,30,10],[30,11,31,11],[30,12,31,12],[30,14,30,15],[30,16,31,16],[30,17,31,17],[30,19,30,20],[30,21,31,21],[30,22,31,22],[30,25,31,25],[30,26,31,26],[30,28,30,29],[30,30,31,30],[30,31,31,31],[30,33,30,34],[30,35,31,35],[27,105,27,106],[27,110,27,111],[27,115,27,116],[27,120,27,121],[27,125,27,126],[27,80,27,81],[27,85,27,86],[27,90,27,91],[27,95,27,96],[27,100,27,101],[8,120,9,120],[8,121,9,121],[8,123,8,124],[8,125,9,125],[8,126,9,126],[8,111,9,111],[8,113,8,114],[8,115,9,115],[8,116,9,116],[8,118,8,119],[8,103,8,104],[8,105,9,105],[8,106,9,106],[8,108,8,109],[8,110,9,110],[8,95,9,95],[8,96,9,96],[8,98,8,99],[8,100,9,100],[8,101,9,101],[8,86,9,86],[8,88,8,89],[8,90,9,90],[8,91,9,91],[8,93,8,94],[8,78,8,79],[8,80,9,80],[8,81,9,81],[8,83,8,84],[8,85,9,85],[6,103,6,106],[6,108,6,111],[6,113,6,116],[6,118,6,121],[6,123,6,126],[6,78,6,81],[6,83,6,86],[6,88,6,91],[6,93,6,96],[6,98,6,101],[0,0,0,2],[2,0,2,3],[6,14,6,17],[8,4,8,5],[8,6,9,6],[8,9,8,10],[8,11,9,11],[8,14,8,15],[8,16,9,16],[8,17,9,17],[8,0,9,0],[8,2,9,2],[8,7,9,7],[8,12,9,12],[6,4,6,7],[6,9,6,12],[27,6,27,7],[27,11,27,12],[27,16,27,17],[27,21,27,22],[27,25,27,26],[27,30,27,31],[28,6,28,7],[28,11,28,12],[28,16,28,17],[28,21,28,22],[28,25,28,26],[28,30,28,31],[6,19,6,22],[6,24,6,26],[6,28,6,31],[8,19,8,20],[8,21,9,21],[27,35,27,36],[27,40,27,41],[27,45,27,46],[8,22,9,22],[8,25,9,25],[8,26,9,26],[8,28,8,29],[8,30,9,30],[8,31,9,31],[6,33,6,36],[6,38,6,41],[6,43,6,46],[8,33,8,34],[8,35,9,35],[8,36,9,36],[8,38,8,39],[8,40,9,40],[8,41,9,41],[8,43,8,44],[8,45,9,45],[8,46,9,46],[8,48,8,49],[28,60,28,61],[8,55,9,55],[8,56,9,56],[6,48,6,51],[6,53,6,56],[6,63,6,66],[8,63,8,64],[8,65,9,65],[8,66,9,66],[27,65,27,66],[28,50,28,51],[28,55,28,56],[28,65,28,66],[8,61,9,61],[6,58,6,61],[8,50,9,50],[8,51,9,51],[8,53,8,54],[8,58,8,59],[8,60,9,60],[27,50,27,51],[27,55,27,56],[27,60,27,61],[27,70,27,71],[27,75,27,76],[28,70,28,71],[28,75,28,76],[6,68,6,71],[6,73,6,76],[8,68,8,69],[8,70,9,70],[8,71,9,71],[8,73,8,74],[8,75,9,75],[8,76,9,76]]}
[{"$f":"'1_Informações e outros'!C1","v":"Ministério da Mulher, da Família e dos Direitos Humanos\nSecretaria Nacional dos Direitos da Pessoa com Deficiência"}]
[]
["LAUDO / CHECK LIST DE ACESSIBILIDADE PARA AVALIAÇÃO DE CONFORMIDADE ÀS NORMAS DE ACESSIBILIDADE (CONFORME NBR 9050:2020) "]
[]
["UNIDADE / ÓRGÃO",null,{"$f":"'1_Informações e outros'!E5","v":"MINISTÉRIO DA MULHER, DA FAMÍLIA E DOS DIREITOS HUMANOS"}]
[]
[{"$f":"'1_Informações e outros'!M5","v":4},null,null,null,{"$f":"'4.1_Circul'!E7","v":"8º PAVTO"},null,null,null,null,{"$f":"'4.1_Circul'!J7","v":"9º PAVTO"},null,null,null,null,{"$f":"'4.1_Circul'!O7","v":"10º PAVTO"},null,null,null,null,{"$f":"'4.1_Circul'!T7","v":"TÉRREO"},null,null,null,null,null,null,null,null,{"$f":"'4.1_Circul'!AD7","v":"6º PAVTO"},null,null,null,null,{"$f":"'4.1_Circul'!AI7","v":"7º PAVTO"},null,null,null,null,{"$f":"'4.1_Circul'!AN7","v":"8º PAVTO"},null,null,null,null,{"$f":"'4.1_Circul'!AS7","v":"9º PAVTO"},null,null,null,null,{"$f":"'4.1_Circul'!AX7","v":"10º PAVTO"},null,null,null,null,{"$f":"'4.1_Circul'!BC7","v":"11º PAVTO"},null,null,null,null,{"$f":"'4.1_Circul'!BH7","v":"12º PAVTO"},null,null,null,null,{"$f":"'4.1_Circul'!BM7","v":"13º PAVTO"},null,null,null,null,{"$f":"'4.1_Circul'!BR7","v":"14º PAVTO"},null,null,null,null,{"$f":"'4.1_Circul'!BW7","v":"15º PAVTO"},null,null,null,null,{"$f":"'4.1_Circul'!CB7","v":"16º PAVTO"},null,null,null,null,{"$f":"'4.1_Circul'!CG7","v":"17º PAVTO"},null,null,null,null,{"$f":"'4.1_Circul'!CL7","v":"18º PAVTO"},null,null,null,null,{"$f":"'4.1_Circul'!CQ7","v":"19º PAVTO"},null,null,null,null,{"$f":"'4.1_Circul'!CV7","v":"20º PAVTO"},null,null,null,null,{"$f":"'4.1_Circul'!DA7","v":"21º PAVTO"},null,null,null,null,{"$f":"'4.1_Circul'!DF7","v":"22º PAVTO"},null,null,null,null,{"$f":"'4.1_Circul'!DK7","v":"23º PAVTO"},null,null,null,null,{"$f":"'4.1_Circul'!DP7","v":"24º PAVTO"},null,null,null,null,{"$f":"'4.1_Circul'!DU7","v":"25º PAVTO"}]
[]
["Item da NBR9050",null,"6. SANITÁRIO ACESSÍVEL E BOXE SANITÁRIO ACESSÍVEL",null,"ATENDE NBR9050-2020",null,"NÃO SE APLICA","OBSERVAÇÕES",null,"ATENDE NBR9050-2020",null,"NÃO SE APLICA","OBSERVAÇÕES",null,"ATENDE NBR9050-2020",null,"NÃO SE APLICA","OBSERVAÇÕES",null,"ATENDE NBR9050-2020",null,"NÃO SE APLICA","OBSERVAÇÕES",null,null,"NÃO SE APLICA","OBSERVAÇÕES",null,"ATENDE NBR9050-2020",null,"NÃO SE APLICA","OBSERVAÇÕES",null,"ATENDE NBR9050-2020",null,"NÃO SE APLICA","OBSERVAÇÕES",null,"ATENDE NBR9050-2020",null,"NÃO SE APLICA","OBSERVAÇÕES",null,"ATENDE NBR9050-2020",null,"NÃO SE APLICA","OBSERVAÇÕES",null,"ATENDE NBR9050-2020",null,"NÃO SE APLICA","OBSERVAÇÕES",null,"ATENDE NBR9050-2020",null,"NÃO SE APLICA","OBSERVAÇÕES",null,"ATENDE NBR9050-2020",null,"NÃO SE APLICA","OBSERVAÇÕES",null,"ATENDE NBR9050-2020",null,"NÃO SE APLICA","OBSERVAÇÕES",null,"ATENDE NBR9050-2020",null,"NÃO SE APLICA","OBSERVAÇÕES",null,"ATENDE NBR9050-2020",null,"NÃO SE APLICA","OBSERVAÇÕES",null,"ATENDE NBR9050-2020",null,"NÃO SE APLICA","OBSERVAÇÕES",null,"ATENDE NBR9050-2020",null,"NÃO SE APLICA","OBSERVAÇÕES",null,"ATENDE NBR9050-2020",null,"NÃO SE APLICA","OBSERVAÇÕES",null,"ATENDE NBR9050-2020",null,"NÃO SE APLICA","OBSERVAÇÕES",null,"ATENDE NBR9050-2020",null,"NÃO SE APLICA","OBSERVAÇÕES",null,"ATENDE NBR9050-2020",null,"NÃO SE APLICA","OBSERVAÇÕES",null,"ATENDE NBR9050-2020",null,"NÃO SE APLICA","OBSERVAÇÕES",null,"ATENDE NBR9050-2020",null,"NÃO SE APLICA","OBSERVAÇÕES",null,"ATENDE NBR9050-2020",null,"NÃO SE APLICA","OBSERVAÇÕES",null,"ATENDE NBR9050-2020",null,"NÃO SE APLICA","OBSERVAÇÕES"]
[null,null,null,null,"SIM","NÃO",null,null,null,"SIM","NÃO",null,null,null,"SIM","NÃO",null,null,null,"SIM","NÃO",null,null,null,"NÃO",null,null,null,"SIM","NÃO",null,null,null,"SIM","NÃO",null,null,null,"SIM","NÃO",null,null,null,"SIM","NÃO",null,null,null,"SIM","NÃO",null,null,null,"SIM","NÃO",null,null,null,"SIM","NÃO",null,null,null,"SIM","NÃO",null,null,null,"SIM","NÃO",null,null,null,"SIM","NÃO",null,null,null,"SIM","NÃO",null,null,null,"SIM","NÃO",null,null,null,"SIM","NÃO",null,null,null,"SIM","NÃO",null,null,null,"SIM","NÃO",null,null,null,"SIM","NÃO",null,null,null,"SIM","NÃO",null,null,null,"SIM","NÃO",null,null,null,"SIM","NÃO",null,null,null,"SIM","NÃO"]
["7.4.3 e\nDecreto nº 5.296/04 (§1 do art. 22)","a)","Tratando-se de edificação nova, posterior a dezembro/2004 (identificar data do habite-se), existe sanitário acessível, para cada sexo, em todos os pavimentos, com entrada independente dos sanitários coletivos?",null,null,"X",null,"O sanitário acessível está dentro dos sanitários coletivos, masculino e feminino, sendo um boxe acessível em cada.",null,null,"X",null,"O sanitário acessível está dentro dos sanitários coletivos, masculino e feminino, sendo um boxe acessível em cada.",null,null,"X",null,"O sanitário acessível está dentro dos sanitários coletivos, masculino e feminino, sendo um boxe acessível em cada.",null,null,"X",null,"O sanitário acessível está dentro dos sanitários coletivos, masculino e feminino, sendo um boxe acessível em cada."]
["7.4.3 e \nDecreto nº 5.296/04 \n(§2 do art.22)","b)","Tratando-se de edificação antiga, anterior a dezembro/2004 (identificar data do habite-se), esta dispõe de pelo menos um sanitário acessível, por pavimento, com entrada independente dos sanitários coletivos?",null,null,"X",null,"Data do habite-se é de 10 de novembro de 2011. Na versão anterior da norma não exigia box acessíveis com entrada independente, sendo preferencialmente próximo ou integrados às demais instalações sanitárias. O boxe sanitário com entrada independente aplicava apenas em função da especificidade do local ou natureza de seu uso. A emenda da NBR 9050:2020 resgatou diretrizes, determinando os sanitários acessíveis devem possuir entrada independente.",null,null,"X",null,"Data do habite-se é de 10 de novembro de 2011. Na versão anterior da norma não exigia box acessíveis com entrada independente, sendo preferencialmente próximo ou integrados às demais instalações sanitárias. O boxe sanitário com entrada independente aplicava apenas em função da especificidade do local ou natureza de seu uso. A emenda da NBR 9050:2020 resgatou diretrizes, determinando os sanitários acessíveis devem possuir entrada independente.",null,null,"X",null,"Data do habite-se é de 10 de novembro de 2011. Na versão anterior da norma não exigia box acessíveis com entrada independente, sendo preferencialmente próximo ou integrados às demais instalações sanitárias. O boxe sanitário com entrada independente aplicava apenas em função da especificidade do local ou natureza de seu uso. A emenda da NBR 9050:2020 resgatou diretrizes, determinando os sanitários acessíveis devem possuir entrada independente.",null,null,"X",null,"Data do habite-se é de 10 de novembro de 2011. Na versão anterior da norma não exigia box acessíveis com entrada independente, sendo preferencialmente próximo ou integrados às demais instalações sanitárias. O boxe sanitário com entrada independente aplicava apenas em função da especificidade do local ou natureza de seu uso. A emenda da NBR 9050:2020 resgatou diretrizes, determinando os sanitários acessíveis devem possuir entrada independente."]
["7.3.1","c)","O sanitário acessível está localizado em rota acessível?",null,"X",null,null,null,null,"X",null,null,null,null,"X",null,null,null,null,"X"]
["7.3.1","d)","Os sanitários acessíveis estão próximos ou integrados às demais instalações sanitárias?",null,"X",null,null,"O sanitário acessível está dentro dos sanitários coletivos, masculino e feminino, sendo um boxe acessível em cada.",null,"X",null,null,"O sanitário acessível está dentro dos sanitários coletivos, masculino e feminino, sendo um boxe acessível em cada.",null,"X",null,null,"O sanitário acessível está dentro dos sanitários coletivos, masculino e feminino, sendo um boxe acessível em cada.",null,"X",null,null,"O sanitário acessível está dentro dos sanitários coletivos, masculino e feminino, sendo um boxe acessível em cada."]
["5.6.4.1","e)","Os sanitários acessíveis possuem dispositivo de sinalização de emergência (alarme sonoro e visual) próximo à bacia, acionado através de pressão ou alavanca, instalado à 40 cm do piso e com cor constrastante?",null,null,"X",null,"Não faz o uso de dispositivos de sinalização de emergência.",null,null,"X",null,"Não faz o uso de dispositivos de sinalização de emergência.",null,null,"X",null,"Não faz o uso de dispositivos de sinalização de emergência.",null,null,"X",null,"Não faz o uso de dispositivos de sinalização de emergência."]
["6.3.4.1","f)","A entrada é sem desnível ou possui desnível entre 5 mm e 20 mm tratado conforme Figura 68?",null,"X",null,null,null,null,"X",null,null,null,null,"X",null,null,null,null,"X"]
["6.3.2","g)","O piso é antiderrapante?",null,null,"X",null,"O piso não é antiderapante.",null,null,"X",null,"O piso não é antiderapante.",null,null,"X",null,"O piso não é antiderapante.",null,null,"X",null,"O piso não é antiderapante."]
["7.5 e\nFigura 100","h)","As dimensões mínimas do  sanitário acessível permitem giro de 360° (diâmetro de 1,50 m), conforme Figura 100 da NBR9050?",null,"X",null,null,null,null,"X",null,null,null,null,"X",null,null,null,null,"X"]
["7.5 e \nFigura 101","i)","Em caso de impossibilidade de atendimento das medidas mínimas, atende à Figura 101 da NBR9050?",null,null,null,"X",null,null,null,null,"X",null,null,null,null,"X",null,null,null,null,"X"]
["6.11.2.4","j)","A porta possui um vão livre de 0,80 m?",null,"X",null,null,null,null,"X",null,null,null,null,"X",null,null,null,null,"X"]
["7.5 (f)","k)","O sentido de abertura da porta é para fora?",null,"X",null,null,null,null,"X",null,null,null,null,"X",null,null,null,null,"X"]
["6.11.2 e\n7.5 (f)","l)","No caso de boxe acessível, a porta do sanitário no qual ele está inserido abre para fora ou possui espaço ao lado da porta para facilitar sua abertura?",null,"X",null,null,null,null,"X",null,null,null,null,"X",null,null,null,null,"X"]
["4.6.6.1","m)","A maçaneta é do tipo alavanca, com pelo menos 100 mm de comprimento e acabamento sem arestas e recurvado na extremidade, apresentando uma distância mínima de 40 mm da superfície da porta e instalada a uma altura entre 0,80 m e 1,10 m do piso acabado?",null,"X",null,null,"No box acessível não possui maçaneta, apenas o puxador vertical.",null,"X",null,null,"No box acessível não possui maçaneta, apenas o puxador vertical.",null,"X",null,null,"No box acessível não possui maçaneta, apenas o puxador vertical.",null,"X",null,null,"No box acessível não possui maçaneta, apenas o puxador vertical."]
["7.5 (f), \n6.11.2.7 e \n4.6.6.3","n)","A porta possui puxador horizontal, com diâmetro entre 25 mm a 35 mm, com comprimento mínimo de 0,40 m, fixado na parte interna da porta, afastado 0,10 m do batente e instalado na altura da maçaneta conforme a Figura 86? Na inexistência de maçaneta, o puxador horizontal está instalado a uma altura entre 0,80 m a 1,10 m medida do eixo do puxador ao piso acabado?",null,null,"X",null,"Não possui puxador horizontal.",null,null,"X",null,"Não possui puxador horizontal.",null,null,"X",null,"Não possui puxador horizontal.",null,null,"X",null,"Não possui puxador horizontal."]
["5.4.1","o)","Possui sinalização visual no centro da porta ou na parede ao lado da maçaneta (1,20 m - 1,60 m) no lado externo, informando o ambiente?",null,"X",null,null,null,null,"X",null,null,null,null,"X",null,null,null,null,"X",null,null,"Não possui sinalização na parede ao lado da maçaneta."]
["5.4.1","p)","A sinalização visual está associada à sinalização tátil em relevo e Braille (instalada na parede adjacente ou batente em altura entre 0,90 m - 1,20 m) ou sonora?",null,"X",null,null,null,null,"X",null,null,null,null,"X",null,null,null,null,null,null,"X","Não possui sinalização na parede ao lado da maçaneta."]
[]
[null,null,null,null,"SIM","NÃO","JUSTIFICATIVA",null,null,"SIM","NÃO","JUSTIFICATIVA",null,null,"SIM","NÃO","JUSTIFICATIVA",null,null,"SIM","NÃO","JUSTIFICATIVA",null,null,"NÃO","JUSTIFICATIVA",null,null,"SIM","NÃO","JUSTIFICATIVA",null,null,"SIM","NÃO","JUSTIFICATIVA",null,null,"SIM","NÃO","JUSTIFICATIVA",null,null,"SIM","NÃO","JUSTIFICATIVA",null,null,"SIM","NÃO","JUSTIFICATIVA",null,null,"SIM","NÃO","JUSTIFICATIVA",null,null,"SIM","NÃO","JUSTIFICATIVA",null,null,"SIM","NÃO","JUSTIFICATIVA",null,null,"SIM","NÃO","JUSTIFICATIVA",null,null,"SIM","NÃO","JUSTIFICATIVA",null,null,"SIM","NÃO","JUSTIFICATIVA",null,null,"SIM","NÃO","JUSTIFICATIVA",null,null,"SIM","NÃO","JUSTIFICATIVA",null,null,"SIM","NÃO","JUSTIFICATIVA",null,null,"SIM","NÃO","JUSTIFICATIVA",null,null,"SIM","NÃO","JUSTIFICATIVA",null,null,"SIM","NÃO","JUSTIFICATIVA",null,null,"SIM","NÃO","JUSTIFICATIVA",null,null,"SIM","NÃO","JUSTIFICATIVA",null,null,"SIM","NÃO","JUSTIFICATIVA"]
[null,null,"NECESSITA PROJETO ?",null,"X",null,"Fazer todas as adequações necessárias, como dispositivos para sinalização de emergências nos boxes acessíveis, o piso deve ser antiderrapante. O box acessível não é obrigatoriedade seguir os parâmetros da NBR9050-2020 de entrada independente dos sanitários coletivos, porem deve ter o puxador horizontal do lado oposto ao lado da abertura da porta.",null,null,"X",null,"Fazer todas as adequações necessárias, como dispositivos para sinalização de emergências nos boxes acessíveis, o piso deve ser antiderrapante. O box acessível não é obrigatoriedade seguir os parâmetros da NBR9050-2020 de entrada independente dos sanitários coletivos, porem deve ter o puxador horizontal do lado oposto ao lado da abertura da porta.",null,null,"X",null,"Fazer todas as adequações necessárias, como dispositivos para sinalização de emergências nos boxes acessíveis, o piso deve ser antiderrapante. O box acessível não é obrigatoriedade seguir os parâmetros da NBR9050-2020 de entrada independente dos sanitários coletivos, porem deve ter o puxador horizontal do lado oposto ao lado da abertura da porta.",null,null,"X",null,"Fazer todas as adequações necessárias, como dispositivos para sinalização de emergências nos boxes acessíveis, o piso deve ser antiderrapante. O box acessível não é obrigatoriedade seguir os parâmetros da NBR9050-2020 de entrada independente dos sanitários coletivos, porem deve ter o puxador horizontal do lado oposto ao lado da abertura da porta."]
[]
["Item da NBR9050",null,"6.1 QUANTO À BACIA SANITÁRIA:",null,"ATENDE NBR9050-2020",null,"NÃO SE APLICA","OBSERVAÇÕES",null,"ATENDE NBR9050-2020",null,"NÃO SE APLICA","OBSERVAÇÕES",null,"ATENDE NBR9050-2020",null,"NÃO SE APLICA","OBSERVAÇÕES",null,"ATENDE NBR9050-2020",null,"NÃO SE APLICA","OBSERVAÇÕES",null,null,"NÃO SE APLICA","OBSERVAÇÕES",null,"ATENDE NBR9050-2020",null,"NÃO SE APLICA","OBSERVAÇÕES",null,"ATENDE NBR9050-2020",null,"NÃO SE APLICA","OBSERVAÇÕES",null,"ATENDE NBR9050-2020",null,"NÃO SE APLICA","OBSERVAÇÕES",null,"ATENDE NBR9050-2020",null,"NÃO SE APLICA","OBSERVAÇÕES",null,"ATENDE NBR9050-2020",null,"NÃO SE APLICA","OBSERVAÇÕES",null,"ATENDE NBR9050-2020",null,"NÃO SE APLICA","OBSERVAÇÕES",null,"ATENDE NBR9050-2020",null,"NÃO SE APLICA","OBSERVAÇÕES",null,"ATENDE NBR9050-2020",null,"NÃO SE APLICA","OBSERVAÇÕES",null,"ATENDE NBR9050-2020",null,"NÃO SE APLICA","OBSERVAÇÕES",null,"ATENDE NBR9050-2020",null,"NÃO SE APLICA","OBSERVAÇÕES",null,"ATENDE NBR9050-2020",null,"NÃO SE APLICA","OBSERVAÇÕES",null,"ATENDE NBR9050-2020",null,"NÃO SE APLICA","OBSERVAÇÕES",null,"ATENDE NBR9050-2020",null,"NÃO SE APLICA","OBSERVAÇÕES",null,"ATENDE NBR9050-2020",null,"NÃO SE APLICA","OBSERVAÇÕES",null,"ATENDE NBR9050-2020",null,"NÃO SE APLICA","OBSERVAÇÕES",null,"ATENDE NBR9050-2020",null,"NÃO SE APLICA","OBSERVAÇÕES",null,"ATENDE NBR9050-2020",null,"NÃO SE APLICA","OBSERVAÇÕES",null,"ATENDE NBR9050-2020",null,"NÃO SE APLICA","OBSERVAÇÕES",null,"ATENDE NBR9050-2020",null,"NÃO SE APLICA","OBSERVAÇÕES",null,"ATENDE NBR9050-2020",null,"NÃO SE APLICA","OBSERVAÇÕES"]
[null,null,null,null,"SIM","NÃO",null,null,null,"SIM","NÃO",null,null,null,"SIM","NÃO",null,null,null,"SIM","NÃO",null,null,null,"NÃO",null,null,null,"SIM","NÃO",null,null,null,"SIM","NÃO",null,null,null,"SIM","NÃO",null,null,null,"SIM","NÃO",null,null,null,"SIM","NÃO",null,null,null,"SIM","NÃO",null,null,null,"SIM","NÃO",null,null,null,"SIM","NÃO",null,null,null,"SIM","NÃO",null,null,null,"SIM","NÃO",null,null,null,"SIM","NÃO",null,null,null,"SIM","NÃO",null,null,null,"SIM","NÃO",null,null,null,"SIM","NÃO",null,null,null,"SIM","NÃO",null,null,null,"SIM","NÃO",null,null,null,"SIM","NÃO",null,null,null,"SIM","NÃO",null,null,null,"SIM","NÃO",null,null,null,"SIM","NÃO"]
["7.5","a)","Possui área de transferência (0,80 m x 1,20 m) lateral, diagonal e perpendicular para a bacia sanitária?",null,"X",null,null,null,null,"X",null,null,null,null,"X",null,null,null,null,"X"]
["7.5 (o)","b)","Quando houver mais de um sanitário acessível, as bacias sanitárias, áreas de transferência e barras de apoio estão posicionadas simetricamente opostas, contemplando todas as formas de transferência para a bacia?",null,null,null,"X",null,null,null,null,"X",null,null,null,null,"X",null,null,null,null,"X"]
["7.7.2.1","c)","Tem 43 cm a 45 cm de altura sem o assento (46 cm de altura com assento)?",null,"X",null,null,null,null,"X",null,null,null,null,"X",null,null,null,null,"X"]
["7.7.2.1","d)","A bacia NÃO possui abertura frontal?",null,null,"X",null,"A bacia possui abertura frontal.",null,null,"X",null,"A bacia possui abertura frontal.",null,null,"X",null,"A bacia possui abertura frontal.",null,null,"X",null,"A bacia possui abertura frontal."]
["7.7.2.1","e)","Se a altura da bacia sanitária foi aumentada através de uma base (sóculo), ela ultrapassa no máximo 5 cm, acompanhando a base da bacia, e sem cantos vivos?",null,null,null,"X",null,null,null,null,"X",null,null,null,null,"X",null,null,null,null,"X"]
["7.7.2.2","f)","Possui barras de apoio com comprimento mínimo de 80 cm, fixadas na parede de fundo e na lateral da bacia sanitária, distando 0,75 m do piso acabado ou outra configuração conforme item 7.7.2 ?",null,"X",null,null,null,null,"X",null,null,null,null,"X",null,null,null,null,"X",null,null,"A barra de apoio não está fixada na parede."]
["7.7.2.3.1","g)","A barra de apoio localizada na lateral do sanitário dista 0,50 m da borda frontal da bacia?",null,"X",null,null,null,null,"X",null,null,null,null,"X",null,null,null,null,"X"]
["7.7.2.3.1","h)","Existe barra reta com comprimento mínimo de 0,70 m, posicionada verticalmente, a 0,10 m acima da barra horizontal e 0,30 m da borda frontal da bacia sanitária?",null,null,"X",null,"Não possui barra na vertical da borda frontal da bacia sanitária.",null,null,"X",null,"Não possui barra na vertical da borda frontal da bacia sanitária.",null,null,"X",null,"Não possui barra na vertical da borda frontal da bacia sanitária.",null,null,"X",null,"Não possui barra na vertical da borda frontal da bacia sanitária."]
["7.7.2.3.3","i)","O eixo de instalação da barra de apoio fixada na parede de fundo dista 0,30 m em relação ao eixo da bacia sanitária?",null,"X",null,null,null,null,"X",null,null,null,null,"X",null,null,null,null,null,"X",null,"A barra de apoio não está fixada na parede."]
["7.7.2.3.1","j)","A distância entre o eixo do vaso e a face da barra horizontal lateral é de 40 cm?",null,null,"X",null,"Não, a distância do eixo do vaso a face da barra horizontal lateral é de 30cm.",null,null,"X",null,"Não, a distância do eixo do vaso a face da barra horizontal lateral é de 30cm.",null,null,"X",null,"Não, a distância do eixo do vaso a face da barra horizontal lateral é de 30cm.",null,null,"X",null,"Não, a distância do eixo do vaso a face da barra horizontal lateral é de 30cm."]
["7.6.3","k)","As barras de apoio possuem seção circular entre 30 mm e 45 mm de diâmetro?",null,"X",null,null,null,null,"X",null,null,null,null,"X",null,null,null,null,"X"]
["7.6.3","l)","As barras de apoio distam 40 mm  da parede?",null,"X",null,null,null,null,"X",null,null,null,null,"X",null,null,null,null,"X"]
["7.7.3.1","m)","O acionamento da válvula de descarga atende à altura máxima de 1,00 m e é de fácil acionamento?",null,null,"X",null,"O acionamento da válvula de descarga deve estar a uma altura máxima de 1,00m.",null,null,"X",null,"O acionamento da válvula de descarga deve estar a uma altura máxima de 1,00m.",null,null,"X",null,"O acionamento da válvula de descarga deve estar a uma altura máxima de 1,00m.",null,null,"X",null,"O acionamento da válvula de descarga deve estar a uma altura máxima de 1,00m."]
["7.7.2.3.3","n)","No caso de caixa acoplada, a barra sobre esta, possui altura máxima de 89 cm?",null,null,null,"X",null,null,null,null,"X",null,null,null,null,"X",null,null,null,null,"X"]
["7.7.3.2","o)","O acionamento de descarga em caixa acoplada é do tipo alavanca ou sensores?",null,null,null,"X",null,null,null,null,"X",null,null,null,null,"X",null,null,null,null,"X"]
[]
[null,null,null,null,"SIM","NÃO","JUSTIFICATIVA",null,null,"SIM","NÃO","JUSTIFICATIVA",null,null,"SIM","NÃO","JUSTIFICATIVA",null,null,"SIM","NÃO","JUSTIFICATIVA",null,null,"NÃO","JUSTIFICATIVA",null,null,"SIM","NÃO","JUSTIFICATIVA",null,null,"SIM","NÃO","JUSTIFICATIVA",null,null,"SIM","NÃO","JUSTIFICATIVA",null,null,"SIM","NÃO","JUSTIFICATIVA",null,null,"SIM","NÃO","JUSTIFICATIVA",null,null,"SIM","NÃO","JUSTIFICATIVA",null,null,"SIM","NÃO","JUSTIFICATIVA",null,null,"SIM","NÃO","JUSTIFICATIVA",null,null,"SIM","NÃO","JUSTIFICATIVA",null,null,"SIM","NÃO","JUSTIFICATIVA",null,null,"SIM","NÃO","JUSTIFICATIVA",null,null,"SIM","NÃO","JUSTIFICATIVA",null,null,"SIM","NÃO","JUSTIFICATIVA",null,null,"SIM","NÃO","JUSTIFICATIVA",null,null,"SIM","NÃO","JUSTIFICATIVA",null,null,"SIM","NÃO","JUSTIFICATIVA",null,null,"SIM","NÃO","JUSTIFICATIVA",null,null,"SIM","NÃO","JUSTIFICATIVA",null,null,"SIM","NÃO","JUSTIFICATIVA",null,null,"SIM","NÃO","JUSTIFICATIVA"]
[null,null,"NECESSITA PROJETO ?",null,"X",null,"A NBR 9050:2020 determina que os sanitários acessíveis a bacia sanitária não deve ter abertura frontal e devem estar em uma altura entre 0,43m e 0,45m do piso acabado sem considerar o assento. Deve atender os distanciamentos necessários das barras de apoio em relação a bacia sanitária, ter a barra vertical e todas as barras devem ser fixadas na parede. E o acionamento da válvula de descarga deve estar a uma altura máxima de 1,00m.",null,null,"X",null,"A NBR 9050:2020 determina que os sanitários acessíveis a bacia sanitária não deve ter abertura frontal e devem estar em uma altura entre 0,43m e 0,45m do piso acabado sem considerar o assento. Deve atender os distanciamentos necessários das barras de apoio em relação a bacia sanitária, ter a barra vertical e todas as barras devem ser fixadas na parede. E o acionamento da válvula de descarga deve estar a uma altura máxima de 1,00m.",null,null,"X",null,"A NBR 9050:2020 determina que os sanitários acessíveis a bacia sanitária não deve ter abertura frontal e devem estar em uma altura entre 0,43m e 0,45m do piso acabado sem considerar o assento. Deve atender os distanciamentos necessários das barras de apoio em relação a bacia sanitária, ter a barra vertical e todas as barras devem ser fixadas na parede. E o acionamento da válvula de descarga deve estar a uma altura máxima de 1,00m.",null,null,"X",null,"A NBR 9050:2020 determina que os sanitários acessíveis a bacia sanitária não deve ter abertura frontal e devem estar em uma altura entre 0,43m e 0,45m do piso acabado sem considerar o assento. Deve atender os distanciamentos necessários das barras de apoio em relação a bacia sanitária, ter a barra vertical e todas as barras devem ser fixadas na parede. E o acionamento da válvula de descarga deve estar a uma altura máxima de 1,00m."]
[]
["Item da NBR9050",null,"6.2 QUANTO AO LAVATÓRIO:",null,"ATENDE NBR9050-2020",null,"NÃO SE APLICA","OBSERVAÇÕES",null,"ATENDE NBR9050-2020",null,"NÃO SE APLICA","OBSERVAÇÕES",null,"ATENDE NBR9050-2020",null,"NÃO SE APLICA","OBSERVAÇÕES",null,"ATENDE NBR9050-2020",null,"NÃO SE APLICA","OBSERVAÇÕES",null,null,"NÃO SE APLICA","OBSERVAÇÕES",null,"ATENDE NBR9050-2020",null,"NÃO SE APLICA","OBSERVAÇÕES",null,"ATENDE NBR9050-2020",null,"NÃO SE APLICA","OBSERVAÇÕES",null,"ATENDE NBR9050-2020",null,"NÃO SE APLICA","OBSERVAÇÕES",null,"ATENDE NBR9050-2020",null,"NÃO SE APLICA","OBSERVAÇÕES",null,"ATENDE NBR9050-2020",null,"NÃO SE APLICA","OBSERVAÇÕES",null,"ATENDE NBR9050-2020",null,"NÃO SE APLICA","OBSERVAÇÕES",null,"ATENDE NBR9050-2020",null,"NÃO SE APLICA","OBSERVAÇÕES",null,"ATENDE NBR9050-2020",null,"NÃO SE APLICA","OBSERVAÇÕES",null,"ATENDE NBR9050-2020",null,"NÃO SE APLICA","OBSERVAÇÕES",null,"ATENDE NBR9050-2020",null,"NÃO SE APLICA","OBSERVAÇÕES",null,"ATENDE NBR9050-2020",null,"NÃO SE APLICA","OBSERVAÇÕES",null,"ATENDE NBR9050-2020",null,"NÃO SE APLICA","OBSERVAÇÕES",null,"ATENDE NBR9050-2020",null,"NÃO SE APLICA","OBSERVAÇÕES",null,"ATENDE NBR9050-2020",null,"NÃO SE APLICA","OBSERVAÇÕES",null,"ATENDE NBR9050-2020",null,"NÃO SE APLICA","OBSERVAÇÕES",null,"ATENDE NBR9050-2020",null,"NÃO SE APLICA","OBSERVAÇÕES",null,"ATENDE NBR9050-2020",null,"NÃO SE APLICA","OBSERVAÇÕES",null,"ATENDE NBR9050-2020",null,"NÃO SE APLICA","OBSERVAÇÕES",null,"ATENDE NBR9050-2020",null,"NÃO SE APLICA","OBSERVAÇÕES",null,"ATENDE NBR9050-2020",null,"NÃO SE APLICA","OBSERVAÇÕES"]
[null,null,null,null,"SIM","NÃO",null,null,null,"SIM","NÃO",null,null,null,"SIM","NÃO",null,null,null,"SIM","NÃO",null,null,null,"NÃO",null,null,null,"SIM","NÃO",null,null,null,"SIM","NÃO",null,null,null,"SIM","NÃO",null,null,null,"SIM","NÃO",null,null,null,"SIM","NÃO",null,null,null,"SIM","NÃO",null,null,null,"SIM","NÃO",null,null,null,"SIM","NÃO",null,null,null,"SIM","NÃO",null,null,null,"SIM","NÃO",null,null,null,"SIM","NÃO",null,null,null,"SIM","NÃO",null,null,null,"SIM","NÃO",null,null,null,"SIM","NÃO",null,null,null,"SIM","NÃO",null,null,null,"SIM","NÃO",null,null,null,"SIM","NÃO",null,null,null,"SIM","NÃO",null,null,null,"SIM","NÃO",null,null,null,"SIM","NÃO"]
["7.5 (e)","a)","Está fixado a uma altura de 0,78 m a 0,80 m do piso?",null,"X",null,null,null,null,"X",null,null,null,null,"X",null,null,null,null,null,null,"X","No box acessível não tem lavatório."]
["7.8 e\nFigura 113","b)","O lavatório permite área de aproximação para pessoa com deficiência com no mínimo 0,30 m além da borda frontal sob a projeção do lavatório?",null,null,"X",null,"O lavatório não possui 0,30m além da borda frontal.",null,null,"X",null,"O lavatório não possui 0,30m além da borda frontal.",null,null,"X",null,"O lavatório não possui 0,30m além da borda frontal.",null,null,null,"X"]
["7.8.1","c)","O comando da torneira está no máximo a 0,50 m da face externa frontal do lavatório?",null,"X",null,null,null,null,"X",null,null,null,null,"X",null,null,null,null,"X",null,null,"Possui conjunto de lavatórios é instalado em bancada para todo o sanitário coletivo."]
["7.8.2","d)","As torneiras são acionadas por alavanca, sensor eletrônico ou dispositivo equivalente?",null,"X",null,null,null,null,"X",null,null,null,null,"X",null,null,null,null,"X",null,null,"Possui conjunto de lavatórios é instalado em bancada para todo o sanitário coletivo."]
["7.8.1","e)","Possui barra(s) de apoio(s) horizontal(is) instalada(s) na mesma altura do lavatório, com distância máxima de 50 cm do eixo do lavatório, mínima de 4 cm das bordas laterais e máxima de 20 cm da borda frontal?",null,null,"X",null,"Não possui barras de apoio no lavatório.",null,null,"X",null,"Não possui barras de apoio no lavatório.",null,null,"X",null,"Não possui barras de apoio no lavatório.",null,null,"X",null,"Não possui barras de apoio no lavatório."]
["7.8.1","f)","Possui barra(s) de apoio(s) vertical(is) com comprimento mínimo de 40 cm, instalada(s) a uma altura de 90 cm do piso e a uma distância máxima de 50 cm do eixo do lavatório?",null,null,"X",null,"Não possui barras de apoio no lavatório.",null,null,"X",null,"Não possui barras de apoio no lavatório.",null,null,"X",null,"Não possui barras de apoio no lavatório.",null,null,"X",null,"Não possui barras de apoio no lavatório."]
["7.5 e\nFigura 99","g)","O lavatório é sem coluna ou com coluna suspensa, respeitando as dimensões livres de acordo com a Figura 99 da NBR9050?",null,"X",null,null,null,null,"X",null,null,null,null,"X",null,null,null,null,"X"]
["7.10.3","h)","No caso de lavatório instalado em bancada, a altura superior da cuba está entre 78 e 80 cm, e possui altura livre inferior de, no mínimo, 73 cm?",null,null,null,"X",null,null,null,null,"X",null,null,null,null,"X",null,null,null,"X",null,"Não possui a altura livre inferior de 0,73m, possui 0,69m "]
["7.8","i)","Há uma área livre de aproximação do lavatório com dimensão de 1,20 m x 0,80 m frontal ao lavatório? ",null,"X",null,null,null,null,"X",null,null,null,null,"X",null,null,null,null,"X"]
[]
[null,null,null,null,"SIM","NÃO","JUSTIFICATIVA",null,null,"SIM","NÃO","JUSTIFICATIVA",null,null,"SIM","NÃO","JUSTIFICATIVA",null,null,"SIM","NÃO","JUSTIFICATIVA",null,null,"NÃO","JUSTIFICATIVA",null,null,"SIM","NÃO","JUSTIFICATIVA",null,null,"SIM","NÃO","JUSTIFICATIVA",null,null,"SIM","NÃO","JUSTIFICATIVA",null,null,"SIM","NÃO","JUSTIFICATIVA",null,null,"SIM","NÃO","JUSTIFICATIVA",null,null,"SIM","NÃO","JUSTIFICATIVA",null,null,"SIM","NÃO","JUSTIFICATIVA",null,null,"SIM","NÃO","JUSTIFICATIVA",null,null,"SIM","NÃO","JUSTIFICATIVA",null,null,"SIM","NÃO","JUSTIFICATIVA",null,null,"SIM","NÃO","JUSTIFICATIVA",null,null,"SIM","NÃO","JUSTIFICATIVA",null,null,"SIM","NÃO","JUSTIFICATIVA",null,null,"SIM","NÃO","JUSTIFICATIVA",null,null,"SIM","NÃO","JUSTIFICATIVA",null,null,"SIM","NÃO","JUSTIFICATIVA",null,null,"SIM","NÃO","JUSTIFICATIVA",null,null,"SIM","NÃO","JUSTIFICATIVA",null,null,"SIM","NÃO","JUSTIFICATIVA",null,null,"SIM","NÃO","JUSTIFICATIVA"]
[null,null,"NECESSITA PROJETO ?",null,"X",null,"Deve ser fixada as barras de apoio e o posicionamento correto do lavatório para a utilização que permita aproximação de no mínimo 0,30m. ",null,null,"X",null,"Deve ser fixada as barras de apoio e o posicionamento correto do lavatório para a utilização que permita aproximação de no mínimo 0,30m. ",null,null,"X",null,"Deve ser fixada as barras de apoio e o posicionamento correto do lavatório para a utilização que permita aproximação de no mínimo 0,30m. ",null,null,"X",null,"Deve ser aplicada as barras de apoio e o LAVATORIO que permita aproximação de no mínimo 0,30m ou bancada com altura livre inferior de 0,73m."]
[]
["Item da NBR9050",null,"6.3 QUANTO AO MICTÓRIO:",null,"ATENDE NBR9050-2020",null,"NÃO SE APLICA","OBSERVAÇÕES",null,"ATENDE NBR9050-2020",null,"NÃO SE APLICA","OBSERVAÇÕES",null,"ATENDE NBR9050-2020",null,"NÃO SE APLICA","OBSERVAÇÕES",null,"ATENDE NBR9050-2020",null,"NÃO SE APLICA","OBSERVAÇÕES",null,null,"NÃO SE APLICA","OBSERVAÇÕES",null,"ATENDE NBR9050-2020",null,"NÃO SE APLICA","OBSERVAÇÕES",null,"ATENDE NBR9050-2020",null,"NÃO SE APLICA","OBSERVAÇÕES",null,"ATENDE NBR9050-2020",null,"NÃO SE APLICA","OBSERVAÇÕES",null,"ATENDE NBR9050-2020",null,"NÃO SE APLICA","OBSERVAÇÕES",null,"ATENDE NBR9050-2020",null,"NÃO SE APLICA","OBSERVAÇÕES",null,"ATENDE NBR9050-2020",null,"NÃO SE APLICA","OBSERVAÇÕES",null,"ATENDE NBR9050-2020",null,"NÃO SE APLICA","OBSERVAÇÕES",null,"ATENDE NBR9050-2020",null,"NÃO SE APLICA","OBSERVAÇÕES",null,"ATENDE NBR9050-2020",null,"NÃO SE APLICA","OBSERVAÇÕES",null,"ATENDE NBR9050-2020",null,"NÃO SE APLICA","OBSERVAÇÕES",null,"ATENDE NBR9050-2020",null,"NÃO SE APLICA","OBSERVAÇÕES",null,"ATENDE NBR9050-2020",null,"NÃO SE APLICA","OBSERVAÇÕES",null,"ATENDE NBR9050-2020",null,"NÃO SE APLICA","OBSERVAÇÕES",null,"ATENDE NBR9050-2020",null,"NÃO SE APLICA","OBSERVAÇÕES",null,"ATENDE NBR9050-2020",null,"NÃO SE APLICA","OBSERVAÇÕES",null,"ATENDE NBR9050-2020",null,"NÃO SE APLICA","OBSERVAÇÕES",null,"ATENDE NBR9050-2020",null,"NÃO SE APLICA","OBSERVAÇÕES",null,"ATENDE NBR9050-2020",null,"NÃO SE APLICA","OBSERVAÇÕES",null,"ATENDE NBR9050-2020",null,"NÃO SE APLICA","OBSERVAÇÕES",null,"ATENDE NBR9050-2020",null,"NÃO SE APLICA","OBSERVAÇÕES"]
[null,null,null,null,"SIM","NÃO",null,null,null,"SIM","NÃO",null,null,null,"SIM","NÃO",null,null,null,"SIM","NÃO",null,null,null,"NÃO",null,null,null,"SIM","NÃO",null,null,null,"SIM","NÃO",null,null,null,"SIM","NÃO",null,null,null,"SIM","NÃO",null,null,null,"SIM","NÃO",null,null,null,"SIM","NÃO",null,null,null,"SIM","NÃO",null,null,null,"SIM","NÃO",null,null,null,"SIM","NÃO",null,null,null,"SIM","NÃO",null,null,null,"SIM","NÃO",null,null,null,"SIM","NÃO",null,null,null,"SIM","NÃO",null,null,null,"SIM","NÃO",null,null,null,"SIM","NÃO",null,null,null,"SIM","NÃO",null,null,null,"SIM","NÃO",null,null,null,"SIM","NÃO",null,null,null,"SIM","NÃO",null,null,null,"SIM","NÃO"]
["7.10.4.1","a)","Existe área de aproximação frontal para pessoa com mobilidade reduzida (diâmetro de 0,60 m) e para pessoa em cadeira de rodas (0,80 m x 1,20 m)?",null,null,null,"X",null,null,null,null,"X",null,null,null,null,"X",null,null,null,null,"X"]
["7.10.4.3","b)","Para os modelos suspensos, têm altura (na borda frontal) de 0,60 m a 0,65 m?",null,null,null,"X",null,null,null,null,"X",null,null,null,null,"X",null,null,null,null,"X"]
["7.10.4.2","c)","Acionamento da descarga, tipo alavanca ou automática, com altura de 1,00 m do seu eixo?",null,null,null,"X",null,null,null,null,"X",null,null,null,null,"X",null,null,null,null,"X"]
["7.10.4.3","d)","Possui barras de apoio em ambos os lados com afastamento de 0,30 m (a partir do eixo), comprimento mínimo de 0,70 m, fixadas com altura de 0,75 m do piso acabado?",null,null,null,"X",null,null,null,null,"X",null,null,null,null,"X",null,null,null,null,"X"]
[]
[null,null,null,null,"SIM","NÃO","JUSTIFICATIVA",null,null,"SIM","NÃO","JUSTIFICATIVA",null,null,"SIM","NÃO","JUSTIFICATIVA",null,null,"SIM","NÃO","JUSTIFICATIVA",null,null,"NÃO","JUSTIFICATIVA",null,null,"SIM","NÃO","JUSTIFICATIVA",null,null,"SIM","NÃO","JUSTIFICATIVA",null,null,"SIM","NÃO","JUSTIFICATIVA",null,null,"SIM","NÃO","JUSTIFICATIVA",null,null,"SIM","NÃO","JUSTIFICATIVA",null,null,"SIM","NÃO","JUSTIFICATIVA",null,null,"SIM","NÃO","JUSTIFICATIVA",null,null,"SIM","NÃO","JUSTIFICATIVA",null,null,"SIM","NÃO","JUSTIFICATIVA",null,null,"SIM","NÃO","JUSTIFICATIVA",null,null,"SIM","NÃO","JUSTIFICATIVA",null,null,"SIM","NÃO","JUSTIFICATIVA",null,null,"SIM","NÃO","JUSTIFICATIVA",null,null,"SIM","NÃO","JUSTIFICATIVA",null,null,"SIM","NÃO","JUSTIFICATIVA",null,null,"SIM","NÃO","JUSTIFICATIVA",null,null,"SIM","NÃO","JUSTIFICATIVA",null,null,"SIM","NÃO","JUSTIFICATIVA",null,null,"SIM","NÃO","JUSTIFICATIVA",null,null,"SIM","NÃO","JUSTIFICATIVA"]
[null,null,"NECESSITA PROJETO ?",null,null,"X",null,null,null,null,"X",null,null,null,null,"X",null,null,null,null,"X"]
[]
["Item da NBR9050",null,"6.4 QUANTO AOS ACESSÓRIOS:",null,"ATENDE NBR9050-2020",null,"NÃO SE APLICA","OBSERVAÇÕES",null,"ATENDE NBR9050-2020",null,"NÃO SE APLICA","OBSERVAÇÕES",null,"ATENDE NBR9050-2020",null,"NÃO SE APLICA","OBSERVAÇÕES",null,"ATENDE NBR9050-2020",null,"NÃO SE APLICA","OBSERVAÇÕES",null,null,"NÃO SE APLICA","OBSERVAÇÕES",null,"ATENDE NBR9050-2020",null,"NÃO SE APLICA","OBSERVAÇÕES",null,"ATENDE NBR9050-2020",null,"NÃO SE APLICA","OBSERVAÇÕES",null,"ATENDE NBR9050-2020",null,"NÃO SE APLICA","OBSERVAÇÕES",null,"ATENDE NBR9050-2020",null,"NÃO SE APLICA","OBSERVAÇÕES",null,"ATENDE NBR9050-2020",null,"NÃO SE APLICA","OBSERVAÇÕES",null,"ATENDE NBR9050-2020",null,"NÃO SE APLICA","OBSERVAÇÕES",null,"ATENDE NBR9050-2020",null,"NÃO SE APLICA","OBSERVAÇÕES",null,"ATENDE NBR9050-2020",null,"NÃO SE APLICA","OBSERVAÇÕES",null,"ATENDE NBR9050-2020",null,"NÃO SE APLICA","OBSERVAÇÕES",null,"ATENDE NBR9050-2020",null,"NÃO SE APLICA","OBSERVAÇÕES",null,"ATENDE NBR9050-2020",null,"NÃO SE APLICA","OBSERVAÇÕES",null,"ATENDE NBR9050-2020",null,"NÃO SE APLICA","OBSERVAÇÕES",null,"ATENDE NBR9050-2020",null,"NÃO SE APLICA","OBSERVAÇÕES",null,"ATENDE NBR9050-2020",null,"NÃO SE APLICA","OBSERVAÇÕES",null,"ATENDE NBR9050-2020",null,"NÃO SE APLICA","OBSERVAÇÕES",null,"ATENDE NBR9050-2020",null,"NÃO SE APLICA","OBSERVAÇÕES",null,"ATENDE NBR9050-2020",null,"NÃO SE APLICA","OBSERVAÇÕES",null,"ATENDE NBR9050-2020",null,"NÃO SE APLICA","OBSERVAÇÕES",null,"ATENDE NBR9050-2020",null,"NÃO SE APLICA","OBSERVAÇÕES",null,"ATENDE NBR9050-2020",null,"NÃO SE APLICA","OBSERVAÇÕES"]
[null,null,null,null,"SIM","NÃO",null,null,null,"SIM","NÃO",null,null,null,"SIM","NÃO",null,null,null,"SIM","NÃO",null,null,null,"NÃO",null,null,null,"SIM","NÃO",null,null,null,"SIM","NÃO",null,null,null,"SIM","NÃO",null,null,null,"SIM","NÃO",null,null,null,"SIM","NÃO",null,null,null,"SIM","NÃO",null,null,null,"SIM","NÃO",null,null,null,"SIM","NÃO",null,null,null,"SIM","NÃO",null,null,null,"SIM","NÃO",null,null,null,"SIM","NÃO",null,null,null,"SIM","NÃO",null,null,null,"SIM","NÃO",null,null,null,"SIM","NÃO",null,null,null,"SIM","NÃO",null,null,null,"SIM","NÃO",null,null,null,"SIM","NÃO",null,null,null,"SIM","NÃO",null,null,null,"SIM","NÃO",null,null,null,"SIM","NÃO"]
["7.11.1","a)","O espelho, quando instalado em parede sem pias, a borda inferior está no máximo a 0,50 m do piso e a borda superior a no mínimo 1,80 m? ",null,null,null,"X",null,null,null,null,"X",null,null,null,null,"X",null,null,null,null,"X"]
["7.11.1","b)","O espelho, quando instalado sobre o lavatório, a borda inferior está no máximo a 0,90 m do piso e a borda superior a no mínimo 1,80 m? ",null,null,"X",null,"Altura da borda inferior está com 1,08 do piso.",null,null,"X",null,"Altura da borda inferior está com 1,08 do piso.",null,null,"X",null,"Altura da borda inferior está com 1,08 do piso.",null,"X"]
["7.11.2","c)","A papeleira embutida está em altura mínima de 0,55 m do piso?",null,null,null,"X",null,null,null,null,"X",null,null,null,null,"X",null,null,null,null,"X"]
["7.11.2","d)","A papeleira embutida dista no máximo 0,20 m da borda frontal do sanitário?",null,null,null,"X",null,null,null,null,"X",null,null,null,null,"X",null,null,null,null,"X"]
["7.11.2","e)","A papeleira de sobrepor está alinhada com a borda frontal da bacia e o acesso ao papel está a 1,00 m do piso acabado?",null,null,"X",null,"A papeleira de sobrepor está a 0,85m do piso acabado, a norma exige que NAÕ deve se instalada abaixo de 1,00m de altura do piso acabado, para não atrapalhara o acesso à barra.",null,null,"X",null,"A papeleira de sobrepor está a 0,85m do piso acabado, a norma exige que NAÕ deve se instalada abaixo de 1,00m de altura do piso acabado, para não atrapalhara o acesso à barra.",null,null,"X",null,"A papeleira de sobrepor está a 0,85m do piso acabado, a norma exige que NAÕ deve se instalada abaixo de 1,00m de altura do piso acabado, para não atrapalhara o acesso à barra.",null,null,"X",null,"A papeleira de sobrepor NÃO está alinhada com a borda frontal da bacia, localizada na parede de fundo da bacia sanitária."]
["7.11","f)","Os acessórios (cabide, saboneteira, toalheiro, porta-objeto) atendem à altura entre 0,80 m e 1,20 m?",null,"X",null,null,null,null,"X",null,null,null,null,"X",null,null,null,null,"X"]
["7.5 e\n4.6.2","g)","Se existir ducha higiênica, está instalada na área de alcance manual conforme Figuras 16 e 17 da NBR 9050:2020?",null,"X",null,null,null,null,"X",null,null,null,null,"X",null,null,null,null,null,null,"X"]
[]
[null,null,null,null,"SIM","NÃO","JUSTIFICATIVA",null,null,"SIM","NÃO","JUSTIFICATIVA",null,null,"SIM","NÃO","JUSTIFICATIVA",null,null,"SIM","NÃO","JUSTIFICATIVA",null,null,"NÃO","JUSTIFICATIVA",null,null,"SIM","NÃO","JUSTIFICATIVA",null,null,"SIM","NÃO","JUSTIFICATIVA",null,null,"SIM","NÃO","JUSTIFICATIVA",null,null,"SIM","NÃO","JUSTIFICATIVA",null,null,"SIM","NÃO","JUSTIFICATIVA",null,null,"SIM","NÃO","JUSTIFICATIVA",null,null,"SIM","NÃO","JUSTIFICATIVA",null,null,"SIM","NÃO","JUSTIFICATIVA",null,null,"SIM","NÃO","JUSTIFICATIVA",null,null,"SIM","NÃO","JUSTIFICATIVA",null,null,"SIM","NÃO","JUSTIFICATIVA",null,null,"SIM","NÃO","JUSTIFICATIVA",null,null,"SIM","NÃO","JUSTIFICATIVA",null,null,"SIM","NÃO","JUSTIFICATIVA",null,null,"SIM","NÃO","JUSTIFICATIVA",null,null,"SIM","NÃO","JUSTIFICATIVA",null,null,"SIM","NÃO","JUSTIFICATIVA",null,null,"SIM","NÃO","JUSTIFICATIVA",null,null,"SIM","NÃO","JUSTIFICATIVA",null,null,"SIM","NÃO","JUSTIFICATIVA"]
[null,null,"NECESSITA PROJETO ?",null,null,"X","Deve ser ajustado as posições dos acessórios, conforme NBR 9050:2020.  A papeleira deve estar localizada na parede lateral alinhada com a borda frontal da bacia em uma altura de 1,00m do piso acabado e o espelho a borda inferior deve estar em uma altura de no máximo 0,90m do piso acabado. ",null,null,null,"X","Deve ser ajustado as posições dos acessórios, conforme NBR 9050:2020.  A papeleira deve estar localizada na parede lateral alinhada com a borda frontal da bacia em uma altura de 1,00m do piso acabado e o espelho a borda inferior deve estar em uma altura de no máximo 0,90m do piso acabado. ",null,null,null,"X","Deve ser ajustado as posições dos acessórios, conforme NBR 9050:2020.  A papeleira deve estar localizada na parede lateral alinhada com a borda frontal da bacia em uma altura de 1,00m do piso acabado e o espelho a borda inferior deve estar em uma altura de no máximo 0,90m do piso acabado. ",null,null,null,"X","Deve ser ajustado as posições dos acessórios, conforme NBR 9050:2020.  A papeleira deve estar localizada na parede lateral alinhada com a borda frontal da bacia em uma altura de 1,00m do piso acabado. "]

{"sheet":"6a_Sanitários Coletivos","index":9,"n_rows":73,"n_cols":128,"rows_kept":73,"cut":false,"hidden":false,"merged":[[72,126,72,127],[72,81,72,82],[72,86,72,87],[72,91,72,92],[72,96,72,97],[72,101,72,102],[72,106,72,107],[72,111,72,112],[72,116,72,117],[72,121,72,122],[59,117,60,117],[59,119,59,120],[59,121,60,121],[59,122,60,122],[59,124,59,125],[59,126,60,126],[59,127,60,127],[71,81,71,82],[71,86,71,87],[71,91,71,92],[71,96,71,97],[71,101,71,102],[71,106,71,107],[71,111,71,112],[71,116,71,117],[71,121,71,122],[71,126,71,127],[57,126,57,127],[59,79,59,80],[59,81,60,81],[59,82,60,82],[59,84,59,85],[59,86,60,86],[59,87,60,87],[59,89,59,90],[59,91,60,91],[59,92,60,92],[59,94,59,95],[59,96,60,96],[59,97,60,97],[59,99,59,100],[59,101,60,101],[59,102,60,102],[59,104,59,105],[59,106,60,106],[59,107,60,107],[59,109,59,110],[59,111,60,111],[59,112,60,112],[59,114,59,115],[59,116,60,116],[57,81,57,82],[57,86,57,87],[57,91,57,92],[57,96,57,97],[57,101,57,102],[57,106,57,107],[57,111,57,112],[57,116,57,117],[57,121,57,122],[48,117,49,117],[48,119,48,120],[48,121,49,121],[48,122,49,122],[48,124,48,125],[48,126,49,126],[48,127,49,127],[56,81,56,82],[56,86,56,87],[56,91,56,92],[56,96,56,97],[56,101,56,102],[56,106,56,107],[56,111,56,112],[56,116,56,117],[56,121,56,122],[56,126,56,127],[46,126,46,127],[48,79,48,80],[48,81,49,81],[48,82,49,82],[48,84,48,85],[48,86,49,86],[48,87,49,87],[48,89,48,90],[48,91,49,91],[48,92,49,92],[48,94,48,95],[48,96,49,96],[48,97,49,97],[48,99,48,100],[48,101,49,101],[48,102,49,102],[48,104,48,105],[48,106,49,106],[48,107,49,107],[48,109,48,110],[48,111,49,111],[48,112,49,112],[48,114,48,115],[48,116,49,116],[46,81,46,82],[46,86,46,87],[46,91,46,92],[46,96,46,97],[46,101,46,102],[46,106,46,107],[46,111,46,112],[46,116,46,117],[46,121,46,122],[37,117,38,117],[37,119,37,120],[37,121,38,121],[37,122,38,122],[37,124,37,125],[37,126,38,126],[37,127,38,127],[45,81,45,82],[45,86,45,87],[45,91,45,92],[45,96,45,97],[45,101,45,102],[45,106,45,107],[45,111,45,112],[45,116,45,117],[45,121,45,122],[45,126,45,127],[35,126,35,127],[37,79,37,80],[37,81,38,81],[37,82,38,82],[37,84,37,85],[37,86,38,86],[37,87,38,87],[37,89,37,90],[37,91,38,91],[37,92,38,92],[37,94,37,95],[37,96,38,96],[37,97,38,97],[37,99,37,100],[37,101,38,101],[37,102,38,102],[37,104,37,105],[37,106,38,106],[37,107,38,107],[37,109,37,110],[37,111,38,111],[37,112,38,112],[37,114,37,115],[37,116,38,116],[35,81,35,82],[35,86,35,87],[35,91,35,92],[35,96,35,97],[35,101,35,102],[35,106,35,107],[35,111,35,112],[35,116,35,117],[35,121,35,122],[24,117,25,117],[24,119,24,120],[24,121,25,121],[24,122,25,122],[24,124,24,125],[24,126,25,126],[24,127,25,127],[34,81,34,82],[34,86,34,87],[34,91,34,92],[34,96,34,97],[34,101,34,102],[34,106,34,107],[34,111,34,112],[34,116,34,117],[34,121,34,122],[34,126,34,127],[22,126,22,127],[24,79,24,80],[24,81,25,81],[24,82,25,82],[24,84,24,85],[24,86,25,86],[24,87,25,87],[24,89,24,90],[24,91,25,91],[24,92,25,92],[24,94,24,95],[24,96,25,96],[24,97,25,97],[24,99,24,100],[24,101,25,101],[24,102,25,102],[24,104,24,105],[24,106,25,106],[24,107,25,107],[24,109,24,110],[24,111,25,111],[24,112,25,112],[24,114,24,115],[24,116,25,116],[22,81,22,82],[22,86,22,87],[22,91,22,92],[22,96,22,97],[22,101,22,102],[22,106,22,107],[22,111,22,112],[22,116,22,117],[22,121,22,122],[8,117,9,117],[8,119,8,120],[8,121,9,121],[8,122,9,122],[8,124,8,125],[8,126,9,126],[8,127,9,127],[21,81,21,82],[21,86,21,87],[21,91,21,92],[21,96,21,97],[21,101,21,102],[21,106,21,107],[21,111,21,112],[21,116,21,117],[21,121,21,122],[21,126,21,127],[6,124,6,127],[8,79,8,80],[8,81,9,81],[8,82,9,82],[8,84,8,85],[8,86,9,86],[8,87,9,87],[8,89,8,90],[8,91,9,91],[8,92,9,92],[8,94,8,95],[8,96,9,96],[8,97,9,97],[8,99,8,100],[8,101,9,101],[8,102,9,102],[8,104,8,105],[8,106,9,106],[8,107,9,107],[8,109,8,110],[8,111,9,111],[8,112,9,112],[8,114,8,115],[8,116,9,116],[6,79,6,82],[6,84,6,87],[6,89,6,92],[6,94,6,97],[6,99,6,102],[6,104,6,107],[6,109,6,112],[6,114,6,117],[6,119,6,122],[56,6,56,7],[56,11,56,12],[56,16,56,17],[71,6,71,7],[71,11,71,12],[71,16,71,17],[72,6,72,7],[72,11,72,12],[72,16,72,17],[59,17,60,17],[59,4,59,5],[59,6,60,6],[59,9,59,10],[59,7,60,7],[8,12,9,12],[24,12,25,12],[37,12,38,12],[48,12,49,12],[59,12,60,12],[21,6,21,7],[21,11,21,12],[45,6,45,7],[45,11,45,12],[59,11,60,11],[57,6,57,7],[57,11,57,12],[22,6,22,7],[22,11,22,12],[34,6,34,7],[34,11,34,12],[35,6,35,7],[35,11,35,12],[24,7,25,7],[37,7,38,7],[37,0,38,0],[37,2,38,2],[24,0,25,0],[24,2,25,2],[8,0,9,0],[8,2,9,2],[59,14,59,15],[59,16,60,16],[0,0,0,2],[2,0,2,3],[8,4,8,5],[8,6,9,6],[8,9,8,10],[8,11,9,11],[8,14,8,15],[8,16,9,16],[8,7,9,7],[6,4,6,7],[6,9,6,12],[6,14,6,17],[48,0,49,0],[48,2,49,2],[59,0,60,0],[59,2,60,2],[24,4,24,5],[24,6,25,6],[24,9,24,10],[24,11,25,11],[24,14,24,15],[24,16,25,16],[24,17,25,17],[37,4,37,5],[37,6,38,6],[37,9,37,10],[37,11,38,11],[37,14,37,15],[34,16,34,17],[35,16,35,17],[37,16,38,16],[37,17,38,17],[48,11,49,11],[48,14,48,15],[48,16,49,16],[48,17,49,17],[48,4,48,5],[48,6,49,6],[48,9,48,10],[48,7,49,7],[45,16,45,17],[46,6,46,7],[46,11,46,12],[46,16,46,17],[6,19,6,22],[6,24,6,27],[6,29,6,32],[8,19,8,20],[8,21,9,21],[8,22,9,22],[8,24,8,25],[8,26,9,26],[8,27,9,27],[8,29,8,30],[8,31,9,31],[8,32,9,32],[21,21,21,22],[21,26,21,27],[21,31,21,32],[8,17,9,17],[57,16,57,17],[21,16,21,17],[22,16,22,17],[24,19,24,20],[24,21,25,21],[24,22,25,22],[24,24,24,25],[24,26,25,26],[24,27,25,27],[24,29,24,30],[24,31,25,31],[24,32,25,32],[34,21,34,22],[34,26,34,27],[34,31,34,32],[35,21,35,22],[35,26,35,27],[35,31,35,32],[22,21,22,22],[22,26,22,27],[22,31,22,32],[37,27,38,27],[37,29,37,30],[37,31,38,31],[37,32,38,32],[45,21,45,22],[45,26,45,27],[45,31,45,32],[37,19,37,20],[37,21,38,21],[37,22,38,22],[37,24,37,25],[37,26,38,26],[36,22,36,23],[46,31,46,32],[48,19,48,20],[48,21,49,21],[48,22,49,22],[48,24,48,25],[48,26,49,26],[48,27,49,27],[48,29,48,30],[48,31,49,31],[48,32,49,32],[59,19,59,20],[59,21,60,21],[59,22,60,22],[59,24,59,25],[59,26,60,26],[56,21,56,22],[56,26,56,27],[56,31,56,32],[57,21,57,22],[57,26,57,27],[57,31,57,32],[72,21,72,22],[72,26,72,27],[72,31,72,32],[6,34,6,37],[6,39,6,42],[22,36,22,37],[22,41,22,42],[35,36,35,37],[35,41,35,42],[46,36,46,37],[46,41,46,42],[57,36,57,37],[57,41,57,42],[72,36,72,37],[72,41,72,42],[59,27,60,27],[59,29,59,30],[59,31,60,31],[59,32,60,32],[71,21,71,22],[71,26,71,27],[71,31,71,32],[46,21,46,22],[46,26,46,27],[6,44,6,47],[6,49,6,52],[6,54,6,57],[6,59,6,62],[8,34,8,35],[8,36,9,36],[8,37,9,37],[8,39,8,40],[8,41,9,41],[8,42,9,42],[8,44,8,45],[8,46,9,46],[8,47,9,47],[8,49,8,50],[8,51,9,51],[8,52,9,52],[8,62,9,62],[21,36,21,37],[21,41,21,42],[21,46,21,47],[21,51,21,52],[21,56,21,57],[21,61,21,62],[8,54,8,55],[8,56,9,56],[8,57,9,57],[8,59,8,60],[8,61,9,61],[22,46,22,47],[22,51,22,52],[22,56,22,57],[22,61,22,62],[24,34,24,35],[24,36,25,36],[24,37,25,37],[24,39,24,40],[24,41,25,41],[24,42,25,42],[24,44,24,45],[24,46,25,46],[24,47,25,47],[24,49,24,50],[24,51,25,51],[24,52,25,52],[24,62,25,62],[34,36,34,37],[34,41,34,42],[34,46,34,47],[34,51,34,52],[34,56,34,57],[34,61,34,62],[24,54,24,55],[24,56,25,56],[24,57,25,57],[24,59,24,60],[24,61,25,61],[35,46,35,47],[35,51,35,52],[35,56,35,57],[35,61,35,62],[37,34,37,35],[37,36,38,36],[37,37,38,37],[37,39,37,40],[37,41,38,41],[37,42,38,42],[37,44,37,45],[37,46,38,46],[37,47,38,47],[37,49,37,50],[37,51,38,51],[37,52,38,52],[37,62,38,62],[45,36,45,37],[45,41,45,42],[45,46,45,47],[45,51,45,52],[45,56,45,57],[45,61,45,62],[37,54,37,55],[37,56,38,56],[37,57,38,57],[37,59,37,60],[37,61,38,61],[46,56,46,57],[46,61,46,62],[48,34,48,35],[48,36,49,36],[48,37,49,37],[48,39,48,40],[48,41,49,41],[48,42,49,42],[48,44,48,45],[48,46,49,46],[48,47,49,47],[48,49,48,50],[48,51,49,51],[48,52,49,52],[56,36,56,37],[56,41,56,42],[56,46,56,47],[56,51,56,52],[56,56,56,57],[56,61,56,62],[48,54,48,55],[48,56,49,56],[48,57,49,57],[48,59,48,60],[48,61,49,61],[59,34,59,35],[59,36,60,36],[59,37,60,37],[59,39,59,40],[59,41,60,41],[59,42,60,42],[59,44,59,45],[59,46,60,46],[59,47,60,47],[71,36,71,37],[71,41,71,42],[71,46,71,47],[71,51,71,52],[71,56,71,57],[71,61,71,62],[59,54,59,55],[59,56,60,56],[59,57,60,57],[59,59,59,60],[59,61,60,61],[59,49,59,50],[59,51,60,51],[59,52,60,52],[72,46,72,47],[72,51,72,52],[72,56,72,57],[72,61,72,62],[6,64,6,67],[21,66,21,67],[24,64,24,65],[24,66,25,66],[24,67,25,67],[37,64,37,65],[37,66,38,66],[37,67,38,67],[48,64,48,65],[48,66,49,66],[48,67,49,67],[59,64,59,65],[59,62,60,62],[57,46,57,47],[57,51,57,52],[57,56,57,57],[57,61,57,62],[48,62,49,62],[46,46,46,47],[46,51,46,52],[21,71,21,72],[21,76,21,77],[22,66,22,67],[22,71,22,72],[22,76,22,77],[6,69,6,72],[6,74,6,77],[8,64,8,65],[8,66,9,66],[8,67,9,67],[8,69,8,70],[8,71,9,71],[8,72,9,72],[8,74,8,75],[8,76,9,76],[8,77,9,77],[24,77,25,77],[34,66,34,67],[34,71,34,72],[34,76,34,77],[35,66,35,67],[35,71,35,72],[35,76,35,77],[24,69,24,70],[24,71,25,71],[24,72,25,72],[24,74,24,75],[24,76,25,76],[37,77,38,77],[45,66,45,67],[45,71,45,72],[45,76,45,77],[46,66,46,67],[46,71,46,72],[46,76,46,77],[37,69,37,70],[37,71,38,71],[37,72,38,72],[37,74,37,75],[37,76,38,76],[48,77,49,77],[56,66,56,67],[56,71,56,72],[56,76,56,77],[57,66,57,67],[57,71,57,72],[57,76,57,77],[48,69,48,70],[48,71,49,71],[48,72,49,72],[48,74,48,75],[48,76,49,76],[72,66,72,67],[72,71,72,72],[72,76,72,77],[59,74,59,75],[59,76,60,76],[59,77,60,77],[71,66,71,67],[71,71,71,72],[71,76,71,77],[59,66,60,66],[59,67,60,67],[59,69,59,70],[59,71,60,71],[59,72,60,72]]}
[{"$f":"'1_Informações e outros'!C1","v":"Ministério da Mulher, da Família e dos Direitos Humanos\nSecretaria Nacional dos Direitos da Pessoa com Deficiência"}]
[]
["LAUDO / CHECK LIST DE ACESSIBILIDADE PARA AVALIAÇÃO DE CONFORMIDADE ÀS NORMAS DE ACESSIBILIDADE (CONFORME NBR 9050:2020) "]
[]
["UNIDADE / ÓRGÃO",null,{"$f":"'1_Informações e outros'!E5","v":"MINISTÉRIO DA MULHER, DA FAMÍLIA E DOS DIREITOS HUMANOS"}]
[]
[{"$f":"'1_Informações e outros'!M5","v":4},null,null,null,{"$f":"'4.1_Circul'!E7","v":"8º PAVTO"},null,null,null,null,{"$f":"'4.1_Circul'!J7","v":"9º PAVTO"},null,null,null,null,{"$f":"'4.1_Circul'!O7","v":"10º PAVTO"},null,null,null,null,{"$f":"'4.1_Circul'!T7","v":"TÉRREO"},null,null,null,null,{"$f":"'4.1_Circul'!Y7","v":"5º PAVTO"},null,null,null,null,{"$f":"'4.1_Circul'!AD7","v":"6º PAVTO"},null,null,null,null,{"$f":"'4.1_Circul'!AI7","v":"7º PAVTO"},null,null,null,null,{"$f":"'4.1_Circul'!AN7","v":"8º PAVTO"},null,null,null,null,{"$f":"'4.1_Circul'!AS7","v":"9º PAVTO"},null,null,null,null,{"$f":"'4.1_Circul'!AX7","v":"10º PAVTO"},null,null,null,null,{"$f":"'4.1_Circul'!BC7","v":"11º PAVTO"},null,null,null,null,{"$f":"'4.1_Circul'!BH7","v":"12º PAVTO"},null,null,null,null,{"$f":"'4.1_Circul'!BM7","v":"13º PAVTO"},null,null,null,null,{"$f":"'4.1_Circul'!BR7","v":"14º PAVTO"},null,null,null,null,{"$f":"'4.1_Circul'!BW7","v":"15º PAVTO"},null,null,null,null,{"$f":"'4.1_Circul'!CB7","v":"16º PAVTO"},null,null,null,null,{"$f":"'4.1_Circul'!CG7","v":"17º PAVTO"},null,null,null,null,{"$f":"'4.1_Circul'!CL7","v":"18º PAVTO"},null,null,null,null,{"$f":"'4.1_Circul'!CQ7","v":"19º PAVTO"},null,null,null,null,{"$f":"'4.1_Circul'!CV7","v":"20º PAVTO"},null,null,null,null,{"$f":"'4.1_Circul'!DA7","v":"21º PAVTO"},null,null,null,null,{"$f":"'4.1_Circul'!DF7","v":"22º PAVTO"},null,null,null,null,{"$f":"'4.1_Circul'!DK7","v":"23º PAVTO"},null,null,null,null,{"$f":"'4.1_Circul'!DP7","v":"24º PAVTO"},null,null,null,null,{"$f":"'4.1_Circul'!DU7","v":"25º PAVTO"}]
[]
["Item da NBR9050",null,"6a. SANITÁRIOS COLETIVOS\n(caso haja boxe acessível, preencher a guia anterior para o boxe)",null,"ATENDE NBR9050-2020",null,"NÃO SE APLICA","OBSERVAÇÕES",null,"ATENDE NBR9050-2020",null,"NÃO SE APLICA","OBSERVAÇÕES",null,"ATENDE NBR9050-2020",null,"NÃO SE APLICA","OBSERVAÇÕES",null,"ATENDE NBR9050-2020",null,"NÃO SE APLICA","OBSERVAÇÕES",null,"ATENDE NBR9050-2020",null,"NÃO SE APLICA","OBSERVAÇÕES",null,"ATENDE NBR9050-2020",null,"NÃO SE APLICA","OBSERVAÇÕES",null,"ATENDE NBR9050-2020",null,"NÃO SE APLICA","OBSERVAÇÕES",null,"ATENDE NBR9050-2020",null,"NÃO SE APLICA","OBSERVAÇÕES",null,"ATENDE NBR9050-2020",null,"NÃO SE APLICA","OBSERVAÇÕES",null,"ATENDE NBR9050-2020",null,"NÃO SE APLICA","OBSERVAÇÕES",null,"ATENDE NBR9050-2020",null,"NÃO SE APLICA","OBSERVAÇÕES",null,"ATENDE NBR9050-2020",null,"NÃO SE APLICA","OBSERVAÇÕES",null,"ATENDE NBR9050-2020",null,"NÃO SE APLICA","OBSERVAÇÕES",null,"ATENDE NBR9050-2020",null,"NÃO SE APLICA","OBSERVAÇÕES",null,"ATENDE NBR9050-2020",null,"NÃO SE APLICA","OBSERVAÇÕES",null,"ATENDE NBR9050-2020",null,"NÃO SE APLICA","OBSERVAÇÕES",null,"ATENDE NBR9050-2020",null,"NÃO SE APLICA","OBSERVAÇÕES",null,"ATENDE NBR9050-2020",null,"NÃO SE APLICA","OBSERVAÇÕES",null,"ATENDE NBR9050-2020",null,"NÃO SE APLICA","OBSERVAÇÕES",null,"ATENDE NBR9050-2020",null,"NÃO SE APLICA","OBSERVAÇÕES",null,"ATENDE NBR9050-2020",null,"NÃO SE APLICA","OBSERVAÇÕES",null,"ATENDE NBR9050-2020",null,"NÃO SE APLICA","OBSERVAÇÕES",null,"ATENDE NBR9050-2020",null,"NÃO SE APLICA","OBSERVAÇÕES",null,"ATENDE NBR9050-2020",null,"NÃO SE APLICA","OBSERVAÇÕES",null,"ATENDE NBR9050-2020",null,"NÃO SE APLICA","OBSERVAÇÕES"]
[null,null,null,null,"SIM","NÃO",null,null,null,"SIM","NÃO",null,null,null,"SIM","NÃO",null,null,null,"SIM","NÃO",null,null,null,"SIM","NÃO",null,null,null,"SIM","NÃO",null,null,null,"SIM","NÃO",null,null,null,"SIM","NÃO",null,null,null,"SIM","NÃO",null,null,null,"SIM","NÃO",null,null,null,"SIM","NÃO",null,null,null,"SIM","NÃO",null,null,null,"SIM","NÃO",null,null,null,"SIM","NÃO",null,null,null,"SIM","NÃO",null,null,null,"SIM","NÃO",null,null,null,"SIM","NÃO",null,null,null,"SIM","NÃO",null,null,null,"SIM","NÃO",null,null,null,"SIM","NÃO",null,null,null,"SIM","NÃO",null,null,null,"SIM","NÃO",null,null,null,"SIM","NÃO",null,null,null,"SIM","NÃO",null,null,null,"SIM","NÃO"]
["7.10.1","a)","Nos boxes comuns em edificações novas (posteriores a outubro de 2015), as portas têm vão livre mínimo de 0,80 m e contém área livre com no mínimo 0,60 m de diâmetro?",null,null,null,"X","Data do habite-se é de 10 de Novembro de 2011.",null,null,null,"X","Data do habite-se é de 10 de Novembro de 2011.",null,null,null,"X","Data do habite-se é de 10 de Novembro de 2011.",null,null,null,"X","Data do habite-se é de 10 de Novembro de 2011."]
["7.10.1","b)","Nos boxes comuns em edificações existentes (anteriores a outubro de 2015), as portas têm vão livre mínimo de 0,60 m, abrindo para fora (recomendável)?",null,"X",null,null,"o vão livre é de 0,60m, porém a norma recomenda que as portas abram para fora, para facilitar o socorro à pessoas se necessário.",null,"X",null,null,"o vão livre é de 0,60m, porém a norma recomenda que as portas abram para fora, para facilitar o socorro à pessoas se necessário.",null,"X",null,null,"o vão livre é de 0,60m, porém a norma recomenda que as portas abram para fora, para facilitar o socorro à pessoas se necessário.",null,"X",null,null,"o vão livre é de 0,60m, porém a norma recomenda que as portas abram para fora, para facilitar o socorro à pessoas se necessário."]
["7.10.2","c)","Existe pelo menos um boxe sanitário comum com barras de apoio para uso de pessoas com mobilidade reduzida (recomendável)?",null,null,"X",null,"A norma recomenda em sanitários coletivos pelo menos um box com barras de apoio em forma de \"L\", para o uso de pessoas com redução de mobilidade.",null,null,"X",null,"A norma recomenda em sanitários coletivos pelo menos um box com barras de apoio em forma de \"L\", para o uso de pessoas com redução de mobilidade.",null,null,"X",null,"A norma recomenda em sanitários coletivos pelo menos um box com barras de apoio em forma de \"L\", para o uso de pessoas com redução de mobilidade.",null,null,"X",null,"A norma recomenda em sanitários coletivos pelo menos um box com barras de apoio em forma de \"L\", para o uso de pessoas com redução de mobilidade."]
["6.3.4.1","d)","A entrada do sanitário coletivo é sem desnível ou possui desnível entre 5 mm e 20 mm tratado conforme Figura 68?",null,"X",null,null,null,null,"X",null,null,null,null,"X",null,null,null,null,"X"]
["6.3.2","e)","O piso é antiderrapante?",null,null,"X",null,"O piso não é antiderrapante.",null,null,"X",null,"O piso não é antiderrapante.",null,null,"X",null,"O piso não é antiderrapante.",null,null,"X",null,"O piso não é antiderrapante."]
["6.11.2.4","f)","A porta possui um vão livre de 0,80 m?",null,"X",null,null,null,null,"X",null,null,null,null,"X",null,null,null,null,"X"]
["6.11.2.7, 7.11.5 e\n4.6.6.3","g)","A porta possui puxador horizontal, com diâmetro entre 25 mm a 35 mm, com comprimento mínimo de 0,40 m, fixado na parte interna da porta, afastado 0,10 m do batente (do lado da dobradiça) e instalado na altura da maçaneta conforme Figura 86? Na inexistência de maçaneta, o puxador horizontal está instalado a uma altura entre 0,80 m a 1,10 m medidos do eixo do puxador ao piso acabado?",null,null,"X",null," A abertura da porta DEVE SER para fora. ",null,null,"X",null," A abertura da porta DEVE SER para fora. ",null,null,"X",null," A abertura da porta DEVE SER para fora. ",null,null,"X",null," A abertura da porta DEVE SER para fora. "]
["4.6.6.1","h)","A maçaneta é do tipo alavanca, com pelo menos 100 mm de comprimento e acabamento sem arestas e recurvado na extremidade, apresentando uma distância mínima de 40 mm da superfície da porta e instaladas a uma altura entre 0,80 m e 1,10 m do piso acabado?",null,"X",null,null,null,null,"X",null,null,null,null,"X",null,null,null,null,"X"]
["5.4.1","i)","Possui sinalização visual no centro da porta ou na parede ao lado da maçaneta (altura entre 1,20 m e 1,60 m) no lado externo, informando o ambiente?",null,"X",null,null,null,null,"X",null,null,null,null,"X",null,null,null,null,"X",null,null,"Não possui sinalização na parede ao lado da maçaneta."]
["5.4.1","j)","A sinalização visual está associada à sinalização tátil em relevo e Braille (instalada na parede adjacente ou batente em altura entre 0,90 m e 1,20 m) ou sonora?",null,"X",null,null,null,null,"X",null,null,null,null,"X",null,null,null,null,null,"X",null,"Não possui sinalização na parede ao lado da maçaneta."]
[]
[null,null,null,null,"SIM","NÃO","JUSTIFICATIVA",null,null,"SIM","NÃO","JUSTIFICATIVA",null,null,"SIM","NÃO","JUSTIFICATIVA",null,null,"SIM","NÃO","JUSTIFICATIVA",null,null,"SIM","NÃO","JUSTIFICATIVA",null,null,"SIM","NÃO","JUSTIFICATIVA",null,null,"SIM","NÃO","JUSTIFICATIVA",null,null,"SIM","NÃO","JUSTIFICATIVA",null,null,"SIM","NÃO","JUSTIFICATIVA",null,null,"SIM","NÃO","JUSTIFICATIVA",null,null,"SIM","NÃO","JUSTIFICATIVA",null,null,"SIM","NÃO","JUSTIFICATIVA",null,null,"SIM","NÃO","JUSTIFICATIVA",null,null,"SIM","NÃO","JUSTIFICATIVA",null,null,"SIM","NÃO","JUSTIFICATIVA",null,null,"SIM","NÃO","JUSTIFICATIVA",null,null,"SIM","NÃO","JUSTIFICATIVA",null,null,"SIM","NÃO","JUSTIFICATIVA",null,null,"SIM","NÃO","JUSTIFICATIVA",null,null,"SIM","NÃO","JUSTIFICATIVA",null,null,"SIM","NÃO","JUSTIFICATIVA",null,null,"SIM","NÃO","JUSTIFICATIVA",null,null,"SIM","NÃO","JUSTIFICATIVA",null,null,"SIM","NÃO","JUSTIFICATIVA",null,null,"SIM","NÃO","JUSTIFICATIVA"]
[null,null,"NECESSITA PROJETO ?",null,null,"X","Deve ser modificar a abertura da porta no sentido para fora, ter puxador horizontal e estar ao lado oposto ao lado da abertura da porta. E o piso deve ser antiderrapante.",null,null,null,"X","Deve ser modificar a abertura da porta no sentido para fora, ter puxador horizontal e estar ao lado oposto ao lado da abertura da porta. E o piso deve ser antiderrapante.",null,null,null,"X","Deve ser modificar a abertura da porta no sentido para fora, ter puxador horizontal e estar ao lado oposto ao lado da abertura da porta. E o piso deve ser antiderrapante.",null,null,null,"X","Deve ter puxador horizontal e estar ao lado oposto ao lado da abertura da porta, e a sinalização na parede ao lado à maçaneta em relevo e em braile. E o piso deve ser antiderrapante."]
[]
["Item da NBR9050",null,"6.1A QUANTO AO LAVATÓRIO EM SANITÁRIOS COLETIVOS:",null,"ATENDE NBR9050-2020",null,"NÃO SE APLICA","OBSERVAÇÕES",null,"ATENDE NBR9050-2020",null,"NÃO SE APLICA","OBSERVAÇÕES",null,"ATENDE NBR9050-2020",null,"NÃO SE APLICA","OBSERVAÇÕES",null,"ATENDE NBR9050-2020",null,"NÃO SE APLICA","OBSERVAÇÕES",null,"ATENDE NBR9050-2020",null,"NÃO SE APLICA","OBSERVAÇÕES",null,"ATENDE NBR9050-2020",null,"NÃO SE APLICA","OBSERVAÇÕES",null,"ATENDE NBR9050-2020",null,"NÃO SE APLICA","OBSERVAÇÕES",null,"ATENDE NBR9050-2020",null,"NÃO SE APLICA","OBSERVAÇÕES",null,"ATENDE NBR9050-2020",null,"NÃO SE APLICA","OBSERVAÇÕES",null,"ATENDE NBR9050-2020",null,"NÃO SE APLICA","OBSERVAÇÕES",null,"ATENDE NBR9050-2020",null,"NÃO SE APLICA","OBSERVAÇÕES",null,"ATENDE NBR9050-2020",null,"NÃO SE APLICA","OBSERVAÇÕES",null,"ATENDE NBR9050-2020",null,"NÃO SE APLICA","OBSERVAÇÕES",null,"ATENDE NBR9050-2020",null,"NÃO SE APLICA","OBSERVAÇÕES",null,"ATENDE NBR9050-2020",null,"NÃO SE APLICA","OBSERVAÇÕES",null,"ATENDE NBR9050-2020",null,"NÃO SE APLICA","OBSERVAÇÕES",null,"ATENDE NBR9050-2020",null,"NÃO SE APLICA","OBSERVAÇÕES",null,"ATENDE NBR9050-2020",null,"NÃO SE APLICA","OBSERVAÇÕES",null,"ATENDE NBR9050-2020",null,"NÃO SE APLICA","OBSERVAÇÕES",null,"ATENDE NBR9050-2020",null,"NÃO SE APLICA","OBSERVAÇÕES",null,"ATENDE NBR9050-2020",null,"NÃO SE APLICA","OBSERVAÇÕES",null,"ATENDE NBR9050-2020",null,"NÃO SE APLICA","OBSERVAÇÕES",null,"ATENDE NBR9050-2020",null,"NÃO SE APLICA","OBSERVAÇÕES",null,"ATENDE NBR9050-2020",null,"NÃO SE APLICA","OBSERVAÇÕES",null,"ATENDE NBR9050-2020",null,"NÃO SE APLICA","OBSERVAÇÕES"]
[null,null,null,null,"SIM","NÃO",null,null,null,"SIM","NÃO",null,null,null,"SIM","NÃO",null,null,null,"SIM","NÃO",null,null,null,"SIM","NÃO",null,null,null,"SIM","NÃO",null,null,null,"SIM","NÃO",null,null,null,"SIM","NÃO",null,null,null,"SIM","NÃO",null,null,null,"SIM","NÃO",null,null,null,"SIM","NÃO",null,null,null,"SIM","NÃO",null,null,null,"SIM","NÃO",null,null,null,"SIM","NÃO",null,null,null,"SIM","NÃO",null,null,null,"SIM","NÃO",null,null,null,"SIM","NÃO",null,null,null,"SIM","NÃO",null,null,null,"SIM","NÃO",null,null,null,"SIM","NÃO",null,null,null,"SIM","NÃO",null,null,null,"SIM","NÃO",null,null,null,"SIM","NÃO",null,null,null,"SIM","NÃO",null,null,null,"SIM","NÃO"]
["7.5","a)","Pelo menos um lavatório está fixado a uma altura de 78 cm a 80 cm do piso?",null,null,"X",null,"O conjunto de lavatórios está em bancada na altura de 0,90m.",null,null,"X",null,"O conjunto de lavatórios está em bancada na altura de 0,90m.",null,null,"X",null,"O conjunto de lavatórios está em bancada na altura de 0,90m.",null,null,"X",null,"O conjunto de lavatórios está em bancada na altura de 0,90m."]
["7.10.3","b)","No caso de lavatório instalado em bancada, pelo menos uma cuba possui altura superior entre 78 e 80 cm e possui altura livre inferior de no mínimo 73 cm?",null,null,"X",null,"O vão livre inferior é 0,69m.",null,null,"X",null,"O vão livre inferior é 0,69m.",null,null,"X",null,"O vão livre inferior é 0,69m.",null,null,"X",null,"O vão livre inferior é 0,69m."]
["7.10.3","c)","Nesse caso, possui barras de apoio e está(ao) posicionada(s) na extremidade do conjunto?",null,null,"X",null,"Não possui barra de apoio.",null,null,"X",null,"Não possui barra de apoio.",null,null,"X",null,"Não possui barra de apoio.",null,null,"X",null,"Não possui barra de apoio."]
["7.8.1","d)","O comando da torneira está no máximo a 50 cm da face externa frontal do lavatório?",null,"X",null,null,null,null,"X",null,null,null,null,"X",null,null,null,null,"X"]
["7.8.2","e)","As torneiras são acionadas por alavanca, sensor eletrônico ou dispositivo equivalente?",null,"X",null,null,null,null,"X",null,null,null,null,"X",null,null,null,null,"X"]
["7.8.1","f)","Possui barra(s) de apoio(s) horizontal(is) instalada(s) na mesma altura do lavatório, com distância máxima de 50 cm do eixo do lavatório, mínima de 4 cm das bordas laterais e máxima de 20 cm da borda frontal?",null,null,"X",null,"Não possui barra de apoio.",null,null,"X",null,"Não possui barra de apoio.",null,null,"X",null,"Não possui barra de apoio.",null,null,"X",null,"Não possui barra de apoio."]
["7.8.1","g)","Possui barra(s) de apoio(s) vertical(is) com comprimento mínimo de 40 cm, instalada(s) a uma altura de 90 cm do piso e a uma distância máxima de 50 cm do eixo do lavatório?",null,null,"X",null,"Não possui barra de apoio.",null,null,"X",null,"Não possui barra de apoio.",null,null,"X",null,"Não possui barra de apoio.",null,null,"X",null,"Não possui barra de apoio."]
[]
[null,null,null,null,"SIM","NÃO","JUSTIFICATIVA",null,null,"SIM","NÃO","JUSTIFICATIVA",null,null,"SIM","NÃO","JUSTIFICATIVA",null,null,"SIM","NÃO","JUSTIFICATIVA",null,null,"SIM","NÃO","JUSTIFICATIVA",null,null,"SIM","NÃO","JUSTIFICATIVA",null,null,"SIM","NÃO","JUSTIFICATIVA",null,null,"SIM","NÃO","JUSTIFICATIVA",null,null,"SIM","NÃO","JUSTIFICATIVA",null,null,"SIM","NÃO","JUSTIFICATIVA",null,null,"SIM","NÃO","JUSTIFICATIVA",null,null,"SIM","NÃO","JUSTIFICATIVA",null,null,"SIM","NÃO","JUSTIFICATIVA",null,null,"SIM","NÃO","JUSTIFICATIVA",null,null,"SIM","NÃO","JUSTIFICATIVA",null,null,"SIM","NÃO","JUSTIFICATIVA",null,null,"SIM","NÃO","JUSTIFICATIVA",null,null,"SIM","NÃO","JUSTIFICATIVA",null,null,"SIM","NÃO","JUSTIFICATIVA",null,null,"SIM","NÃO","JUSTIFICATIVA",null,null,"SIM","NÃO","JUSTIFICATIVA",null,null,"SIM","NÃO","JUSTIFICATIVA",null,null,"SIM","NÃO","JUSTIFICATIVA",null,null,"SIM","NÃO","JUSTIFICATIVA",null,null,"SIM","NÃO","JUSTIFICATIVA"]
[null,null,"NECESSITA PROJETO ?",null,null,"X","Deve ter pelo menos um lavatório em sanitários coletivos, em altura de 0,78m a 0,80m do piso dotado de barras de apoio, ou lavatório em bancada deve ter a altura inferior livre de 0,73m do piso, e as barras de apoio deve estar posicionada nas extremidades do conjunto, podendo ser em apenas uma das extremidades.",null,null,null,"X","Deve ter pelo menos um lavatório em sanitários coletivos, em altura de 0,78m a 0,80m do piso dotado de barras de apoio, ou lavatório em bancada deve ter a altura inferior livre de 0,73m do piso, e as barras de apoio deve estar posicionada nas extremidades do conjunto, podendo ser em apenas uma das extremidades.",null,null,null,"X","Deve ter pelo menos um lavatório em sanitários coletivos, em altura de 0,78m a 0,80m do piso dotado de barras de apoio, ou lavatório em bancada deve ter a altura inferior livre de 0,73m do piso, e as barras de apoio deve estar posicionada nas extremidades do conjunto, podendo ser em apenas uma das extremidades.",null,null,null,"X","Deve ter pelo menos um lavatório em sanitários coletivos, em altura de 0,78m a 0,80m do piso dotado de barras de apoio, ou lavatório em bancada deve ter a altura inferior livre de 0,73m do piso, e as barras de apoio deve estar posicionada nas extremidades do conjunto, podendo ser em apenas uma das extremidades."]
[null,null,null,null,null,null,null,null,null,null,null,null,null,null,null,null,null,null,null,null,null,null,"O lavatório em sanitários coletivos DEVE ser dotado de barras de apoio, no caso de bancadas devem estar posicionadas nas extremidades do conjunto, podendo ser em apenas uma das extremidades."]
["Item da NBR9050",null,"6.2A QUANTO AO MICTÓRIO:",null,"ATENDE NBR9050-2020",null,"NÃO SE APLICA","OBSERVAÇÕES",null,"ATENDE NBR9050-2020",null,"NÃO SE APLICA","OBSERVAÇÕES",null,"ATENDE NBR9050-2020",null,"NÃO SE APLICA","OBSERVAÇÕES",null,"ATENDE NBR9050-2020",null,"NÃO SE APLICA","OBSERVAÇÕES",null,"ATENDE NBR9050-2020",null,"NÃO SE APLICA","OBSERVAÇÕES",null,"ATENDE NBR9050-2020",null,"NÃO SE APLICA","OBSERVAÇÕES",null,"ATENDE NBR9050-2020",null,"NÃO SE APLICA","OBSERVAÇÕES",null,"ATENDE NBR9050-2020",null,"NÃO SE APLICA","OBSERVAÇÕES",null,"ATENDE NBR9050-2020",null,"NÃO SE APLICA","OBSERVAÇÕES",null,"ATENDE NBR9050-2020",null,"NÃO SE APLICA","OBSERVAÇÕES",null,"ATENDE NBR9050-2020",null,"NÃO SE APLICA","OBSERVAÇÕES",null,"ATENDE NBR9050-2020",null,"NÃO SE APLICA","OBSERVAÇÕES",null,"ATENDE NBR9050-2020",null,"NÃO SE APLICA","OBSERVAÇÕES",null,"ATENDE NBR9050-2020",null,"NÃO SE APLICA","OBSERVAÇÕES",null,"ATENDE NBR9050-2020",null,"NÃO SE APLICA","OBSERVAÇÕES",null,"ATENDE NBR9050-2020",null,"NÃO SE APLICA","OBSERVAÇÕES",null,"ATENDE NBR9050-2020",null,"NÃO SE APLICA","OBSERVAÇÕES",null,"ATENDE NBR9050-2020",null,"NÃO SE APLICA","OBSERVAÇÕES",null,"ATENDE NBR9050-2020",null,"NÃO SE APLICA","OBSERVAÇÕES",null,"ATENDE NBR9050-2020",null,"NÃO SE APLICA","OBSERVAÇÕES",null,"ATENDE NBR9050-2020",null,"NÃO SE APLICA","OBSERVAÇÕES",null,"ATENDE NBR9050-2020",null,"NÃO SE APLICA","OBSERVAÇÕES",null,"ATENDE NBR9050-2020",null,"NÃO SE APLICA","OBSERVAÇÕES",null,"ATENDE NBR9050-2020",null,"NÃO SE APLICA","OBSERVAÇÕES",null,"ATENDE NBR9050-2020",null,"NÃO SE APLICA","OBSERVAÇÕES"]
[null,null,null,null,"SIM","NÃO",null,null,null,"SIM","NÃO",null,null,null,"SIM","NÃO",null,null,null,"SIM","NÃO",null,null,null,"SIM","NÃO",null,null,null,"SIM","NÃO",null,null,null,"SIM","NÃO",null,null,null,"SIM","NÃO",null,null,null,"SIM","NÃO",null,null,null,"SIM","NÃO",null,null,null,"SIM","NÃO",null,null,null,"SIM","NÃO",null,null,null,"SIM","NÃO",null,null,null,"SIM","NÃO",null,null,null,"SIM","NÃO",null,null,null,"SIM","NÃO",null,null,null,"SIM","NÃO",null,null,null,"SIM","NÃO",null,null,null,"SIM","NÃO",null,null,null,"SIM","NÃO",null,null,null,"SIM","NÃO",null,null,null,"SIM","NÃO",null,null,null,"SIM","NÃO",null,null,null,"SIM","NÃO",null,null,null,"SIM","NÃO"]
["7.10.4","a)","Pelo menos 01 (um) mictório é destinado ao uso por pessoa com deficiência ou mobilidade reduzida?",null,null,"X",null,null,null,null,"X",null,null,null,null,"X",null,null,null,null,"X"]
["7.10.4.1","b)","Existe área de aproximação frontal para pessoa com mobilidade reduzida (diâmetro de 60 cm)  e para pessoa em cadeira de rodas (0,80 m x 1,20 m)?",null,null,"X",null,null,null,null,"X",null,null,null,null,"X",null,null,null,null,"X",{"$f":"IF(V$40=\"X\",\"X\",\"\")","v":""},null,null,null,null,{"$f":"IF(AA$40=\"X\",\"X\",\"\")","v":""},null,null,null,null,{"$f":"IF(AF$40=\"X\",\"X\",\"\")","v":""},null,null,null,null,{"$f":"IF(AK$40=\"X\",\"X\",\"\")","v":""},null,null,null,null,{"$f":"IF(AP$40=\"X\",\"X\",\"\")","v":""},null,null,null,null,{"$f":"IF(AU$40=\"X\",\"X\",\"\")","v":""},null,null,null,null,{"$f":"IF(AZ$40=\"X\",\"X\",\"\")","v":""},null,null,null,null,{"$f":"IF(BE$40=\"X\",\"X\",\"\")","v":""},null,null,null,null,{"$f":"IF(BJ$40=\"X\",\"X\",\"\")","v":""},null,null,null,null,{"$f":"IF(BO$40=\"X\",\"X\",\"\")","v":""},null,null,null,null,{"$f":"IF(BT$40=\"X\",\"X\",\"\")","v":""},null,null,null,null,{"$f":"IF(BY$40=\"X\",\"X\",\"\")","v":""},null,null,null,null,{"$f":"IF(CD$40=\"X\",\"X\",\"\")","v":""},null,null,null,null,{"$f":"IF(CI$40=\"X\",\"X\",\"\")","v":""},null,null,null,null,{"$f":"IF(CN$40=\"X\",\"X\",\"\")","v":""},null,null,null,null,{"$f":"IF(CS$40=\"X\",\"X\",\"\")","v":""},null,null,null,null,{"$f":"IF(CX$40=\"X\",\"X\",\"\")","v":""},null,null,null,null,{"$f":"IF(DC$40=\"X\",\"X\",\"\")","v":""},null,null,null,null,{"$f":"IF(DH$40=\"X\",\"X\",\"\")","v":""},null,null,null,null,{"$f":"IF(DM$40=\"X\",\"X\",\"\")","v":""},null,null,null,null,{"$f":"IF(DR$40=\"X\",\"X\",\"\")","v":""},null,null,null,null,{"$f":"IF(DW$40=\"X\",\"X\",\"\")","v":""}]
["7.10.4.3","c)","Para os modelos suspensos, têm altura (na borda frontal) de 0,60 m a 0,65 m?",null,null,"X",null,"Possui altura de 0,68m do piso ",null,null,"X",null,"Possui altura de 0,68m do piso ",null,null,"X",null,"Possui altura de 0,68m do piso ",null,null,"X",{"$f":"IF(V$40=\"X\",\"X\",\"\")","v":""},"Possui altura de 0,68m do piso ",null,null,null,{"$f":"IF(AA$40=\"X\",\"X\",\"\")","v":""},null,null,null,null,{"$f":"IF(AF$40=\"X\",\"X\",\"\")","v":""},null,null,null,null,{"$f":"IF(AK$40=\"X\",\"X\",\"\")","v":""},null,null,null,null,{"$f":"IF(AP$40=\"X\",\"X\",\"\")","v":""},null,null,null,null,{"$f":"IF(AU$40=\"X\",\"X\",\"\")","v":""},null,null,null,null,{"$f":"IF(AZ$40=\"X\",\"X\",\"\")","v":""},null,null,null,null,{"$f":"IF(BE$40=\"X\",\"X\",\"\")","v":""},null,null,null,null,{"$f":"IF(BJ$40=\"X\",\"X\",\"\")","v":""},null,null,null,null,{"$f":"IF(BO$40=\"X\",\"X\",\"\")","v":""},null,null,null,null,{"$f":"IF(BT$40=\"X\",\"X\",\"\")","v":""},null,null,null,null,{"$f":"IF(BY$40=\"X\",\"X\",\"\")","v":""},null,null,null,null,{"$f":"IF(CD$40=\"X\",\"X\",\"\")","v":""},null,null,null,null,{"$f":"IF(CI$40=\"X\",\"X\",\"\")","v":""},null,null,null,null,{"$f":"IF(CN$40=\"X\",\"X\",\"\")","v":""},null,null,null,null,{"$f":"IF(CS$40=\"X\",\"X\",\"\")","v":""},null,null,null,null,{"$f":"IF(CX$40=\"X\",\"X\",\"\")","v":""},null,null,null,null,{"$f":"IF(DC$40=\"X\",\"X\",\"\")","v":""},null,null,null,null,{"$f":"IF(DH$40=\"X\",\"X\",\"\")","v":""},null,null,null,null,{"$f":"IF(DM$40=\"X\",\"X\",\"\")","v":""},null,null,null,null,{"$f":"IF(DR$40=\"X\",\"X\",\"\")","v":""},null,null,null,null,{"$f":"IF(DW$40=\"X\",\"X\",\"\")","v":""}]
["7.10.4.2","d)","A válvula está instalada a uma altura de até 1,00 m do piso acabado? É preferível sensor eletrônico ou dispositivos equivalentes ou de fechamento automático.",null,null,"X",null,null,null,null,"X",null,null,null,null,"X",null,null,null,null,"X","",null,null,null,null,"",null,null,null,null,"",null,null,null,null,"",null,null,null,null,"",null,null,null,null,"",null,null,null,null,"",null,null,null,null,"",null,null,null,null,"",null,null,null,null,"",null,null,null,null,"",null,null,null,null,"",null,null,null,null,"",null,null,null,null,"",null,null,null,null,"",null,null,null,null,"",null,null,null,null,"",null,null,null,null,"",null,null,null,null,"",null,null,null,null,"",null,null,null,null,"",null,null,null,null,""]
["7.10.4.3","e)","Possui barras de apoio em ambos os lados com afastamento de 0,30 m (a partir do eixo), comprimento mínimo de 0,70 m, fixadas a altura de 0,75 m do piso acabado?",null,null,"X",null,null,null,null,"X",null,null,null,null,"X",null,null,null,null,"X","",null,null,null,null,"",null,null,null,null,"",null,null,null,null,"",null,null,null,null,"",null,null,null,null,"",null,null,null,null,"",null,null,null,null,"",null,null,null,null,"",null,null,null,null,"",null,null,null,null,"",null,null,null,null,"",null,null,null,null,"",null,null,null,null,"",null,null,null,null,"",null,null,null,null,"",null,null,null,null,"",null,null,null,null,"",null,null,null,null,"",null,null,null,null,"",null,null,null,null,"",null,null,null,null,""]
[]
[null,null,null,null,"SIM","NÃO","JUSTIFICATIVA",null,null,"SIM","NÃO","JUSTIFICATIVA",null,null,"SIM","NÃO","JUSTIFICATIVA",null,null,"SIM","NÃO","JUSTIFICATIVA",null,null,"SIM","NÃO","JUSTIFICATIVA",null,null,"SIM","NÃO","JUSTIFICATIVA",null,null,"SIM","NÃO","JUSTIFICATIVA",null,null,"SIM","NÃO","JUSTIFICATIVA",null,null,"SIM","NÃO","JUSTIFICATIVA",null,null,"SIM","NÃO","JUSTIFICATIVA",null,null,"SIM","NÃO","JUSTIFICATIVA",null,null,"SIM","NÃO","JUSTIFICATIVA",null,null,"SIM","NÃO","JUSTIFICATIVA",null,null,"SIM","NÃO","JUSTIFICATIVA",null,null,"SIM","NÃO","JUSTIFICATIVA",null,null,"SIM","NÃO","JUSTIFICATIVA",null,null,"SIM","NÃO","JUSTIFICATIVA",null,null,"SIM","NÃO","JUSTIFICATIVA",null,null,"SIM","NÃO","JUSTIFICATIVA",null,null,"SIM","NÃO","JUSTIFICATIVA",null,null,"SIM","NÃO","JUSTIFICATIVA",null,null,"SIM","NÃO","JUSTIFICATIVA",null,null,"SIM","NÃO","JUSTIFICATIVA",null,null,"SIM","NÃO","JUSTIFICATIVA",null,null,"SIM","NÃO","JUSTIFICATIVA"]
[null,null,"NECESSITA PROJETO ?",null,"X",null,"Deve ser feita a adaptação da área do mictório em altura para modelos suspensos de 0,60 m a 0,65 com as instalações das barras de apoio, em pelo menos um mictório e com válvula em altura de 1,00m do piso, sendo acessível para pessoas com mobilidade reduzida.",null,null,"X",null,"Deve ser feita a adaptação da área do mictório em altura para modelos suspensos de 0,60 m a 0,65 com as instalações das barras de apoio, em pelo menos um mictório e com válvula em altura de 1,00m do piso, sendo acessível para pessoas com mobilidade reduzida.",null,null,"X",null,"Deve ser feita a adaptação da área do mictório em altura para modelos suspensos de 0,60 m a 0,65 com as instalações das barras de apoio, em pelo menos um mictório e com válvula em altura de 1,00m do piso, sendo acessível para pessoas com mobilidade reduzida.",null,null,null,null,"Deve ser feita a adaptação da área do mictório em altura para modelos suspensos de 0,60 m a 0,65 com as instalações das barras de apoio, em pelo menos um mictório e com válvula em altura de 1,00m do piso, sendo acessível para pessoas com mobilidade reduzida."]
[]
["Item da NBR9050",null,"6.3A QUANTO AOS ACESSÓRIOS:",null,"ATENDE NBR9050-2020",null,"NÃO SE APLICA","OBSERVAÇÕES",null,"ATENDE NBR9050-2020",null,"NÃO SE APLICA","OBSERVAÇÕES",null,"ATENDE NBR9050-2020",null,"NÃO SE APLICA","OBSERVAÇÕES",null,"ATENDE NBR9050-2020",null,"NÃO SE APLICA","OBSERVAÇÕES",null,"ATENDE NBR9050-2020",null,"NÃO SE APLICA","OBSERVAÇÕES",null,"ATENDE NBR9050-2020",null,"NÃO SE APLICA","OBSERVAÇÕES",null,"ATENDE NBR9050-2020",null,"NÃO SE APLICA","OBSERVAÇÕES",null,"ATENDE NBR9050-2020",null,"NÃO SE APLICA","OBSERVAÇÕES",null,"ATENDE NBR9050-2020",null,"NÃO SE APLICA","OBSERVAÇÕES",null,"ATENDE NBR9050-2020",null,"NÃO SE APLICA","OBSERVAÇÕES",null,"ATENDE NBR9050-2020",null,"NÃO SE APLICA","OBSERVAÇÕES",null,"ATENDE NBR9050-2020",null,"NÃO SE APLICA","OBSERVAÇÕES",null,"ATENDE NBR9050-2020",null,"NÃO SE APLICA","OBSERVAÇÕES",null,"ATENDE NBR9050-2020",null,"NÃO SE APLICA","OBSERVAÇÕES",null,"ATENDE NBR9050-2020",null,"NÃO SE APLICA","OBSERVAÇÕES",null,"ATENDE NBR9050-2020",null,"NÃO SE APLICA","OBSERVAÇÕES",null,"ATENDE NBR9050-2020",null,"NÃO SE APLICA","OBSERVAÇÕES",null,"ATENDE NBR9050-2020",null,"NÃO SE APLICA","OBSERVAÇÕES",null,"ATENDE NBR9050-2020",null,"NÃO SE APLICA","OBSERVAÇÕES",null,"ATENDE NBR9050-2020",null,"NÃO SE APLICA","OBSERVAÇÕES",null,"ATENDE NBR9050-2020",null,"NÃO SE APLICA","OBSERVAÇÕES",null,"ATENDE NBR9050-2020",null,"NÃO SE APLICA","OBSERVAÇÕES",null,"ATENDE NBR9050-2020",null,"NÃO SE APLICA","OBSERVAÇÕES",null,"ATENDE NBR9050-2020",null,"NÃO SE APLICA","OBSERVAÇÕES",null,"ATENDE NBR9050-2020",null,"NÃO SE APLICA","OBSERVAÇÕES"]
[null,null,null,null,"SIM","NÃO",null,null,null,"SIM","NÃO",null,null,null,"SIM","NÃO",null,null,null,"SIM","NÃO",null,null,null,"SIM","NÃO",null,null,null,"SIM","NÃO",null,null,null,"SIM","NÃO",null,null,null,"SIM","NÃO",null,null,null,"SIM","NÃO",null,null,null,"SIM","NÃO",null,null,null,"SIM","NÃO",null,null,null,"SIM","NÃO",null,null,null,"SIM","NÃO",null,null,null,"SIM","NÃO",null,null,null,"SIM","NÃO",null,null,null,"SIM","NÃO",null,null,null,"SIM","NÃO",null,null,null,"SIM","NÃO",null,null,null,"SIM","NÃO",null,null,null,"SIM","NÃO",null,null,null,"SIM","NÃO",null,null,null,"SIM","NÃO",null,null,null,"SIM","NÃO",null,null,null,"SIM","NÃO",null,null,null,"SIM","NÃO"]
["7.11.1","a)","O espelho, quando instalado em parede sem pias, a borda inferior está no máximo a 0,50 m do piso e a borda superior a no mínimo 1,80 m? ",null,null,null,"X",null,null,null,null,"X",null,null,null,null,"X",null,null,null,null,"X"]
["7.11.1","b)","O espelho, quando instalado sobre o lavatório, a borda inferior está no máximo a 0,90 m do piso e a borda superior a no mínimo 1,80 m? ",null,null,"X",null," A borda inferior está em uma altura de 1,05m do piso.",null,null,"X",null," A borda inferior está em uma altura de 1,05m do piso.",null,null,"X",null," A borda inferior está em uma altura de 1,05m do piso.",null,null,"X",null," A borda inferior está em uma altura de 1,05m do piso."]
["7.11","c)","Os acessórios (cabide, saboneteira, toalheiro, porta-objeto) atendem à altura entre 0,80 m e 1,20 m?",null,"X",null,null,null,null,"X",null,null,null,null,"X",null,null,null,null,"X"]
["7.11.3","d)","Possui cabides instalados junto a lavatórios, boxes de bacia sanitária e chuveiros?",null,null,null,"X",null,null,null,null,"X",null,null,null,null,"X",null,null,null,null,"X"]
["7.11.4","e)","Possui porta-objetos instalados junto a lavatórios, mictórios e bacias sanitárias, com profundidade máxima de 25 cm, sem interfir nas áreas de transferência e manobra e utilização das barras de apoio?",null,"X",null,null,null,null,"X",null,null,null,null,"X",null,null,null,null,"X"]
[]
[null,null,null,null,"SIM","NÃO","JUSTIFICATIVA",null,null,"SIM","NÃO","JUSTIFICATIVA",null,null,"SIM","NÃO","JUSTIFICATIVA",null,null,"SIM","NÃO","JUSTIFICATIVA",null,null,"SIM","NÃO","JUSTIFICATIVA",null,null,"SIM","NÃO","JUSTIFICATIVA",null,null,"SIM","NÃO","JUSTIFICATIVA",null,null,"SIM","NÃO","JUSTIFICATIVA",null,null,"SIM","NÃO","JUSTIFICATIVA",null,null,"SIM","NÃO","JUSTIFICATIVA",null,null,"SIM","NÃO","JUSTIFICATIVA",null,null,"SIM","NÃO","JUSTIFICATIVA",null,null,"SIM","NÃO","JUSTIFICATIVA",null,null,"SIM","NÃO","JUSTIFICATIVA",null,null,"SIM","NÃO","JUSTIFICATIVA",null,null,"SIM","NÃO","JUSTIFICATIVA",null,null,"SIM","NÃO","JUSTIFICATIVA",null,null,"SIM","NÃO","JUSTIFICATIVA",null,null,"SIM","NÃO","JUSTIFICATIVA",null,null,"SIM","NÃO","JUSTIFICATIVA",null,null,"SIM","NÃO","JUSTIFICATIVA",null,null,"SIM","NÃO","JUSTIFICATIVA",null,null,"SIM","NÃO","JUSTIFICATIVA",null,null,"SIM","NÃO","JUSTIFICATIVA",null,null,"SIM","NÃO","JUSTIFICATIVA"]
[null,null,"NECESSITA PROJETO ?",null,null,"X"," A borda inferior do espelho deve estar em uma altura máxima de 0,90m do piso.",null,null,null,"X"," A borda inferior do espelho deve estar em uma altura máxima de 0,90m do piso.",null,null,null,"X"," A borda inferior do espelho deve estar em uma altura máxima de 0,90m do piso.",null,null,null,"X"," A borda inferior do espelho deve estar em uma altura máxima de 0,90m do piso."]
[]
["Item da NBR9050","","6.4A QUANTO AOS CHUVEIROS:",null,"ATENDE NBR9050-2020",null,"NÃO SE APLICA","OBSERVAÇÕES",null,"ATENDE NBR9050-2020",null,"NÃO SE APLICA","OBSERVAÇÕES",null,"ATENDE NBR9050-2020",null,"NÃO SE APLICA","OBSERVAÇÕES",null,"ATENDE NBR9050-2020",null,"NÃO SE APLICA","OBSERVAÇÕES",null,"ATENDE NBR9050-2020",null,"NÃO SE APLICA","OBSERVAÇÕES",null,"ATENDE NBR9050-2020",null,"NÃO SE APLICA","OBSERVAÇÕES",null,"ATENDE NBR9050-2020",null,"NÃO SE APLICA","OBSERVAÇÕES",null,"ATENDE NBR9050-2020",null,"NÃO SE APLICA","OBSERVAÇÕES",null,"ATENDE NBR9050-2020",null,"NÃO SE APLICA","OBSERVAÇÕES",null,"ATENDE NBR9050-2020",null,"NÃO SE APLICA","OBSERVAÇÕES",null,"ATENDE NBR9050-2020",null,"NÃO SE APLICA","OBSERVAÇÕES",null,"ATENDE NBR9050-2020",null,"NÃO SE APLICA","OBSERVAÇÕES",null,"ATENDE NBR9050-2020",null,"NÃO SE APLICA","OBSERVAÇÕES",null,"ATENDE NBR9050-2020",null,"NÃO SE APLICA","OBSERVAÇÕES",null,"ATENDE NBR9050-2020",null,"NÃO SE APLICA","OBSERVAÇÕES",null,"ATENDE NBR9050-2020",null,"NÃO SE APLICA","OBSERVAÇÕES",null,"ATENDE NBR9050-2020",null,"NÃO SE APLICA","OBSERVAÇÕES",null,"ATENDE NBR9050-2020",null,"NÃO SE APLICA","OBSERVAÇÕES",null,"ATENDE NBR9050-2020",null,"NÃO SE APLICA","OBSERVAÇÕES",null,"ATENDE NBR9050-2020",null,"NÃO SE APLICA","OBSERVAÇÕES",null,"ATENDE NBR9050-2020",null,"NÃO SE APLICA","OBSERVAÇÕES",null,"ATENDE NBR9050-2020",null,"NÃO SE APLICA","OBSERVAÇÕES",null,"ATENDE NBR9050-2020",null,"NÃO SE APLICA","OBSERVAÇÕES",null,"ATENDE NBR9050-2020",null,"NÃO SE APLICA","OBSERVAÇÕES",null,"ATENDE NBR9050-2020",null,"NÃO SE APLICA","OBSERVAÇÕES"]
[null,null,null,null,"SIM","NÃO",null,null,null,"SIM","NÃO",null,null,null,"SIM","NÃO",null,null,null,"SIM","NÃO",null,null,null,"SIM","NÃO",null,null,null,"SIM","NÃO",null,null,null,"SIM","NÃO",null,null,null,"SIM","NÃO",null,null,null,"SIM","NÃO",null,null,null,"SIM","NÃO",null,null,null,"SIM","NÃO",null,null,null,"SIM","NÃO",null,null,null,"SIM","NÃO",null,null,null,"SIM","NÃO",null,null,null,"SIM","NÃO",null,null,null,"SIM","NÃO",null,null,null,"SIM","NÃO",null,null,null,"SIM","NÃO",null,null,null,"SIM","NÃO",null,null,null,"SIM","NÃO",null,null,null,"SIM","NÃO",null,null,null,"SIM","NÃO",null,null,null,"SIM","NÃO",null,null,null,"SIM","NÃO",null,null,null,"SIM","NÃO"]
[]
["7.12.1.2","a)","O box de chuveiro tem dimensões mínimas de 0,90 m × 0,95 m?",null,null,null,"X",null,null,null,null,"X",null,null,null,null,"X",null,null,null,null,"X",null,null,null,null,{"$f":"IF(AA$62=\"X\",\"X\",\"\")","v":""},null,null,null,null,{"$f":"IF(AF$62=\"X\",\"X\",\"\")","v":""},null,null,null,null,{"$f":"IF(AK$62=\"X\",\"X\",\"\")","v":""},null,null,null,null,{"$f":"IF(AP$62=\"X\",\"X\",\"\")","v":""},null,null,null,null,{"$f":"IF(AU$62=\"X\",\"X\",\"\")","v":""},null,null,null,null,{"$f":"IF(AZ$62=\"X\",\"X\",\"\")","v":""},null,null,null,null,{"$f":"IF(BE$62=\"X\",\"X\",\"\")","v":""},null,null,null,null,{"$f":"IF(BJ$62=\"X\",\"X\",\"\")","v":""},null,null,null,null,{"$f":"IF(BO$62=\"X\",\"X\",\"\")","v":""},null,null,null,null,{"$f":"IF(BT$62=\"X\",\"X\",\"\")","v":""},null,null,null,null,{"$f":"IF(BY$62=\"X\",\"X\",\"\")","v":""},null,null,null,null,{"$f":"IF(CD$62=\"X\",\"X\",\"\")","v":""},null,null,null,null,{"$f":"IF(CI$62=\"X\",\"X\",\"\")","v":""},null,null,null,null,{"$f":"IF(CN$62=\"X\",\"X\",\"\")","v":""},null,null,null,null,{"$f":"IF(CS$62=\"X\",\"X\",\"\")","v":""},null,null,null,null,{"$f":"IF(CX$62=\"X\",\"X\",\"\")","v":""},null,null,null,null,{"$f":"IF(DC$62=\"X\",\"X\",\"\")","v":""},null,null,null,null,{"$f":"IF(DH$62=\"X\",\"X\",\"\")","v":""},null,null,null,null,{"$f":"IF(DM$62=\"X\",\"X\",\"\")","v":""},null,null,null,null,{"$f":"IF(DR$62=\"X\",\"X\",\"\")","v":""},null,null,null,null,{"$f":"IF(DW$62=\"X\",\"X\",\"\")","v":""}]
["7.12.4","b)","O piso do boxe é antiderrapante e está nivelado com o piso adjacente?",null,null,null,"X",null,null,null,null,"X",null,null,null,null,"X",null,null,null,null,"X",null,null,null,null,{"$f":"IF(AA$62=\"X\",\"X\",\"\")","v":""},null,null,null,null,{"$f":"IF(AF$62=\"X\",\"X\",\"\")","v":""},null,null,null,null,{"$f":"IF(AK$62=\"X\",\"X\",\"\")","v":""},null,null,null,null,{"$f":"IF(AP$62=\"X\",\"X\",\"\")","v":""},null,null,null,null,{"$f":"IF(AU$62=\"X\",\"X\",\"\")","v":""},null,null,null,null,{"$f":"IF(AZ$62=\"X\",\"X\",\"\")","v":""},null,null,null,null,{"$f":"IF(BE$62=\"X\",\"X\",\"\")","v":""},null,null,null,null,{"$f":"IF(BJ$62=\"X\",\"X\",\"\")","v":""},null,null,null,null,{"$f":"IF(BO$62=\"X\",\"X\",\"\")","v":""},null,null,null,null,{"$f":"IF(BT$62=\"X\",\"X\",\"\")","v":""},null,null,null,null,{"$f":"IF(BY$62=\"X\",\"X\",\"\")","v":""},null,null,null,null,{"$f":"IF(CD$62=\"X\",\"X\",\"\")","v":""},null,null,null,null,{"$f":"IF(CI$62=\"X\",\"X\",\"\")","v":""},null,null,null,null,{"$f":"IF(CN$62=\"X\",\"X\",\"\")","v":""},null,null,null,null,{"$f":"IF(CS$62=\"X\",\"X\",\"\")","v":""},null,null,null,null,{"$f":"IF(CX$62=\"X\",\"X\",\"\")","v":""},null,null,null,null,{"$f":"IF(DC$62=\"X\",\"X\",\"\")","v":""},null,null,null,null,{"$f":"IF(DH$62=\"X\",\"X\",\"\")","v":""},null,null,null,null,{"$f":"IF(DM$62=\"X\",\"X\",\"\")","v":""},null,null,null,null,{"$f":"IF(DR$62=\"X\",\"X\",\"\")","v":""},null,null,null,null,{"$f":"IF(DW$62=\"X\",\"X\",\"\")","v":""}]
["7.12.4","c)","A grelha dentro do boxe está posicionada fora da área de manobra e transferência?",null,null,null,"X",null,null,null,null,"X",null,null,null,null,"X",null,null,null,null,"X",null,null,null,null,"",null,null,null,null,"",null,null,null,null,"",null,null,null,null,"",null,null,null,null,"",null,null,null,null,"",null,null,null,null,"",null,null,null,null,"",null,null,null,null,"",null,null,null,null,"",null,null,null,null,"",null,null,null,null,"",null,null,null,null,"",null,null,null,null,"",null,null,null,null,"",null,null,null,null,"",null,null,null,null,"",null,null,null,null,"",null,null,null,null,"",null,null,null,null,"",null,null,null,null,""]
["7.12.1.1","d)","Caso exista porta no boxe, esta possui vão com largura livre mínima de 0,90 m, é confeccionada em material resistente a impacto e não interfere na área de transferência?",null,null,null,"X",null,null,null,null,"X",null,null,null,null,"X",null,null,null,null,"X",null,null,null,null,"",null,null,null,null,"",null,null,null,null,"",null,null,null,null,"",null,null,null,null,"",null,null,null,null,"",null,null,null,null,"",null,null,null,null,"",null,null,null,null,"",null,null,null,null,"",null,null,null,null,"",null,null,null,null,"",null,null,null,null,"",null,null,null,null,"",null,null,null,null,"",null,null,null,null,"",null,null,null,null,"",null,null,null,null,"",null,null,null,null,"",null,null,null,null,"",null,null,null,null,""]
["7.12.1.1","e)","A entrada do boxe é livre de obstáculos, como trilhos não embutidos?",null,null,null,"X",null,null,null,null,"X",null,null,null,null,"X",null,null,null,null,"X",null,null,null,null,"",null,null,null,null,"",null,null,null,null,"",null,null,null,null,"",null,null,null,null,"",null,null,null,null,"",null,null,null,null,"",null,null,null,null,"",null,null,null,null,"",null,null,null,null,"",null,null,null,null,"",null,null,null,null,"",null,null,null,null,"",null,null,null,null,"",null,null,null,null,"",null,null,null,null,"",null,null,null,null,"",null,null,null,null,"",null,null,null,null,"",null,null,null,null,"",null,null,null,null,""]
["7.12.1.1 e\nFigura 127","f)","Existe banco articulado ou removível, com cantos arredondados e superfície antiderrapante impermeável, com profundidade mínima de 0,45 m, altura de 0,46 m do piso acabado e comprimento mínimo de 0,70 m, instalados no eixo entre as barras, conforme Figura 127?",null,null,null,"X",null,null,null,null,"X",null,null,null,null,"X",null,null,null,null,"X",null,null,null,null,"",null,null,null,null,"",null,null,null,null,"",null,null,null,null,"",null,null,null,null,"",null,null,null,null,"",null,null,null,null,"",null,null,null,null,"",null,null,null,null,"",null,null,null,null,"",null,null,null,null,"",null,null,null,null,"",null,null,null,null,"",null,null,null,null,"",null,null,null,null,"",null,null,null,null,"",null,null,null,null,"",null,null,null,null,"",null,null,null,null,"",null,null,null,null,"",null,null,null,null,""]
["7.12.3 e\nFigura 127","g)","No boxe existem barras de apoio horizontais e verticais conforme Figura 127 da NBR 9050?",null,null,null,"X",null,null,null,null,"X",null,null,null,null,"X",null,null,null,null,"X",null,null,null,null,"",null,null,null,null,"",null,null,null,null,"",null,null,null,null,"",null,null,null,null,"",null,null,null,null,"",null,null,null,null,"",null,null,null,null,"",null,null,null,null,"",null,null,null,null,"",null,null,null,null,"",null,null,null,null,"",null,null,null,null,"",null,null,null,null,"",null,null,null,null,"",null,null,null,null,"",null,null,null,null,"",null,null,null,null,"",null,null,null,null,"",null,null,null,null,"",null,null,null,null,""]
["7.12.2 e\n7.12.3","h)","O registro do chuveiro está a 1,00 m do piso acabado e a 0,45 m da parede onde o banco está instalado?",null,null,null,"X",null,null,null,null,"X",null,null,null,null,"X",null,null,null,null,"X",null,null,null,null,"",null,null,null,null,"",null,null,null,null,"",null,null,null,null,"",null,null,null,null,"",null,null,null,null,"",null,null,null,null,"",null,null,null,null,"",null,null,null,null,"",null,null,null,null,"",null,null,null,null,"",null,null,null,null,"",null,null,null,null,"",null,null,null,null,"",null,null,null,null,"",null,null,null,null,"",null,null,null,null,"",null,null,null,null,"",null,null,null,null,"",null,null,null,null,"",null,null,null,null,""]
[]
[null,null,null,null,"SIM","NÃO","JUSTIFICATIVA",null,null,"SIM","NÃO","JUSTIFICATIVA",null,null,"SIM","NÃO","JUSTIFICATIVA",null,null,"SIM","NÃO","JUSTIFICATIVA",null,null,"SIM","NÃO","JUSTIFICATIVA",null,null,"SIM","NÃO","JUSTIFICATIVA",null,null,"SIM","NÃO","JUSTIFICATIVA",null,null,"SIM","NÃO","JUSTIFICATIVA",null,null,"SIM","NÃO","JUSTIFICATIVA",null,null,"SIM","NÃO","JUSTIFICATIVA",null,null,"SIM","NÃO","JUSTIFICATIVA",null,null,"SIM","NÃO","JUSTIFICATIVA",null,null,"SIM","NÃO","JUSTIFICATIVA",null,null,"SIM","NÃO","JUSTIFICATIVA",null,null,"SIM","NÃO","JUSTIFICATIVA",null,null,"SIM","NÃO","JUSTIFICATIVA",null,null,"SIM","NÃO","JUSTIFICATIVA",null,null,"SIM","NÃO","JUSTIFICATIVA",null,null,"SIM","NÃO","JUSTIFICATIVA",null,null,"SIM","NÃO","JUSTIFICATIVA",null,null,"SIM","NÃO","JUSTIFICATIVA",null,null,"SIM","NÃO","JUSTIFICATIVA",null,null,"SIM","NÃO","JUSTIFICATIVA",null,null,"SIM","NÃO","JUSTIFICATIVA",null,null,"SIM","NÃO","JUSTIFICATIVA"]
[null,null,"NECESSITA PROJETO ?",null,null,"X",null,null,null,null,"X",null,null,null,null,"X",null,null,null,null,"X"]

{"sheet":"7.1_Bebedouros","index":10,"n_rows":20,"n_cols":128,"rows_kept":20,"cut":false,"hidden":false,"merged":[[19,106,19,107],[19,111,19,112],[19,116,19,117],[19,121,19,122],[19,126,19,127],[19,81,19,82],[19,86,19,87],[19,91,19,92],[19,96,19,97],[19,101,19,102],[18,106,18,107],[18,111,18,112],[18,116,18,117],[18,121,18,122],[18,126,18,127],[18,81,18,82],[18,86,18,87],[18,91,18,92],[18,96,18,97],[18,101,18,102],[8,121,9,121],[8,122,9,122],[8,124,8,125],[8,126,9,126],[8,127,9,127],[8,112,9,112],[8,114,8,115],[8,116,9,116],[8,117,9,117],[8,119,8,120],[8,104,8,105],[8,106,9,106],[8,107,9,107],[8,109,8,110],[8,111,9,111],[8,96,9,96],[8,97,9,97],[8,99,8,100],[8,101,9,101],[8,102,9,102],[8,87,9,87],[8,89,8,90],[8,91,9,91],[8,92,9,92],[8,94,8,95],[8,79,8,80],[8,81,9,81],[8,82,9,82],[8,84,8,85],[8,86,9,86],[6,104,6,107],[6,109,6,112],[6,114,6,117],[6,119,6,122],[6,124,6,127],[6,79,6,82],[6,84,6,87],[6,89,6,92],[6,94,6,97],[6,99,6,102],[19,6,19,7],[19,11,19,12],[19,16,19,17],[8,17,9,17],[8,7,9,7],[8,12,9,12],[6,9,6,12],[6,14,6,17],[18,6,18,7],[18,11,18,12],[18,16,18,17],[8,9,8,10],[8,11,9,11],[8,14,8,15],[8,16,9,16],[8,0,9,0],[0,0,0,2],[2,0,2,3],[8,4,8,5],[8,6,9,6],[6,4,6,7],[6,19,6,22],[6,24,6,27],[6,29,6,32],[8,19,8,20],[8,21,9,21],[8,22,9,22],[8,24,8,25],[8,26,9,26],[8,27,9,27],[8,29,8,30],[8,31,9,31],[8,32,9,32],[18,21,18,22],[18,26,18,27],[18,31,18,32],[19,21,19,22],[19,26,19,27],[19,31,19,32],[6,34,6,37],[6,39,6,42],[6,44,6,47],[18,36,18,37],[18,41,18,42],[18,46,18,47],[6,49,6,52],[6,54,6,57],[6,59,6,62],[8,34,8,35],[8,36,9,36],[8,37,9,37],[8,39,8,40],[8,41,9,41],[8,42,9,42],[8,44,8,45],[8,46,9,46],[8,47,9,47],[8,49,8,50],[8,51,9,51],[8,52,9,52],[8,54,8,55],[8,56,9,56],[8,57,9,57],[8,59,8,60],[8,61,9,61],[8,62,9,62],[18,51,18,52],[18,56,18,57],[18,61,18,62],[18,66,18,67],[18,71,18,72],[18,76,18,77],[19,36,19,37],[19,41,19,42],[19,46,19,47],[19,51,19,52],[19,56,19,57],[19,66,19,67],[19,71,19,72],[19,76,19,77],[19,61,19,62],[6,64,6,67],[6,69,6,72],[6,74,6,77],[8,64,8,65],[8,66,9,66],[8,67,9,67],[8,69,8,70],[8,71,9,71],[8,72,9,72],[8,74,8,75],[8,76,9,76],[8,77,9,77]]}
[{"$f":"'1_Informações e outros'!C1","v":"Ministério da Mulher, da Família e dos Direitos Humanos\nSecretaria Nacional dos Direitos da Pessoa com Deficiência"}]
[]
["LAUDO / CHECK LIST DE ACESSIBILIDADE PARA AVALIAÇÃO DE CONFORMIDADE ÀS NORMAS DE ACESSIBILIDADE (CONFORME NBR 9050:2020) "]
[]
["UNIDADE / ÓRGÃO",null,{"$f":"'1_Informações e outros'!E5","v":"MINISTÉRIO DA MULHER, DA FAMÍLIA E DOS DIREITOS HUMANOS"}]
[]
[{"$f":"'1_Informações e outros'!M5","v":4},null,null,null,{"$f":"'4.1_Circul'!E7","v":"8º PAVTO"},null,null,null,null,{"$f":"'4.1_Circul'!J7","v":"9º PAVTO"},null,null,null,null,{"$f":"'4.1_Circul'!O7","v":"10º PAVTO"},null,null,null,null,{"$f":"'4.1_Circul'!T7","v":"TÉRREO"},null,null,null,null,{"$f":"'4.1_Circul'!Y7","v":"5º PAVTO"},null,null,null,null,{"$f":"'4.1_Circul'!AD7","v":"6º PAVTO"},null,null,null,null,{"$f":"'4.1_Circul'!AI7","v":"7º PAVTO"},null,null,null,null,{"$f":"'4.1_Circul'!AN7","v":"8º PAVTO"},null,null,null,null,{"$f":"'4.1_Circul'!AS7","v":"9º PAVTO"},null,null,null,null,{"$f":"'4.1_Circul'!AX7","v":"10º PAVTO"},null,null,null,null,{"$f":"'4.1_Circul'!BC7","v":"11º PAVTO"},null,null,null,null,{"$f":"'4.1_Circul'!BH7","v":"12º PAVTO"},null,null,null,null,{"$f":"'4.1_Circul'!BM7","v":"13º PAVTO"},null,null,null,null,{"$f":"'4.1_Circul'!BR7","v":"14º PAVTO"},null,null,null,null,{"$f":"'4.1_Circul'!BW7","v":"15º PAVTO"},null,null,null,null,{"$f":"'4.1_Circul'!CB7","v":"16º PAVTO"},null,null,null,null,{"$f":"'4.1_Circul'!CG7","v":"17º PAVTO"},null,null,null,null,{"$f":"'4.1_Circul'!CL7","v":"18º PAVTO"},null,null,null,null,{"$f":"'4.1_Circul'!CQ7","v":"19º PAVTO"},null,null,null,null,{"$f":"'4.1_Circul'!CV7","v":"20º PAVTO"},null,null,null,null,{"$f":"'4.1_Circul'!DA7","v":"21º PAVTO"},null,null,null,null,{"$f":"'4.1_Circul'!DF7","v":"22º PAVTO"},null,null,null,null,{"$f":"'4.1_Circul'!DK7","v":"23º PAVTO"},null,null,null,null,{"$f":"'4.1_Circul'!DP7","v":"24º PAVTO"},null,null,null,null,{"$f":"'4.1_Circul'!DU7","v":"25º PAVTO"}]
[]
["Item da NBR9050",null,"07. MOBILIÁRIO",null,"ATENDE NBR9050-2020",null,"NÃO SE APLICA","OBSERVAÇÕES",null,"ATENDE NBR9050-2020",null,"NÃO SE APLICA","OBSERVAÇÕES",null,"ATENDE NBR9050-2020",null,"NÃO SE APLICA","OBSERVAÇÕES",null,"ATENDE NBR9050-2020",null,"NÃO SE APLICA","OBSERVAÇÕES",null,"ATENDE NBR9050-2020",null,"NÃO SE APLICA","OBSERVAÇÕES",null,"ATENDE NBR9050-2020",null,"NÃO SE APLICA","OBSERVAÇÕES",null,"ATENDE NBR9050-2020",null,"NÃO SE APLICA","OBSERVAÇÕES",null,"ATENDE NBR9050-2020",null,"NÃO SE APLICA","OBSERVAÇÕES",null,"ATENDE NBR9050-2020",null,"NÃO SE APLICA","OBSERVAÇÕES",null,"ATENDE NBR9050-2020",null,"NÃO SE APLICA","OBSERVAÇÕES",null,"ATENDE NBR9050-2020",null,"NÃO SE APLICA","OBSERVAÇÕES",null,"ATENDE NBR9050-2020",null,"NÃO SE APLICA","OBSERVAÇÕES",null,"ATENDE NBR9050-2020",null,"NÃO SE APLICA","OBSERVAÇÕES",null,"ATENDE NBR9050-2020",null,"NÃO SE APLICA","OBSERVAÇÕES",null,"ATENDE NBR9050-2020",null,"NÃO SE APLICA","OBSERVAÇÕES",null,"ATENDE NBR9050-2020",null,"NÃO SE APLICA","OBSERVAÇÕES",null,"ATENDE NBR9050-2020",null,"NÃO SE APLICA","OBSERVAÇÕES",null,"ATENDE NBR9050-2020",null,"NÃO SE APLICA","OBSERVAÇÕES",null,"ATENDE NBR9050-2020",null,"NÃO SE APLICA","OBSERVAÇÕES",null,"ATENDE NBR9050-2020",null,"NÃO SE APLICA","OBSERVAÇÕES",null,"ATENDE NBR9050-2020",null,"NÃO SE APLICA","OBSERVAÇÕES",null,"ATENDE NBR9050-2020",null,"NÃO SE APLICA","OBSERVAÇÕES",null,"ATENDE NBR9050-2020",null,"NÃO SE APLICA","OBSERVAÇÕES",null,"ATENDE NBR9050-2020",null,"NÃO SE APLICA","OBSERVAÇÕES",null,"ATENDE NBR9050-2020",null,"NÃO SE APLICA","OBSERVAÇÕES"]
[null,null,"7.1 BEBEDOUROS",null,"SIM","NÃO",null,null,null,"SIM","NÃO",null,null,null,"SIM","NÃO",null,null,null,"SIM","NÃO",null,null,null,"SIM","NÃO",null,null,null,"SIM","NÃO",null,null,null,"SIM","NÃO",null,null,null,"SIM","NÃO",null,null,null,"SIM","NÃO",null,null,null,"SIM","NÃO",null,null,null,"SIM","NÃO",null,null,null,"SIM","NÃO",null,null,null,"SIM","NÃO",null,null,null,"SIM","NÃO",null,null,null,"SIM","NÃO",null,null,null,"SIM","NÃO",null,null,null,"SIM","NÃO",null,null,null,"SIM","NÃO",null,null,null,"SIM","NÃO",null,null,null,"SIM","NÃO",null,null,null,"SIM","NÃO",null,null,null,"SIM","NÃO",null,null,null,"SIM","NÃO",null,null,null,"SIM","NÃO",null,null,null,"SIM","NÃO"]
["8.5.1.1","a)","No caso de bebedouros de bica, esta é do tipo jato inclinado, localizada no lado frontal do bebedouro?",null,null,null,"X",null,null,null,null,"X",null,null,null,null,"X",null,null,null,null,"X"]
["8.5.1.2","b)","Os bebedouros estão instalados com, no mínimo, duas alturas diferentes de bica: 0,90 m e outra entre 1,00 m e 1,10 m em relação ao piso acabado?",null,null,null,"X",null,null,null,null,"X",null,null,null,null,"X",null,null,null,null,"X",null,null,null,null,null,null,null,null,null,null,null,null,null,null,null,null,null,null,null,null,null,null,null,null,null,null,null,null,null,null,null,null,null,null,null,null,null,null,null,null,null,null,null,null,null,null,null,null,null,null,null,null,null,null,null,null,null,null,null,{"$f":"IF(CC11=\"X\",\"X\",\"\")","v":""},null,null,null,null,{"$f":"IF(CH11=\"X\",\"X\",\"\")","v":""},null,null,null,null,{"$f":"IF(CM11=\"X\",\"X\",\"\")","v":""},null,null,null,null,{"$f":"IF(CR11=\"X\",\"X\",\"\")","v":""},null,null,null,null,{"$f":"IF(CW11=\"X\",\"X\",\"\")","v":""},null,null,null,null,{"$f":"IF(DB11=\"X\",\"X\",\"\")","v":""},null,null,null,null,{"$f":"IF(DG11=\"X\",\"X\",\"\")","v":""},null,null,null,null,{"$f":"IF(DL11=\"X\",\"X\",\"\")","v":""},null,null,null,null,{"$f":"IF(DQ11=\"X\",\"X\",\"\")","v":""},null,null,null,null,{"$f":"IF(DV11=\"X\",\"X\",\"\")","v":""}]
["8.5.1.3","c)","O bebedouro de 0,90 m possui altura livre inferior de 0,73 m?",null,null,null,"X",null,null,null,null,"X",null,null,null,null,"X",null,null,null,null,"X",null,null,null,null,null,null,null,null,null,null,null,null,null,null,null,null,null,null,null,null,null,null,null,null,null,null,null,null,null,null,null,null,null,null,null,null,null,null,null,null,null,null,null,null,null,null,null,null,null,null,null,null,null,null,null,null,null,null,null,{"$f":"IF(CC11=\"X\",\"X\",\"\")","v":""},null,null,null,null,{"$f":"IF(CH11=\"X\",\"X\",\"\")","v":""},null,null,null,null,{"$f":"IF(CM11=\"X\",\"X\",\"\")","v":""},null,null,null,null,{"$f":"IF(CR11=\"X\",\"X\",\"\")","v":""},null,null,null,null,{"$f":"IF(CW11=\"X\",\"X\",\"\")","v":""},null,null,null,null,{"$f":"IF(DB11=\"X\",\"X\",\"\")","v":""},null,null,null,null,{"$f":"IF(DG11=\"X\",\"X\",\"\")","v":""},null,null,null,null,{"$f":"IF(DL11=\"X\",\"X\",\"\")","v":""},null,null,null,null,{"$f":"IF(DQ11=\"X\",\"X\",\"\")","v":""},null,null,null,null,{"$f":"IF(DV11=\"X\",\"X\",\"\")","v":""}]
["8.5.1.3","d)","Há possibilidade de aproximação frontal sob o equipamento, garantido um M.R.?",null,null,null,"X",null,null,null,null,"X",null,null,null,null,"X",null,null,null,null,"X",null,null,null,null,null,null,null,null,null,null,null,null,null,null,null,null,null,null,null,null,null,null,null,null,null,null,null,null,null,null,null,null,null,null,null,null,null,null,null,null,null,null,null,null,null,null,null,null,null,null,null,null,null,null,null,null,null,null,null,{"$f":"IF(CC11=\"X\",\"X\",\"\")","v":""},null,null,null,null,{"$f":"IF(CH11=\"X\",\"X\",\"\")","v":""},null,null,null,null,{"$f":"IF(CM11=\"X\",\"X\",\"\")","v":""},null,null,null,null,{"$f":"IF(CR11=\"X\",\"X\",\"\")","v":""},null,null,null,null,{"$f":"IF(CW11=\"X\",\"X\",\"\")","v":""},null,null,null,null,{"$f":"IF(DB11=\"X\",\"X\",\"\")","v":""},null,null,null,null,{"$f":"IF(DG11=\"X\",\"X\",\"\")","v":""},null,null,null,null,{"$f":"IF(DL11=\"X\",\"X\",\"\")","v":""},null,null,null,null,{"$f":"IF(DQ11=\"X\",\"X\",\"\")","v":""},null,null,null,null,{"$f":"IF(DV11=\"X\",\"X\",\"\")","v":""}]
["8.5.2","e)","Havendo copos descartáveis, estes estão entre 0,80 m e 1,20 m do piso acabado?",null,null,null,"X",null,null,"X",null,null,null,null,"X",null,null,null,null,null,null,"X",null,null,null,null,null,null,null,null,null,null,null,null,null,null,null,null,null,null,null,null,null,null,null,null,null,null,null,null,null,null,null,null,null,null,null,null,null,null,null,null,null,null,null,null,null,null,null,null,null,null,null,null,null,null,null,null,null,null,null,{"$f":"IF(CC11=\"X\",\"X\",\"\")","v":""},null,null,null,null,{"$f":"IF(CH11=\"X\",\"X\",\"\")","v":""},null,null,null,null,{"$f":"IF(CM11=\"X\",\"X\",\"\")","v":""},null,null,null,null,{"$f":"IF(CR11=\"X\",\"X\",\"\")","v":""},null,null,null,null,{"$f":"IF(CW11=\"X\",\"X\",\"\")","v":""},null,null,null,null,{"$f":"IF(DB11=\"X\",\"X\",\"\")","v":""},null,null,null,null,{"$f":"IF(DG11=\"X\",\"X\",\"\")","v":""},null,null,null,null,{"$f":"IF(DL11=\"X\",\"X\",\"\")","v":""},null,null,null,null,{"$f":"IF(DQ11=\"X\",\"X\",\"\")","v":""},null,null,null,null,{"$f":"IF(DV11=\"X\",\"X\",\"\")","v":""}]
["8.5.2","f)","Os outros modelos (garrafão, filtro etc.), assim como o manuseio dos copos, estão posicionados na altura entre 0,80 m e 1,20 m do piso acabado? ",null,"X",null,null,"O bebedouro de garrafão não está com copos disponíveis em sua proximidade, e o local posicionado não permite a passagem de pessoas em cadeira de rodas e área para manobra. ",null,"X",null,null,"Bebedouro de garrafão. ",null,"X",null,null,"Bebedouro de garrafão. ",null,null,null,"X",null,null,null,null,null,null,null,null,null,null,null,null,null,null,null,null,null,null,null,null,null,null,null,null,null,null,null,null,null,null,null,null,null,null,null,null,null,null,null,null,null,null,null,null,null,null,null,null,null,null,null,null,null,null,null,null,null,null,null,{"$f":"IF(CC11=\"X\",\"X\",\"\")","v":""},null,null,null,null,{"$f":"IF(CH11=\"X\",\"X\",\"\")","v":""},null,null,null,null,{"$f":"IF(CM11=\"X\",\"X\",\"\")","v":""},null,null,null,null,{"$f":"IF(CR11=\"X\",\"X\",\"\")","v":""},null,null,null,null,{"$f":"IF(CW11=\"X\",\"X\",\"\")","v":""},null,null,null,null,{"$f":"IF(DB11=\"X\",\"X\",\"\")","v":""},null,null,null,null,{"$f":"IF(DG11=\"X\",\"X\",\"\")","v":""},null,null,null,null,{"$f":"IF(DL11=\"X\",\"X\",\"\")","v":""},null,null,null,null,{"$f":"IF(DQ11=\"X\",\"X\",\"\")","v":""},null,null,null,null,{"$f":"IF(DV11=\"X\",\"X\",\"\")","v":""}]
["8.5.2","g)","Estes modelos permitem a aproximação lateral de uma Pessoa com Cadeira de Rodas?",null,null,"X",null,"Não permite a aproximação lateral.",null,"X","X",null,"Não permite a aproximação lateral.",null,null,"X",null,"Não permite a aproximação lateral.",null,null,null,"X",null,null,null,null,null,null,null,null,null,null,null,null,null,null,null,null,null,null,null,null,null,null,null,null,null,null,null,null,null,null,null,null,null,null,null,null,null,null,null,null,null,null,null,null,null,null,null,null,null,null,null,null,null,null,null,null,null,null,null,{"$f":"IF(CC11=\"X\",\"X\",\"\")","v":""},null,null,null,null,{"$f":"IF(CH11=\"X\",\"X\",\"\")","v":""},null,null,null,null,{"$f":"IF(CM11=\"X\",\"X\",\"\")","v":""},null,null,null,null,{"$f":"IF(CR11=\"X\",\"X\",\"\")","v":""},null,null,null,null,{"$f":"IF(CW11=\"X\",\"X\",\"\")","v":""},null,null,null,null,{"$f":"IF(DB11=\"X\",\"X\",\"\")","v":""},null,null,null,null,{"$f":"IF(DG11=\"X\",\"X\",\"\")","v":""},null,null,null,null,{"$f":"IF(DL11=\"X\",\"X\",\"\")","v":""},null,null,null,null,{"$f":"IF(DQ11=\"X\",\"X\",\"\")","v":""},null,null,null,null,{"$f":"IF(DV11=\"X\",\"X\",\"\")","v":""}]
[]
[null,null,null,null,"SIM","NÃO","JUSTIFICATIVA",null,null,"SIM","NÃO","JUSTIFICATIVA",null,null,"SIM","NÃO","JUSTIFICATIVA",null,null,"SIM","NÃO","JUSTIFICATIVA",null,null,"SIM","NÃO","JUSTIFICATIVA",null,null,"SIM","NÃO","JUSTIFICATIVA",null,null,"SIM","NÃO","JUSTIFICATIVA",null,null,"SIM","NÃO","JUSTIFICATIVA",null,null,"SIM","NÃO","JUSTIFICATIVA",null,null,"SIM","NÃO","JUSTIFICATIVA",null,null,"SIM","NÃO","JUSTIFICATIVA",null,null,"SIM","NÃO","JUSTIFICATIVA",null,null,"SIM","NÃO","JUSTIFICATIVA",null,null,"SIM","NÃO","JUSTIFICATIVA",null,null,"SIM","NÃO","JUSTIFICATIVA",null,null,"SIM","NÃO","JUSTIFICATIVA",null,null,"SIM","NÃO","JUSTIFICATIVA",null,null,"SIM","NÃO","JUSTIFICATIVA",null,null,"SIM","NÃO","JUSTIFICATIVA",null,null,"SIM","NÃO","JUSTIFICATIVA",null,null,"SIM","NÃO","JUSTIFICATIVA",null,null,"SIM","NÃO","JUSTIFICATIVA",null,null,"SIM","NÃO","JUSTIFICATIVA",null,null,"SIM","NÃO","JUSTIFICATIVA",null,null,"SIM","NÃO","JUSTIFICATIVA"]
[null,null,"NECESSITA PROJETO ?",null,null,"X","Deve garantir a aproximação lateral de uma pessoa em cadeira de rodas.",null,null,null,"X","Deve garantir a aproximação lateral de uma pessoa em cadeira de rodas.",null,null,null,"X","Deve garantir a aproximação lateral de uma pessoa em cadeira de rodas.",null,null,null,"X"]

{"sheet":"7.2_Balcões","index":11,"n_rows":45,"n_cols":128,"rows_kept":45,"cut":false,"hidden":false,"merged":[[44,126,44,127],[44,81,44,82],[44,86,44,87],[44,91,44,92],[44,96,44,97],[44,101,44,102],[44,106,44,107],[44,111,44,112],[44,116,44,117],[44,121,44,122],[34,117,35,117],[34,119,34,120],[34,121,35,121],[34,122,35,122],[34,124,34,125],[34,126,35,126],[34,127,35,127],[43,81,43,82],[43,86,43,87],[43,91,43,92],[43,96,43,97],[43,101,43,102],[43,106,43,107],[43,111,43,112],[43,116,43,117],[43,121,43,122],[43,126,43,127],[32,126,32,127],[34,79,34,80],[34,81,35,81],[34,82,35,82],[34,84,34,85],[34,86,35,86],[34,87,35,87],[34,89,34,90],[34,91,35,91],[34,92,35,92],[34,94,34,95],[34,96,35,96],[34,97,35,97],[34,99,34,100],[34,101,35,101],[34,102,35,102],[34,104,34,105],[34,106,35,106],[34,107,35,107],[34,109,34,110],[34,111,35,111],[34,112,35,112],[34,114,34,115],[34,116,35,116],[32,81,32,82],[32,86,32,87],[32,91,32,92],[32,96,32,97],[32,101,32,102],[32,106,32,107],[32,111,32,112],[32,116,32,117],[32,121,32,122],[21,117,22,117],[21,119,21,120],[21,121,22,121],[21,122,22,122],[21,124,21,125],[21,126,22,126],[21,127,22,127],[31,81,31,82],[31,86,31,87],[31,91,31,92],[31,96,31,97],[31,101,31,102],[31,106,31,107],[31,111,31,112],[31,116,31,117],[31,121,31,122],[31,126,31,127],[19,126,19,127],[21,79,21,80],[21,81,22,81],[21,82,22,82],[21,84,21,85],[21,86,22,86],[21,87,22,87],[21,89,21,90],[21,91,22,91],[21,92,22,92],[21,94,21,95],[21,96,22,96],[21,97,22,97],[21,99,21,100],[21,101,22,101],[21,102,22,102],[21,104,21,105],[21,106,22,106],[21,107,22,107],[21,109,21,110],[21,111,22,111],[21,112,22,112],[21,114,21,115],[21,116,22,116],[19,81,19,82],[19,86,19,87],[19,91,19,92],[19,96,19,97],[19,101,19,102],[19,106,19,107],[19,111,19,112],[19,116,19,117],[19,121,19,122],[8,117,9,117],[8,119,8,120],[8,121,9,121],[8,122,9,122],[8,124,8,125],[8,126,9,126],[8,127,9,127],[18,81,18,82],[18,86,18,87],[18,91,18,92],[18,96,18,97],[18,101,18,102],[18,106,18,107],[18,111,18,112],[18,116,18,117],[18,121,18,122],[18,126,18,127],[6,124,6,127],[8,79,8,80],[8,81,9,81],[8,82,9,82],[8,84,8,85],[8,86,9,86],[8,87,9,87],[8,89,8,90],[8,91,9,91],[8,92,9,92],[8,94,8,95],[8,96,9,96],[8,97,9,97],[8,99,8,100],[8,101,9,101],[8,102,9,102],[8,104,8,105],[8,106,9,106],[8,107,9,107],[8,109,8,110],[8,111,9,111],[8,112,9,112],[8,114,8,115],[8,116,9,116],[6,79,6,82],[6,84,6,87],[6,89,6,92],[6,94,6,97],[6,99,6,102],[6,104,6,107],[6,109,6,112],[6,114,6,117],[6,119,6,122],[43,6,43,7],[43,11,43,12],[43,16,43,17],[44,6,44,7],[44,11,44,12],[44,16,44,17],[34,7,35,7],[34,16,35,16],[34,17,35,17],[6,9,6,12],[6,14,6,17],[8,12,9,12],[21,12,22,12],[34,12,35,12],[18,6,18,7],[18,11,18,12],[32,6,32,7],[32,11,32,12],[18,16,18,17],[19,6,19,7],[19,11,19,12],[19,16,19,17],[31,6,31,7],[31,11,31,12],[31,16,31,17],[21,7,22,7],[32,16,32,17],[34,4,34,5],[34,6,35,6],[34,9,34,10],[34,11,35,11],[34,14,34,15],[0,0,0,2],[2,0,2,3],[8,17,9,17],[21,4,21,5],[21,6,22,6],[21,9,21,10],[21,11,22,11],[21,14,21,15],[21,16,22,16],[21,17,22,17],[8,0,9,0],[8,4,8,5],[8,6,9,6],[8,9,8,10],[8,11,9,11],[8,14,8,15],[8,16,9,16],[8,7,9,7],[6,4,6,7],[8,19,8,20],[8,21,9,21],[8,22,9,22],[8,24,8,25],[8,26,9,26],[8,27,9,27],[8,29,8,30],[8,31,9,31],[8,32,9,32],[21,19,21,20],[21,21,22,21],[21,22,22,22],[21,24,21,25],[21,26,22,26],[18,21,18,22],[18,26,18,27],[18,31,18,32],[19,21,19,22],[19,26,19,27],[19,31,19,32],[34,19,34,20],[34,21,35,21],[34,22,35,22],[34,24,34,25],[34,26,35,26],[34,27,35,27],[34,29,34,30],[34,31,35,31],[34,32,35,32],[6,34,6,37],[6,39,6,42],[6,44,6,47],[6,49,6,52],[6,54,6,57],[43,21,43,22],[43,26,43,27],[43,31,43,32],[44,21,44,22],[44,26,44,27],[44,31,44,32],[32,21,32,22],[32,26,32,27],[32,31,32,32],[21,27,22,27],[21,29,21,30],[21,31,22,31],[21,32,22,32],[31,21,31,22],[31,26,31,27],[31,31,31,32],[6,19,6,22],[6,24,6,27],[6,29,6,32],[8,34,8,35],[8,36,9,36],[8,37,9,37],[8,39,8,40],[8,41,9,41],[8,42,9,42],[8,44,8,45],[8,46,9,46],[8,47,9,47],[19,36,19,37],[19,41,19,42],[19,46,19,47],[19,51,19,52],[19,56,19,57],[8,59,8,60],[8,61,9,61],[8,62,9,62],[18,36,18,37],[18,41,18,42],[18,46,18,47],[18,51,18,52],[18,56,18,57],[18,61,18,62],[8,49,8,50],[8,51,9,51],[8,52,9,52],[8,54,8,55],[8,56,9,56],[8,57,9,57],[21,34,21,35],[21,36,22,36],[21,37,22,37],[21,39,21,40],[21,41,22,41],[21,42,22,42],[21,44,21,45],[21,46,22,46],[21,47,22,47],[32,36,32,37],[32,41,32,42],[32,46,32,47],[32,51,32,52],[32,56,32,57],[21,59,21,60],[21,61,22,61],[21,62,22,62],[31,36,31,37],[31,41,31,42],[31,46,31,47],[31,51,31,52],[31,56,31,57],[31,61,31,62],[21,49,21,50],[21,51,22,51],[21,52,22,52],[21,54,21,55],[21,56,22,56],[21,57,22,57],[34,56,35,56],[34,57,35,57],[44,61,44,62],[34,34,34,35],[34,36,35,36],[34,37,35,37],[34,39,34,40],[34,41,35,41],[34,42,35,42],[34,44,34,45],[34,46,35,46],[34,47,35,47],[8,69,8,70],[8,71,9,71],[8,72,9,72],[8,74,8,75],[8,76,9,76],[8,77,9,77],[44,36,44,37],[44,41,44,42],[44,46,44,47],[44,51,44,52],[44,56,44,57],[34,59,34,60],[34,61,35,61],[34,62,35,62],[43,36,43,37],[43,41,43,42],[43,46,43,47],[43,51,43,52],[43,56,43,57],[43,61,43,62],[34,49,34,50],[34,51,35,51],[34,52,35,52],[34,54,34,55],[18,66,18,67],[18,71,18,72],[18,76,18,77],[32,61,32,62],[19,61,19,62],[6,59,6,62],[19,66,19,67],[19,71,19,72],[19,76,19,77],[21,64,21,65],[21,66,22,66],[21,67,22,67],[21,69,21,70],[21,71,22,71],[21,72,22,72],[21,74,21,75],[21,76,22,76],[21,77,22,77],[6,64,6,67],[6,69,6,72],[6,74,6,77],[8,64,8,65],[8,66,9,66],[8,67,9,67],[34,64,34,65],[34,66,35,66],[34,67,35,67],[34,69,34,70],[34,71,35,71],[31,66,31,67],[31,71,31,72],[31,76,31,77],[32,66,32,67],[32,71,32,72],[32,76,32,77],[44,66,44,67],[44,71,44,72],[44,76,44,77],[34,72,35,72],[34,74,34,75],[34,76,35,76],[34,77,35,77],[43,66,43,67],[43,71,43,72],[43,76,43,77]]}
[{"$f":"'1_Informações e outros'!C1","v":"Ministério da Mulher, da Família e dos Direitos Humanos\nSecretaria Nacional dos Direitos da Pessoa com Deficiência"}]
[]
["LAUDO / CHECK LIST DE ACESSIBILIDADE PARA AVALIAÇÃO DE CONFORMIDADE ÀS NORMAS DE ACESSIBILIDADE (CONFORME NBR 9050:2020) "]
[]
["UNIDADE / ÓRGÃO",null,{"$f":"'1_Informações e outros'!E5","v":"MINISTÉRIO DA MULHER, DA FAMÍLIA E DOS DIREITOS HUMANOS"}]
[]
[{"$f":"'1_Informações e outros'!M5","v":4},null,null,null,{"$f":"'4.1_Circul'!E7","v":"8º PAVTO"},null,null,null,null,{"$f":"'4.1_Circul'!J7","v":"9º PAVTO"},null,null,null,null,{"$f":"'4.1_Circul'!O7","v":"10º PAVTO"},null,null,null,null,{"$f":"'4.1_Circul'!T7","v":"TÉRREO"},null,null,null,null,{"$f":"'4.1_Circul'!Y7","v":"5º PAVTO"},null,null,null,null,{"$f":"'4.1_Circul'!AD7","v":"6º PAVTO"},null,null,null,null,{"$f":"'4.1_Circul'!AI7","v":"7º PAVTO"},null,null,null,null,{"$f":"'4.1_Circul'!AN7","v":"8º PAVTO"},null,null,null,null,{"$f":"'4.1_Circul'!AS7","v":"9º PAVTO"},null,null,null,null,{"$f":"'4.1_Circul'!AX7","v":"10º PAVTO"},null,null,null,null,{"$f":"'4.1_Circul'!BC7","v":"11º PAVTO"},null,null,null,null,{"$f":"'4.1_Circul'!BH7","v":"12º PAVTO"},null,null,null,null,{"$f":"'4.1_Circul'!BM7","v":"13º PAVTO"},null,null,null,null,{"$f":"'4.1_Circul'!BR7","v":"14º PAVTO"},null,null,null,null,{"$f":"'4.1_Circul'!BW7","v":"15º PAVTO"},null,null,null,null,{"$f":"'4.1_Circul'!CB7","v":"16º PAVTO"},null,null,null,null,{"$f":"'4.1_Circul'!CG7","v":"17º PAVTO"},null,null,null,null,{"$f":"'4.1_Circul'!CL7","v":"18º PAVTO"},null,null,null,null,{"$f":"'4.1_Circul'!CQ7","v":"19º PAVTO"},null,null,null,null,{"$f":"'4.1_Circul'!CV7","v":"20º PAVTO"},null,null,null,null,{"$f":"'4.1_Circul'!DA7","v":"21º PAVTO"},null,null,null,null,{"$f":"'4.1_Circul'!DF7","v":"22º PAVTO"},null,null,null,null,{"$f":"'4.1_Circul'!DK7","v":"23º PAVTO"},null,null,null,null,{"$f":"'4.1_Circul'!DP7","v":"24º PAVTO"},null,null,null,null,{"$f":"'4.1_Circul'!DU7","v":"25º PAVTO"}]
[]
["Item da NBR9050",null,"07. MOBILIÁRIO (Em recepções e áreas de atendimento)\n7.2 BALCÃO DE ATENDIMENTO / INFORMAÇÕES / RECEPÇÕES",null,"ATENDE NBR9050-2020",null,"NÃO SE APLICA","OBSERVAÇÕES",null,"ATENDE NBR9050-2020",null,"NÃO SE APLICA","OBSERVAÇÕES",null,"ATENDE NBR9050-2020",null,"NÃO SE APLICA","OBSERVAÇÕES",null,"ATENDE NBR9050-2020",null,"NÃO SE APLICA","OBSERVAÇÕES",null,"ATENDE NBR9050-2020",null,"NÃO SE APLICA","OBSERVAÇÕES",null,"ATENDE NBR9050-2020",null,"NÃO SE APLICA","OBSERVAÇÕES",null,"ATENDE NBR9050-2020",null,"NÃO SE APLICA","OBSERVAÇÕES",null,"ATENDE NBR9050-2020",null,"NÃO SE APLICA","OBSERVAÇÕES",null,"ATENDE NBR9050-2020",null,"NÃO SE APLICA","OBSERVAÇÕES",null,"ATENDE NBR9050-2020",null,"NÃO SE APLICA","OBSERVAÇÕES",null,"ATENDE NBR9050-2020",null,"NÃO SE APLICA","OBSERVAÇÕES",null,"ATENDE NBR9050-2020",null,"NÃO SE APLICA","OBSERVAÇÕES",null,"ATENDE NBR9050-2020",null,"NÃO SE APLICA","OBSERVAÇÕES",null,"ATENDE NBR9050-2020",null,"NÃO SE APLICA","OBSERVAÇÕES",null,"ATENDE NBR9050-2020",null,"NÃO SE APLICA","OBSERVAÇÕES",null,"ATENDE NBR9050-2020",null,"NÃO SE APLICA","OBSERVAÇÕES",null,"ATENDE NBR9050-2020",null,"NÃO SE APLICA","OBSERVAÇÕES",null,"ATENDE NBR9050-2020",null,"NÃO SE APLICA","OBSERVAÇÕES",null,"ATENDE NBR9050-2020",null,"NÃO SE APLICA","OBSERVAÇÕES",null,"ATENDE NBR9050-2020",null,"NÃO SE APLICA","OBSERVAÇÕES",null,"ATENDE NBR9050-2020",null,"NÃO SE APLICA","OBSERVAÇÕES",null,"ATENDE NBR9050-2020",null,"NÃO SE APLICA","OBSERVAÇÕES",null,"ATENDE NBR9050-2020",null,"NÃO SE APLICA","OBSERVAÇÕES",null,"ATENDE NBR9050-2020",null,"NÃO SE APLICA","OBSERVAÇÕES",null,"ATENDE NBR9050-2020",null,"NÃO SE APLICA","OBSERVAÇÕES"]
[null,null,"7.2.1 BALCÃO DE ATENDIMENTO",null,"SIM","NÃO",null,null,null,"SIM","NÃO",null,null,null,"SIM","NÃO",null,null,null,"SIM","NÃO",null,null,null,"SIM","NÃO",null,null,null,"SIM","NÃO",null,null,null,"SIM","NÃO",null,null,null,"SIM","NÃO",null,null,null,"SIM","NÃO",null,null,null,"SIM","NÃO",null,null,null,"SIM","NÃO",null,null,null,"SIM","NÃO",null,null,null,"SIM","NÃO",null,null,null,"SIM","NÃO",null,null,null,"SIM","NÃO",null,null,null,"SIM","NÃO",null,null,null,"SIM","NÃO",null,null,null,"SIM","NÃO",null,null,null,"SIM","NÃO",null,null,null,"SIM","NÃO",null,null,null,"SIM","NÃO",null,null,null,"SIM","NÃO",null,null,null,"SIM","NÃO",null,null,null,"SIM","NÃO",null,null,null,"SIM","NÃO"]
[null,"a)","Existe balcão de atendimento?",null,null,null,"X",null,null,null,null,"x",null,null,null,null,"X",null,null,"X"]
["9.2.1.1","b)"," Balcão de atendimento está facilmente identificado e localizado em rota acessível?",null,null,null,{"$f":"IF(OR(F$11=\"X\",G$11=\"X\"),\"X\",\"\")","v":"X"},null,null,null,null,{"$f":"IF(OR(K$11=\"X\",L$11=\"X\"),\"X\",\"\")","v":"X"},null,null,null,null,{"$f":"IF(OR(P$11=\"X\",Q$11=\"X\"),\"X\",\"\")","v":"X"},null,null,"X",null,{"$f":"IF(OR(U$11=\"X\",V$11=\"X\"),\"X\",\"\")","v":""},null,null,null,null,{"$f":"IF(OR(Z$11=\"X\",AA$11=\"X\"),\"X\",\"\")","v":""},null,null,null,null,{"$f":"IF(OR(AE$11=\"X\",AF$11=\"X\"),\"X\",\"\")","v":""},null,null,null,null,{"$f":"IF(OR(AJ$11=\"X\",AK$11=\"X\"),\"X\",\"\")","v":""},null,null,null,null,{"$f":"IF(OR(AO$11=\"X\",AP$11=\"X\"),\"X\",\"\")","v":""},null,null,null,null,{"$f":"IF(OR(AT$11=\"X\",AU$11=\"X\"),\"X\",\"\")","v":""},null,null,null,null,{"$f":"IF(OR(AY$11=\"X\",AZ$11=\"X\"),\"X\",\"\")","v":""},null,null,null,null,{"$f":"IF(OR(BD$11=\"X\",BE$11=\"X\"),\"X\",\"\")","v":""},null,null,null,null,{"$f":"IF(OR(BI$11=\"X\",BJ$11=\"X\"),\"X\",\"\")","v":""},null,null,null,null,{"$f":"IF(OR(BN$11=\"X\",BO$11=\"X\"),\"X\",\"\")","v":""},null,null,null,null,{"$f":"IF(OR(BS$11=\"X\",BT$11=\"X\"),\"X\",\"\")","v":""},null,null,null,null,{"$f":"IF(OR(BX$11=\"X\",BY$11=\"X\"),\"X\",\"\")","v":""},null,null,null,null,{"$f":"IF(OR(CC$11=\"X\",CD$11=\"X\"),\"X\",\"\")","v":""},null,null,null,null,{"$f":"IF(OR(CH$11=\"X\",CI$11=\"X\"),\"X\",\"\")","v":""},null,null,null,null,{"$f":"IF(OR(CM$11=\"X\",CN$11=\"X\"),\"X\",\"\")","v":""},null,null,null,null,{"$f":"IF(OR(CR$11=\"X\",CS$11=\"X\"),\"X\",\"\")","v":""},null,null,null,null,{"$f":"IF(OR(CW$11=\"X\",CX$11=\"X\"),\"X\",\"\")","v":""},null,null,null,null,{"$f":"IF(OR(DB$11=\"X\",DC$11=\"X\"),\"X\",\"\")","v":""},null,null,null,null,{"$f":"IF(OR(DG$11=\"X\",DH$11=\"X\"),\"X\",\"\")","v":""},null,null,null,null,{"$f":"IF(OR(DL$11=\"X\",DM$11=\"X\"),\"X\",\"\")","v":""},null,null,null,null,{"$f":"IF(OR(DQ$11=\"X\",DR$11=\"X\"),\"X\",\"\")","v":""},null,null,null,null,{"$f":"IF(OR(DV$11=\"X\",DW$11=\"X\"),\"X\",\"\")","v":""}]
["9.2.1.4","c)","Balcão de atendimento possui superfície com largura mínima de 0,90 m e altura entre 0,75 m a 0,85 m do piso, assegurando-se largura livre mínima sob a superfície de 0,80 m?",null,null,null,{"$f":"IF(OR(F$11=\"X\",G$11=\"X\"),\"X\",\"\")","v":"X"},null,null,null,null,{"$f":"IF(OR(K$11=\"X\",L$11=\"X\"),\"X\",\"\")","v":"X"},null,null,null,null,{"$f":"IF(OR(P$11=\"X\",Q$11=\"X\"),\"X\",\"\")","v":"X"},null,null,"X",null,{"$f":"IF(OR(U$11=\"X\",V$11=\"X\"),\"X\",\"\")","v":""},null,null,null,null,{"$f":"IF(OR(Z$11=\"X\",AA$11=\"X\"),\"X\",\"\")","v":""},null,null,null,null,{"$f":"IF(OR(AE$11=\"X\",AF$11=\"X\"),\"X\",\"\")","v":""},null,null,null,null,{"$f":"IF(OR(AJ$11=\"X\",AK$11=\"X\"),\"X\",\"\")","v":""},null,null,null,null,{"$f":"IF(OR(AO$11=\"X\",AP$11=\"X\"),\"X\",\"\")","v":""},null,null,null,null,{"$f":"IF(OR(AT$11=\"X\",AU$11=\"X\"),\"X\",\"\")","v":""},null,null,null,null,{"$f":"IF(OR(AY$11=\"X\",AZ$11=\"X\"),\"X\",\"\")","v":""},null,null,null,null,{"$f":"IF(OR(BD$11=\"X\",BE$11=\"X\"),\"X\",\"\")","v":""},null,null,null,null,{"$f":"IF(OR(BI$11=\"X\",BJ$11=\"X\"),\"X\",\"\")","v":""},null,null,null,null,{"$f":"IF(OR(BN$11=\"X\",BO$11=\"X\"),\"X\",\"\")","v":""},null,null,null,null,{"$f":"IF(OR(BS$11=\"X\",BT$11=\"X\"),\"X\",\"\")","v":""},null,null,null,null,{"$f":"IF(OR(BX$11=\"X\",BY$11=\"X\"),\"X\",\"\")","v":""},null,null,null,null,{"$f":"IF(OR(CC$11=\"X\",CD$11=\"X\"),\"X\",\"\")","v":""},null,null,null,null,{"$f":"IF(OR(CH$11=\"X\",CI$11=\"X\"),\"X\",\"\")","v":""},null,null,null,null,{"$f":"IF(OR(CM$11=\"X\",CN$11=\"X\"),\"X\",\"\")","v":""},null,null,null,null,{"$f":"IF(OR(CR$11=\"X\",CS$11=\"X\"),\"X\",\"\")","v":""},null,null,null,null,{"$f":"IF(OR(CW$11=\"X\",CX$11=\"X\"),\"X\",\"\")","v":""},null,null,null,null,{"$f":"IF(OR(DB$11=\"X\",DC$11=\"X\"),\"X\",\"\")","v":""},null,null,null,null,{"$f":"IF(OR(DG$11=\"X\",DH$11=\"X\"),\"X\",\"\")","v":""},null,null,null,null,{"$f":"IF(OR(DL$11=\"X\",DM$11=\"X\"),\"X\",\"\")","v":""},null,null,null,null,{"$f":"IF(OR(DQ$11=\"X\",DR$11=\"X\"),\"X\",\"\")","v":""},null,null,null,null,{"$f":"IF(OR(DV$11=\"X\",DW$11=\"X\"),\"X\",\"\")","v":""}]
["9.2.1.5","d)","Balcão de atendimento possui altura livre sob o tampo de no mínimo 0,73 m e profundidade livre mínima de 0,30 m, de modo que a pessoa em cadeira de rodas tenha a possibilidade de avançar sob o balcão?",null,null,null,"X",null,null,null,null,"X",null,null,null,null,"X",null,null,null,"X",""," Não possui profundidade livre de 0,30m.",null,null,null,"",null,null,null,null,"",null,null,null,null,"",null,null,null,null,"",null,null,null,null,"",null,null,null,null,"",null,null,null,null,"",null,null,null,null,"",null,null,null,null,"",null,null,null,null,"",null,null,null,null,"",null,null,null,null,"",null,null,null,null,"",null,null,null,null,"",null,null,null,null,"",null,null,null,null,"",null,null,null,null,"",null,null,null,null,"",null,null,null,null,"",null,null,null,null,"",null,null,null,null,""]
["5.3.2.2","e)","O balcão possui o Símbolo Internacional de Acesso próximo à parte rebaixada?",null,null,null,"X",null,null,null,null,"X",null,null,null,null,"X",null,null,null,"X","","Aplicar a sinalização do símbolo - SAI.",null,null,null,"",null,null,null,null,"",null,null,null,null,"",null,null,null,null,"",null,null,null,null,"",null,null,null,null,"",null,null,null,null,"",null,null,null,null,"",null,null,null,null,"",null,null,null,null,"",null,null,null,null,"",null,null,null,null,"",null,null,null,null,"",null,null,null,null,"",null,null,null,null,"",null,null,null,null,"",null,null,null,null,"",null,null,null,null,"",null,null,null,null,"",null,null,null,null,"",null,null,null,null,""]
["5.3.4","f)","O balcão possui o Símbolo Internacional de Pessoas com Deficiência Auditiva?",null,null,null,"X",null,null,null,null,"X",null,null,null,null,"X",null,null,null,"X","","Aplicar a sinalização do símbolo de pessoas com deficiência auditiva.",null,null,null,"",null,null,null,null,"",null,null,null,null,"",null,null,null,null,"",null,null,null,null,"",null,null,null,null,"",null,null,null,null,"",null,null,null,null,"",null,null,null,null,"",null,null,null,null,"",null,null,null,null,"",null,null,null,null,"",null,null,null,null,"",null,null,null,null,"",null,null,null,null,"",null,null,null,null,"",null,null,null,null,"",null,null,null,null,"",null,null,null,null,"",null,null,null,null,"",null,null,null,null,""]
["9.2.1.3","g)","No balcão de atendimento a face do atendente é uniformemente iluminada?",null,null,null,"X",null,null,null,null,"X",null,null,null,null,"X",null,null,"X",null,"",null,null,null,null,"",null,null,null,null,"",null,null,null,null,"",null,null,null,null,"",null,null,null,null,"",null,null,null,null,"",null,null,null,null,"",null,null,null,null,"",null,null,null,null,"",null,null,null,null,"",null,null,null,null,"",null,null,null,null,"",null,null,null,null,"",null,null,null,null,"",null,null,null,null,"",null,null,null,null,"",null,null,null,null,"",null,null,null,null,"",null,null,null,null,"",null,null,null,null,"",null,null,null,null,""]
[]
[null,null,null,null,"SIM","NÃO","JUSTIFICATIVA",null,null,"SIM","NÃO","JUSTIFICATIVA",null,null,"SIM","NÃO","JUSTIFICATIVA",null,null,"SIM","NÃO","JUSTIFICATIVA",null,null,"SIM","NÃO","JUSTIFICATIVA",null,null,"SIM","NÃO","JUSTIFICATIVA",null,null,"SIM","NÃO","JUSTIFICATIVA",null,null,"SIM","NÃO","JUSTIFICATIVA",null,null,"SIM","NÃO","JUSTIFICATIVA",null,null,"SIM","NÃO","JUSTIFICATIVA",null,null,"SIM","NÃO","JUSTIFICATIVA",null,null,"SIM","NÃO","JUSTIFICATIVA",null,null,"SIM","NÃO","JUSTIFICATIVA",null,null,"SIM","NÃO","JUSTIFICATIVA",null,null,"SIM","NÃO","JUSTIFICATIVA",null,null,"SIM","NÃO","JUSTIFICATIVA",null,null,"SIM","NÃO","JUSTIFICATIVA",null,null,"SIM","NÃO","JUSTIFICATIVA",null,null,"SIM","NÃO","JUSTIFICATIVA",null,null,"SIM","NÃO","JUSTIFICATIVA",null,null,"SIM","NÃO","JUSTIFICATIVA",null,null,"SIM","NÃO","JUSTIFICATIVA",null,null,"SIM","NÃO","JUSTIFICATIVA",null,null,"SIM","NÃO","JUSTIFICATIVA",null,null,"SIM","NÃO","JUSTIFICATIVA"]
[null,null,"NECESSITA PROJETO ?",null,null,"X",null,null,null,null,"X",null,null,null,null,"X",null,null,null,null,"X","O balcão de atendimento não atende as especificações mínimas da NBR9050:2020, sendo necessária à sua adequação da profundidade livre para aproximação da pessoa em cadeira de rodas, deve de no mínimo 0,30m e aplicar as sinalizações indicadas."]
[]
["Item da NBR9050",null,"7.2.2 BALCÃO DE INFORMAÇÕES",null,"ATENDE NBR9050-2020",null,"NÃO SE APLICA","OBSERVAÇÕES",null,"ATENDE NBR9050-2020",null,"NÃO SE APLICA","OBSERVAÇÕES",null,"ATENDE NBR9050-2020",null,"NÃO SE APLICA","OBSERVAÇÕES",null,"ATENDE NBR9050-2020",null,"NÃO SE APLICA","OBSERVAÇÕES",null,"ATENDE NBR9050-2020",null,"NÃO SE APLICA","OBSERVAÇÕES",null,"ATENDE NBR9050-2020",null,"NÃO SE APLICA","OBSERVAÇÕES",null,"ATENDE NBR9050-2020",null,"NÃO SE APLICA","OBSERVAÇÕES",null,"ATENDE NBR9050-2020",null,"NÃO SE APLICA","OBSERVAÇÕES",null,"ATENDE NBR9050-2020",null,"NÃO SE APLICA","OBSERVAÇÕES",null,"ATENDE NBR9050-2020",null,"NÃO SE APLICA","OBSERVAÇÕES",null,"ATENDE NBR9050-2020",null,"NÃO SE APLICA","OBSERVAÇÕES",null,"ATENDE NBR9050-2020",null,"NÃO SE APLICA","OBSERVAÇÕES",null,"ATENDE NBR9050-2020",null,"NÃO SE APLICA","OBSERVAÇÕES",null,"ATENDE NBR9050-2020",null,"NÃO SE APLICA","OBSERVAÇÕES",null,"ATENDE NBR9050-2020",null,"NÃO SE APLICA","OBSERVAÇÕES",null,"ATENDE NBR9050-2020",null,"NÃO SE APLICA","OBSERVAÇÕES",null,"ATENDE NBR9050-2020",null,"NÃO SE APLICA","OBSERVAÇÕES",null,"ATENDE NBR9050-2020",null,"NÃO SE APLICA","OBSERVAÇÕES",null,"ATENDE NBR9050-2020",null,"NÃO SE APLICA","OBSERVAÇÕES",null,"ATENDE NBR9050-2020",null,"NÃO SE APLICA","OBSERVAÇÕES",null,"ATENDE NBR9050-2020",null,"NÃO SE APLICA","OBSERVAÇÕES",null,"ATENDE NBR9050-2020",null,"NÃO SE APLICA","OBSERVAÇÕES",null,"ATENDE NBR9050-2020",null,"NÃO SE APLICA","OBSERVAÇÕES",null,"ATENDE NBR9050-2020",null,"NÃO SE APLICA","OBSERVAÇÕES",null,"ATENDE NBR9050-2020",null,"NÃO SE APLICA","OBSERVAÇÕES"]
[null,null,null,null,"SIM","NÃO",null,null,null,"SIM","NÃO",null,null,null,"SIM","NÃO",null,null,null,"SIM","NÃO",null,null,null,"SIM","NÃO",null,null,null,"SIM","NÃO",null,null,null,"SIM","NÃO",null,null,null,"SIM","NÃO",null,null,null,"SIM","NÃO",null,null,null,"SIM","NÃO",null,null,null,"SIM","NÃO",null,null,null,"SIM","NÃO",null,null,null,"SIM","NÃO",null,null,null,"SIM","NÃO",null,null,null,"SIM","NÃO",null,null,null,"SIM","NÃO",null,null,null,"SIM","NÃO",null,null,null,"SIM","NÃO",null,null,null,"SIM","NÃO",null,null,null,"SIM","NÃO",null,null,null,"SIM","NÃO",null,null,null,"SIM","NÃO",null,null,null,"SIM","NÃO",null,null,null,"SIM","NÃO",null,null,null,"SIM","NÃO"]
[null,"a)","Existe balcão de informações?",null,"X",null,null,null,null,"X",null,null,null,null,"X",null,null,null,null,null,null,"X"]
["9.2.3.1","b)"," Balcão de informações está facilmente identificado e localizado em rota acessível?",null,"X",null,{"$f":"IF(OR(F$24=\"X\",G$24=\"X\"),\"X\",\"\")","v":""},null,null,"X",null,{"$f":"IF(OR(K$24=\"X\",L$24=\"X\"),\"X\",\"\")","v":""},null,null,"X",null,{"$f":"IF(OR(P$24=\"X\",Q$24=\"X\"),\"X\",\"\")","v":""},null,null,null,null,{"$f":"IF(OR(U$24=\"X\",V$24=\"X\"),\"X\",\"\")","v":"X"},null,null,null,null,{"$f":"IF(OR(Z$24=\"X\",AA$24=\"X\"),\"X\",\"\")","v":""},null,null,null,null,{"$f":"IF(OR(AE$24=\"X\",AF$24=\"X\"),\"X\",\"\")","v":""},null,null,null,null,{"$f":"IF(OR(AJ$24=\"X\",AK$24=\"X\"),\"X\",\"\")","v":""},null,null,null,null,{"$f":"IF(OR(AO$24=\"X\",AP$24=\"X\"),\"X\",\"\")","v":""},null,null,null,null,{"$f":"IF(OR(AT$24=\"X\",AU$24=\"X\"),\"X\",\"\")","v":""},null,null,null,null,{"$f":"IF(OR(AY$24=\"X\",AZ$24=\"X\"),\"X\",\"\")","v":""},null,null,null,null,{"$f":"IF(OR(BD$24=\"X\",BE$24=\"X\"),\"X\",\"\")","v":""},null,null,null,null,{"$f":"IF(OR(BI$24=\"X\",BJ$24=\"X\"),\"X\",\"\")","v":""},null,null,null,null,{"$f":"IF(OR(BN$24=\"X\",BO$24=\"X\"),\"X\",\"\")","v":""},null,null,null,null,{"$f":"IF(OR(BS$24=\"X\",BT$24=\"X\"),\"X\",\"\")","v":""},null,null,null,null,{"$f":"IF(OR(BX$24=\"X\",BY$24=\"X\"),\"X\",\"\")","v":""},null,null,null,null,{"$f":"IF(OR(CC$24=\"X\",CD$24=\"X\"),\"X\",\"\")","v":""},null,null,null,null,{"$f":"IF(OR(CH$24=\"X\",CI$24=\"X\"),\"X\",\"\")","v":""},null,null,null,null,{"$f":"IF(OR(CM$24=\"X\",CN$24=\"X\"),\"X\",\"\")","v":""},null,null,null,null,{"$f":"IF(OR(CR$24=\"X\",CS$24=\"X\"),\"X\",\"\")","v":""},null,null,null,null,{"$f":"IF(OR(CW$24=\"X\",CX$24=\"X\"),\"X\",\"\")","v":""},null,null,null,null,{"$f":"IF(OR(DB$24=\"X\",DC$24=\"X\"),\"X\",\"\")","v":""},null,null,null,null,{"$f":"IF(OR(DG$24=\"X\",DH$24=\"X\"),\"X\",\"\")","v":""},null,null,null,null,{"$f":"IF(OR(DL$24=\"X\",DM$24=\"X\"),\"X\",\"\")","v":""},null,null,null,null,{"$f":"IF(OR(DQ$24=\"X\",DR$24=\"X\"),\"X\",\"\")","v":""},null,null,null,null,{"$f":"IF(OR(DV$24=\"X\",DW$24=\"X\"),\"X\",\"\")","v":""}]
["9.2.3.4","c)","Balcão de informações possui superfície com largura mínima de 0,90 m e altura entre 0,90 m a 1,05 m do piso?",null,"X",null,null,null,null,"X",null,null,null,null,"X",null,null,null,null,null,null,{"$f":"IF(OR(U$24=\"X\",V$24=\"X\"),\"X\",\"\")","v":"X"},null,null,null,null,{"$f":"IF(OR(Z$24=\"X\",AA$24=\"X\"),\"X\",\"\")","v":""},null,null,null,null,{"$f":"IF(OR(AE$24=\"X\",AF$24=\"X\"),\"X\",\"\")","v":""},null,null,null,null,{"$f":"IF(OR(AJ$24=\"X\",AK$24=\"X\"),\"X\",\"\")","v":""},null,null,null,null,{"$f":"IF(OR(AO$24=\"X\",AP$24=\"X\"),\"X\",\"\")","v":""},null,null,null,null,{"$f":"IF(OR(AT$24=\"X\",AU$24=\"X\"),\"X\",\"\")","v":""},null,null,null,null,{"$f":"IF(OR(AY$24=\"X\",AZ$24=\"X\"),\"X\",\"\")","v":""},null,null,null,null,{"$f":"IF(OR(BD$24=\"X\",BE$24=\"X\"),\"X\",\"\")","v":""},null,null,null,null,{"$f":"IF(OR(BI$24=\"X\",BJ$24=\"X\"),\"X\",\"\")","v":""},null,null,null,null,{"$f":"IF(OR(BN$24=\"X\",BO$24=\"X\"),\"X\",\"\")","v":""},null,null,null,null,{"$f":"IF(OR(BS$24=\"X\",BT$24=\"X\"),\"X\",\"\")","v":""},null,null,null,null,{"$f":"IF(OR(BX$24=\"X\",BY$24=\"X\"),\"X\",\"\")","v":""},null,null,null,null,{"$f":"IF(OR(CC$24=\"X\",CD$24=\"X\"),\"X\",\"\")","v":""},null,null,null,null,{"$f":"IF(OR(CH$24=\"X\",CI$24=\"X\"),\"X\",\"\")","v":""},null,null,null,null,{"$f":"IF(OR(CM$24=\"X\",CN$24=\"X\"),\"X\",\"\")","v":""},null,null,null,null,{"$f":"IF(OR(CR$24=\"X\",CS$24=\"X\"),\"X\",\"\")","v":""},null,null,null,null,{"$f":"IF(OR(CW$24=\"X\",CX$24=\"X\"),\"X\",\"\")","v":""},null,null,null,null,{"$f":"IF(OR(DB$24=\"X\",DC$24=\"X\"),\"X\",\"\")","v":""},null,null,null,null,{"$f":"IF(OR(DG$24=\"X\",DH$24=\"X\"),\"X\",\"\")","v":""},null,null,null,null,{"$f":"IF(OR(DL$24=\"X\",DM$24=\"X\"),\"X\",\"\")","v":""},null,null,null,null,{"$f":"IF(OR(DQ$24=\"X\",DR$24=\"X\"),\"X\",\"\")","v":""},null,null,null,null,{"$f":"IF(OR(DV$24=\"X\",DW$24=\"X\"),\"X\",\"\")","v":""}]
["9.2.3.5","d)","Balcão de informações garante aproximação lateral à pessoa em cadeira de rodas e circulação adjacente que permite rotação de 180°?",null,"X",null,{"$f":"IF(OR(F$24=\"X\",G$24=\"X\"),\"X\",\"\")","v":""},null,null,"X",null,{"$f":"IF(OR(K$24=\"X\",L$24=\"X\"),\"X\",\"\")","v":""},null,null,"X",null,{"$f":"IF(OR(P$24=\"X\",Q$24=\"X\"),\"X\",\"\")","v":""},null,null,null,null,"X",null,null,null,null,"",null,null,null,null,"",null,null,null,null,"",null,null,null,null,"",null,null,null,null,"",null,null,null,null,"",null,null,null,null,"",null,null,null,null,"",null,null,null,null,"",null,null,null,null,"",null,null,null,null,"",null,null,null,null,"",null,null,null,null,"",null,null,null,null,"",null,null,null,null,"",null,null,null,null,"",null,null,null,null,"",null,null,null,null,"",null,null,null,null,"",null,null,null,null,"",null,null,null,null,""]
["5.3.2.2","e)","O balcão possui o Símbolo Internacional de Acesso próximo à parte rebaixada?",null,null,"X",null,"Não possui parte rebaixada e sinalização com o símbolo internacional de acesso no balcão de informações.",null,null,"X",null,"Não possui parte rebaixada e sinalização com o símbolo internacional de acesso no balcão de informações.",null,null,"X",null,"Não possui parte rebaixada e sinalização com o símbolo internacional de acesso no balcão de informações.",null,null,null,"X",null,null,null,null,"",null,null,null,null,"",null,null,null,null,"",null,null,null,null,"",null,null,null,null,"",null,null,null,null,"",null,null,null,null,"",null,null,null,null,"",null,null,null,null,"",null,null,null,null,"",null,null,null,null,"",null,null,null,null,"",null,null,null,null,"",null,null,null,null,"",null,null,null,null,"",null,null,null,null,"",null,null,null,null,"",null,null,null,null,"",null,null,null,null,"",null,null,null,null,"",null,null,null,null,""]
["5.3.4","f)","O balcão possui o Símbolo Internacional de Pessoas com Deficiência Auditiva?",null,null,"X","","Não possui o simbolo para atendimento de pessoas com deficiência auditiva.",null,null,"X","","Não possui o simbolo para atendimento de pessoas com deficiência auditiva.",null,null,"X","","Não possui o simbolo para atendimento de pessoas com deficiência auditiva.",null,null,null,"X",null,null,null,null,"",null,null,null,null,"",null,null,null,null,"",null,null,null,null,"",null,null,null,null,"",null,null,null,null,"",null,null,null,null,"",null,null,null,null,"",null,null,null,null,"",null,null,null,null,"",null,null,null,null,"",null,null,null,null,"",null,null,null,null,"",null,null,null,null,"",null,null,null,null,"",null,null,null,null,"",null,null,null,null,"",null,null,null,null,"",null,null,null,null,"",null,null,null,null,"",null,null,null,null,""]
["9.2.3.2","g)","No balcão de informação a face do atendente é uniformemente iluminada?",null,null,"X","","Não está em conformidade com o nível mínimo de iluminação de 150 lux.",null,null,"X","","Não está em conformidade com o nível mínimo de iluminação de 150 lux.",null,null,"X","","Não está em conformidade com o nível mínimo de iluminação de 150 lux.",null,null,null,"X",null,null,null,null,"",null,null,null,null,"",null,null,null,null,"",null,null,null,null,"",null,null,null,null,"",null,null,null,null,"",null,null,null,null,"",null,null,null,null,"",null,null,null,null,"",null,null,null,null,"",null,null,null,null,"",null,null,null,null,"",null,null,null,null,"",null,null,null,null,"",null,null,null,null,"",null,null,null,null,"",null,null,null,null,"",null,null,null,null,"",null,null,null,null,"",null,null,null,null,"",null,null,null,null,""]
[]
[null,null,null,null,"SIM","NÃO","JUSTIFICATIVA",null,null,"SIM","NÃO","JUSTIFICATIVA",null,null,"SIM","NÃO","JUSTIFICATIVA",null,null,"SIM","NÃO","JUSTIFICATIVA",null,null,"SIM","NÃO","JUSTIFICATIVA",null,null,"SIM","NÃO","JUSTIFICATIVA",null,null,"SIM","NÃO","JUSTIFICATIVA",null,null,"SIM","NÃO","JUSTIFICATIVA",null,null,"SIM","NÃO","JUSTIFICATIVA",null,null,"SIM","NÃO","JUSTIFICATIVA",null,null,"SIM","NÃO","JUSTIFICATIVA",null,null,"SIM","NÃO","JUSTIFICATIVA",null,null,"SIM","NÃO","JUSTIFICATIVA",null,null,"SIM","NÃO","JUSTIFICATIVA",null,null,"SIM","NÃO","JUSTIFICATIVA",null,null,"SIM","NÃO","JUSTIFICATIVA",null,null,"SIM","NÃO","JUSTIFICATIVA",null,null,"SIM","NÃO","JUSTIFICATIVA",null,null,"SIM","NÃO","JUSTIFICATIVA",null,null,"SIM","NÃO","JUSTIFICATIVA",null,null,"SIM","NÃO","JUSTIFICATIVA",null,null,"SIM","NÃO","JUSTIFICATIVA",null,null,"SIM","NÃO","JUSTIFICATIVA",null,null,"SIM","NÃO","JUSTIFICATIVA",null,null,"SIM","NÃO","JUSTIFICATIVA"]
[null,null,"NECESSITA PROJETO ?",null,null,"X","Deve atender o mínimo de lux de 150, trocar a Iluminação onde foi apontado, e atender a sinalização dos símbolos para atendimento de pessoa com deficiência auditiva e pessoas em cadeira de rodas. ",null,null,null,"X","Deve atender o mínimo de lux de 150, trocar a Iluminação onde foi apontado, e atender a sinalização dos símbolos para atendimento de pessoa com deficiência auditiva e pessoas em cadeira de rodas. ",null,null,null,"X","Deve atender o mínimo de lux de 150, trocar a Iluminação onde foi apontado, e atender a sinalização dos símbolos para atendimento de pessoa com deficiência auditiva e pessoas em cadeira de rodas. ",null,null,null,"X"]
[]
["Item da NBR9050",null,"7.2.3 TOTENS DE AUTOATENDIMENTO",null,"ATENDE NBR9050-2020",null,"NÃO SE APLICA","OBSERVAÇÕES",null,"ATENDE NBR9050-2020",null,"NÃO SE APLICA","OBSERVAÇÕES",null,"ATENDE NBR9050-2020",null,"NÃO SE APLICA","OBSERVAÇÕES",null,"ATENDE NBR9050-2020",null,"NÃO SE APLICA","OBSERVAÇÕES",null,"ATENDE NBR9050-2020",null,"NÃO SE APLICA","OBSERVAÇÕES",null,"ATENDE NBR9050-2020",null,"NÃO SE APLICA","OBSERVAÇÕES",null,"ATENDE NBR9050-2020",null,"NÃO SE APLICA","OBSERVAÇÕES",null,"ATENDE NBR9050-2020",null,"NÃO SE APLICA","OBSERVAÇÕES",null,"ATENDE NBR9050-2020",null,"NÃO SE APLICA","OBSERVAÇÕES",null,"ATENDE NBR9050-2020",null,"NÃO SE APLICA","OBSERVAÇÕES",null,"ATENDE NBR9050-2020",null,"NÃO SE APLICA","OBSERVAÇÕES",null,"ATENDE NBR9050-2020",null,"NÃO SE APLICA","OBSERVAÇÕES",null,"ATENDE NBR9050-2020",null,"NÃO SE APLICA","OBSERVAÇÕES",null,"ATENDE NBR9050-2020",null,"NÃO SE APLICA","OBSERVAÇÕES",null,"ATENDE NBR9050-2020",null,"NÃO SE APLICA","OBSERVAÇÕES",null,"ATENDE NBR9050-2020",null,"NÃO SE APLICA","OBSERVAÇÕES",null,"ATENDE NBR9050-2020",null,"NÃO SE APLICA","OBSERVAÇÕES",null,"ATENDE NBR9050-2020",null,"NÃO SE APLICA","OBSERVAÇÕES",null,"ATENDE NBR9050-2020",null,"NÃO SE APLICA","OBSERVAÇÕES",null,"ATENDE NBR9050-2020",null,"NÃO SE APLICA","OBSERVAÇÕES",null,"ATENDE NBR9050-2020",null,"NÃO SE APLICA","OBSERVAÇÕES",null,"ATENDE NBR9050-2020",null,"NÃO SE APLICA","OBSERVAÇÕES",null,"ATENDE NBR9050-2020",null,"NÃO SE APLICA","OBSERVAÇÕES",null,"ATENDE NBR9050-2020",null,"NÃO SE APLICA","OBSERVAÇÕES",null,"ATENDE NBR9050-2020",null,"NÃO SE APLICA","OBSERVAÇÕES"]
[null,null,null,null,"SIM","NÃO",null,null,null,"SIM","NÃO",null,null,null,"SIM","NÃO",null,null,null,"SIM","NÃO",null,null,null,"SIM","NÃO",null,null,null,"SIM","NÃO",null,null,null,"SIM","NÃO",null,null,null,"SIM","NÃO",null,null,null,"SIM","NÃO",null,null,null,"SIM","NÃO",null,null,null,"SIM","NÃO",null,null,null,"SIM","NÃO",null,null,null,"SIM","NÃO",null,null,null,"SIM","NÃO",null,null,null,"SIM","NÃO",null,null,null,"SIM","NÃO",null,null,null,"SIM","NÃO",null,null,null,"SIM","NÃO",null,null,null,"SIM","NÃO",null,null,null,"SIM","NÃO",null,null,null,"SIM","NÃO",null,null,null,"SIM","NÃO",null,null,null,"SIM","NÃO",null,null,null,"SIM","NÃO",null,null,null,"SIM","NÃO"]
[null,"a)","Existe totem de autoatendimento?",null,null,null,"X",null,null,null,null,"X",null,null,null,null,"X",null,null,null,null,"X"]
["9.4.3.2","b)"," Em áreas de atendimento, no caso de dispensers de senha ou totens de autoatendimento, estes estão localizados em área de piso nivelado e sem obstruções? ",null,null,null,{"$f":"IF(OR(F$37=\"X\",G$37=\"X\"),\"X\",\"\")","v":"X"},null,null,null,null,{"$f":"IF(OR(K$37=\"X\",L$37=\"X\"),\"X\",\"\")","v":"X"},null,null,null,null,{"$f":"IF(OR(P$37=\"X\",Q$37=\"X\"),\"X\",\"\")","v":"X"},null,null,null,null,{"$f":"IF(OR(U$37=\"X\",V$37=\"X\"),\"X\",\"\")","v":"X"},null,null,null,null,{"$f":"IF(OR(Z$37=\"X\",AA$37=\"X\"),\"X\",\"\")","v":""},null,null,null,null,{"$f":"IF(OR(AE$37=\"X\",AF$37=\"X\"),\"X\",\"\")","v":""},null,null,null,null,{"$f":"IF(OR(AJ$37=\"X\",AK$37=\"X\"),\"X\",\"\")","v":""},null,null,null,null,{"$f":"IF(OR(AO$37=\"X\",AP$37=\"X\"),\"X\",\"\")","v":""},null,null,null,null,{"$f":"IF(OR(AT$37=\"X\",AU$37=\"X\"),\"X\",\"\")","v":""},null,null,null,null,{"$f":"IF(OR(AY$37=\"X\",AZ$37=\"X\"),\"X\",\"\")","v":""},null,null,null,null,{"$f":"IF(OR(BD$37=\"X\",BE$37=\"X\"),\"X\",\"\")","v":""},null,null,null,null,{"$f":"IF(OR(BI$37=\"X\",BJ$37=\"X\"),\"X\",\"\")","v":""},null,null,null,null,{"$f":"IF(OR(BN$37=\"X\",BO$37=\"X\"),\"X\",\"\")","v":""},null,null,null,null,{"$f":"IF(OR(BS$37=\"X\",BT$37=\"X\"),\"X\",\"\")","v":""},null,null,null,null,{"$f":"IF(OR(BX$37=\"X\",BY$37=\"X\"),\"X\",\"\")","v":""},null,null,null,null,{"$f":"IF(OR(CC$37=\"X\",CD$37=\"X\"),\"X\",\"\")","v":""},null,null,null,null,{"$f":"IF(OR(CH$37=\"X\",CI$37=\"X\"),\"X\",\"\")","v":""},null,null,null,null,{"$f":"IF(OR(CM$37=\"X\",CN$37=\"X\"),\"X\",\"\")","v":""},null,null,null,null,{"$f":"IF(OR(CR$37=\"X\",CS$37=\"X\"),\"X\",\"\")","v":""},null,null,null,null,{"$f":"IF(OR(CW$37=\"X\",CX$37=\"X\"),\"X\",\"\")","v":""},null,null,null,null,{"$f":"IF(OR(DB$37=\"X\",DC$37=\"X\"),\"X\",\"\")","v":""},null,null,null,null,{"$f":"IF(OR(DG$37=\"X\",DH$37=\"X\"),\"X\",\"\")","v":""},null,null,null,null,{"$f":"IF(OR(DL$37=\"X\",DM$37=\"X\"),\"X\",\"\")","v":""},null,null,null,null,{"$f":"IF(OR(DQ$37=\"X\",DR$37=\"X\"),\"X\",\"\")","v":""},null,null,null,null,{"$f":"IF(OR(DV$37=\"X\",DW$37=\"X\"),\"X\",\"\")","v":""}]
["9.4.3.4","c)","Pelo menos um desses equipamentos possui um M. R. para aproximação de pessoa em cadeira de rodas?",null,null,null,{"$f":"IF(OR(F$37=\"X\",G$37=\"X\"),\"X\",\"\")","v":"X"},null,null,null,null,{"$f":"IF(OR(K$37=\"X\",L$37=\"X\"),\"X\",\"\")","v":"X"},null,null,null,null,{"$f":"IF(OR(P$37=\"X\",Q$37=\"X\"),\"X\",\"\")","v":"X"},null,null,null,null,{"$f":"IF(OR(U$37=\"X\",V$37=\"X\"),\"X\",\"\")","v":"X"},null,null,null,null,{"$f":"IF(OR(Z$37=\"X\",AA$37=\"X\"),\"X\",\"\")","v":""},null,null,null,null,{"$f":"IF(OR(AE$37=\"X\",AF$37=\"X\"),\"X\",\"\")","v":""},null,null,null,null,{"$f":"IF(OR(AJ$37=\"X\",AK$37=\"X\"),\"X\",\"\")","v":""},null,null,null,null,{"$f":"IF(OR(AO$37=\"X\",AP$37=\"X\"),\"X\",\"\")","v":""},null,null,null,null,{"$f":"IF(OR(AT$37=\"X\",AU$37=\"X\"),\"X\",\"\")","v":""},null,null,null,null,{"$f":"IF(OR(AY$37=\"X\",AZ$37=\"X\"),\"X\",\"\")","v":""},null,null,null,null,{"$f":"IF(OR(BD$37=\"X\",BE$37=\"X\"),\"X\",\"\")","v":""},null,null,null,null,{"$f":"IF(OR(BI$37=\"X\",BJ$37=\"X\"),\"X\",\"\")","v":""},null,null,null,null,{"$f":"IF(OR(BN$37=\"X\",BO$37=\"X\"),\"X\",\"\")","v":""},null,null,null,null,{"$f":"IF(OR(BS$37=\"X\",BT$37=\"X\"),\"X\",\"\")","v":""},null,null,null,null,{"$f":"IF(OR(BX$37=\"X\",BY$37=\"X\"),\"X\",\"\")","v":""},null,null,null,null,{"$f":"IF(OR(CC$37=\"X\",CD$37=\"X\"),\"X\",\"\")","v":""},null,null,null,null,{"$f":"IF(OR(CH$37=\"X\",CI$37=\"X\"),\"X\",\"\")","v":""},null,null,null,null,{"$f":"IF(OR(CM$37=\"X\",CN$37=\"X\"),\"X\",\"\")","v":""},null,null,null,null,{"$f":"IF(OR(CR$37=\"X\",CS$37=\"X\"),\"X\",\"\")","v":""},null,null,null,null,{"$f":"IF(OR(CW$37=\"X\",CX$37=\"X\"),\"X\",\"\")","v":""},null,null,null,null,{"$f":"IF(OR(DB$37=\"X\",DC$37=\"X\"),\"X\",\"\")","v":""},null,null,null,null,{"$f":"IF(OR(DG$37=\"X\",DH$37=\"X\"),\"X\",\"\")","v":""},null,null,null,null,{"$f":"IF(OR(DL$37=\"X\",DM$37=\"X\"),\"X\",\"\")","v":""},null,null,null,null,{"$f":"IF(OR(DQ$37=\"X\",DR$37=\"X\"),\"X\",\"\")","v":""},null,null,null,null,{"$f":"IF(OR(DV$37=\"X\",DW$37=\"X\"),\"X\",\"\")","v":""}]
["9.4.3.5","d)","Os controles estão localizados entre 0,80 m e 1,20 m do piso, com profundidade de no máximo 0,30 m em relação à face frontal externa do equipamento?",null,null,null,"X",null,null,null,null,"X",null,null,null,null,"X",null,null,null,null,"X",null,null,null,null,"",null,null,null,null,"",null,null,null,null,"",null,null,null,null,"",null,null,null,null,"",null,null,null,null,"",null,null,null,null,"",null,null,null,null,"",null,null,null,null,"",null,null,null,null,"",null,null,null,null,"",null,null,null,null,"",null,null,null,null,"",null,null,null,null,"",null,null,null,null,"",null,null,null,null,"",null,null,null,null,"",null,null,null,null,"",null,null,null,null,"",null,null,null,null,"",null,null,null,null,""]
["9.4.3.8","e)","O equipamento apresenta instruções e informações visuais e auditivas ou táteis em posição visível, conforme Seção 5?",null,null,null,"X",null,null,null,null,"X",null,null,null,null,"X",null,null,null,null,"X",null,null,null,null,"",null,null,null,null,"",null,null,null,null,"",null,null,null,null,"",null,null,null,null,"",null,null,null,null,"",null,null,null,null,"",null,null,null,null,"",null,null,null,null,"",null,null,null,null,"",null,null,null,null,"",null,null,null,null,"",null,null,null,null,"",null,null,null,null,"",null,null,null,null,"",null,null,null,null,"",null,null,null,null,"",null,null,null,null,"",null,null,null,null,"",null,null,null,null,"",null,null,null,null,""]
["5.1.3","f)","No caso de displays de senhas, a informação é compreensível por pessoas com deficiência, sendo apresentada de forma visual e sonora?",null,null,null,"X",null,null,null,null,"X",null,null,null,null,"X",null,null,null,null,"X",null,null,null,null,"",null,null,null,null,"",null,null,null,null,"",null,null,null,null,"",null,null,null,null,"",null,null,null,null,"",null,null,null,null,"",null,null,null,null,"",null,null,null,null,"",null,null,null,null,"",null,null,null,null,"",null,null,null,null,"",null,null,null,null,"",null,null,null,null,"",null,null,null,null,"",null,null,null,null,"",null,null,null,null,"",null,null,null,null,"",null,null,null,null,"",null,null,null,null,"",null,null,null,null,""]
[]
[null,null,null,null,"SIM","NÃO","JUSTIFICATIVA",null,null,"SIM","NÃO","JUSTIFICATIVA",null,null,"SIM","NÃO","JUSTIFICATIVA",null,null,"SIM","NÃO","JUSTIFICATIVA",null,null,"SIM","NÃO","JUSTIFICATIVA",null,null,"SIM","NÃO","JUSTIFICATIVA",null,null,"SIM","NÃO","JUSTIFICATIVA",null,null,"SIM","NÃO","JUSTIFICATIVA",null,null,"SIM","NÃO","JUSTIFICATIVA",null,null,"SIM","NÃO","JUSTIFICATIVA",null,null,"SIM","NÃO","JUSTIFICATIVA",null,null,"SIM","NÃO","JUSTIFICATIVA",null,null,"SIM","NÃO","JUSTIFICATIVA",null,null,"SIM","NÃO","JUSTIFICATIVA",null,null,"SIM","NÃO","JUSTIFICATIVA",null,null,"SIM","NÃO","JUSTIFICATIVA",null,null,"SIM","NÃO","JUSTIFICATIVA",null,null,"SIM","NÃO","JUSTIFICATIVA",null,null,"SIM","NÃO","JUSTIFICATIVA",null,null,"SIM","NÃO","JUSTIFICATIVA",null,null,"SIM","NÃO","JUSTIFICATIVA",null,null,"SIM","NÃO","JUSTIFICATIVA",null,null,"SIM","NÃO","JUSTIFICATIVA",null,null,"SIM","NÃO","JUSTIFICATIVA",null,null,"SIM","NÃO","JUSTIFICATIVA"]
[null,null,"NECESSITA PROJETO ?",null,null,"X",null,null,null,null,"X",null,null,null,null,"X",null,null,null,null,"X"]

{"sheet":"7.3_Assentos","index":12,"n_rows":20,"n_cols":128,"rows_kept":20,"cut":false,"hidden":false,"merged":[[19,106,19,107],[19,111,19,112],[19,116,19,117],[19,121,19,122],[19,126,19,127],[19,81,19,82],[19,86,19,87],[19,91,19,92],[19,96,19,97],[19,101,19,102],[18,106,18,107],[18,111,18,112],[18,116,18,117],[18,121,18,122],[18,126,18,127],[18,81,18,82],[18,86,18,87],[18,91,18,92],[18,96,18,97],[18,101,18,102],[8,121,9,121],[8,122,9,122],[8,124,8,125],[8,126,9,126],[8,127,9,127],[8,112,9,112],[8,114,8,115],[8,116,9,116],[8,117,9,117],[8,119,8,120],[8,104,8,105],[8,106,9,106],[8,107,9,107],[8,109,8,110],[8,111,9,111],[8,96,9,96],[8,97,9,97],[8,99,8,100],[8,101,9,101],[8,102,9,102],[8,87,9,87],[8,89,8,90],[8,91,9,91],[8,92,9,92],[8,94,8,95],[8,79,8,80],[8,81,9,81],[8,82,9,82],[8,84,8,85],[8,86,9,86],[6,104,6,107],[6,109,6,112],[6,114,6,117],[6,119,6,122],[6,124,6,127],[6,79,6,82],[6,84,6,87],[6,89,6,92],[6,94,6,97],[6,99,6,102],[19,6,19,7],[19,11,19,12],[19,16,19,17],[8,17,9,17],[8,7,9,7],[8,12,9,12],[6,9,6,12],[6,14,6,17],[18,6,18,7],[18,11,18,12],[18,16,18,17],[8,9,8,10],[8,11,9,11],[8,14,8,15],[8,16,9,16],[8,0,9,0],[0,0,0,2],[2,0,2,3],[8,4,8,5],[8,6,9,6],[6,4,6,7],[6,19,6,22],[6,24,6,27],[6,29,6,32],[8,19,8,20],[8,21,9,21],[8,22,9,22],[8,24,8,25],[8,26,9,26],[8,27,9,27],[8,29,8,30],[8,31,9,31],[8,32,9,32],[18,21,18,22],[18,26,18,27],[18,31,18,32],[19,21,19,22],[19,26,19,27],[19,31,19,32],[6,34,6,37],[6,39,6,42],[6,44,6,47],[18,36,18,37],[18,41,18,42],[18,46,18,47],[6,49,6,52],[6,54,6,57],[6,59,6,62],[8,34,8,35],[8,36,9,36],[8,37,9,37],[8,39,8,40],[8,41,9,41],[8,42,9,42],[8,44,8,45],[8,46,9,46],[8,47,9,47],[8,49,8,50],[8,51,9,51],[8,52,9,52],[8,54,8,55],[8,56,9,56],[8,57,9,57],[8,59,8,60],[8,61,9,61],[8,62,9,62],[18,51,18,52],[18,56,18,57],[18,61,18,62],[18,66,18,67],[18,71,18,72],[18,76,18,77],[19,36,19,37],[19,41,19,42],[19,46,19,47],[19,51,19,52],[19,56,19,57],[19,66,19,67],[19,71,19,72],[19,76,19,77],[19,61,19,62],[6,64,6,67],[6,69,6,72],[6,74,6,77],[8,64,8,65],[8,66,9,66],[8,67,9,67],[8,69,8,70],[8,71,9,71],[8,72,9,72],[8,74,8,75],[8,76,9,76],[8,77,9,77]]}
[{"$f":"'1_Informações e outros'!C1","v":"Ministério da Mulher, da Família e dos Direitos Humanos\nSecretaria Nacional dos Direitos da Pessoa com Deficiência"}]
[]
["LAUDO / CHECK LIST DE ACESSIBILIDADE PARA AVALIAÇÃO DE CONFORMIDADE ÀS NORMAS DE ACESSIBILIDADE (CONFORME NBR 9050:2020) "]
[]
["UNIDADE / ÓRGÃO",null,{"$f":"'1_Informações e outros'!E5","v":"MINISTÉRIO DA MULHER, DA FAMÍLIA E DOS DIREITOS HUMANOS"}]
[]
[{"$f":"'1_Informações e outros'!M5","v":4},null,null,null,{"$f":"'4.1_Circul'!E7","v":"8º PAVTO"},null,null,null,null,{"$f":"'4.1_Circul'!J7","v":"9º PAVTO"},null,null,null,null,{"$f":"'4.1_Circul'!O7","v":"10º PAVTO"},null,null,null,null,{"$f":"'4.1_Circul'!T7","v":"TÉRREO"},null,null,null,null,{"$f":"'4.1_Circul'!Y7","v":"5º PAVTO"},null,null,null,null,{"$f":"'4.1_Circul'!AD7","v":"6º PAVTO"},null,null,null,null,{"$f":"'4.1_Circul'!AI7","v":"7º PAVTO"},null,null,null,null,{"$f":"'4.1_Circul'!AN7","v":"8º PAVTO"},null,null,null,null,{"$f":"'4.1_Circul'!AS7","v":"9º PAVTO"},null,null,null,null,{"$f":"'4.1_Circul'!AX7","v":"10º PAVTO"},null,null,null,null,{"$f":"'4.1_Circul'!BC7","v":"11º PAVTO"},null,null,null,null,{"$f":"'4.1_Circul'!BH7","v":"12º PAVTO"},null,null,null,null,{"$f":"'4.1_Circul'!BM7","v":"13º PAVTO"},null,null,null,null,{"$f":"'4.1_Circul'!BR7","v":"14º PAVTO"},null,null,null,null,{"$f":"'4.1_Circul'!BW7","v":"15º PAVTO"},null,null,null,null,{"$f":"'4.1_Circul'!CB7","v":"16º PAVTO"},null,null,null,null,{"$f":"'4.1_Circul'!CG7","v":"17º PAVTO"},null,null,null,null,{"$f":"'4.1_Circul'!CL7","v":"18º PAVTO"},null,null,null,null,{"$f":"'4.1_Circul'!CQ7","v":"19º PAVTO"},null,null,null,null,{"$f":"'4.1_Circul'!CV7","v":"20º PAVTO"},null,null,null,null,{"$f":"'4.1_Circul'!DA7","v":"21º PAVTO"},null,null,null,null,{"$f":"'4.1_Circul'!DF7","v":"22º PAVTO"},null,null,null,null,{"$f":"'4.1_Circul'!DK7","v":"23º PAVTO"},null,null,null,null,{"$f":"'4.1_Circul'!DP7","v":"24º PAVTO"},null,null,null,null,{"$f":"'4.1_Circul'!DU7","v":"25º PAVTO"}]
[]
["Item da NBR9050",null,"07. MOBILIÁRIO",null,"ATENDE NBR9050-2020",null,"NÃO SE APLICA","OBSERVAÇÕES",null,"ATENDE NBR9050-2020",null,"NÃO SE APLICA","OBSERVAÇÕES",null,"ATENDE NBR9050-2020",null,"NÃO SE APLICA","OBSERVAÇÕES",null,"ATENDE NBR9050-2020",null,"NÃO SE APLICA","OBSERVAÇÕES",null,"ATENDE NBR9050-2020",null,"NÃO SE APLICA","OBSERVAÇÕES",null,"ATENDE NBR9050-2020",null,"NÃO SE APLICA","OBSERVAÇÕES",null,"ATENDE NBR9050-2020",null,"NÃO SE APLICA","OBSERVAÇÕES",null,"ATENDE NBR9050-2020",null,"NÃO SE APLICA","OBSERVAÇÕES",null,"ATENDE NBR9050-2020",null,"NÃO SE APLICA","OBSERVAÇÕES",null,"ATENDE NBR9050-2020",null,"NÃO SE APLICA","OBSERVAÇÕES",null,"ATENDE NBR9050-2020",null,"NÃO SE APLICA","OBSERVAÇÕES",null,"ATENDE NBR9050-2020",null,"NÃO SE APLICA","OBSERVAÇÕES",null,"ATENDE NBR9050-2020",null,"NÃO SE APLICA","OBSERVAÇÕES",null,"ATENDE NBR9050-2020",null,"NÃO SE APLICA","OBSERVAÇÕES",null,"ATENDE NBR9050-2020",null,"NÃO SE APLICA","OBSERVAÇÕES",null,"ATENDE NBR9050-2020",null,"NÃO SE APLICA","OBSERVAÇÕES",null,"ATENDE NBR9050-2020",null,"NÃO SE APLICA","OBSERVAÇÕES",null,"ATENDE NBR9050-2020",null,"NÃO SE APLICA","OBSERVAÇÕES",null,"ATENDE NBR9050-2020",null,"NÃO SE APLICA","OBSERVAÇÕES",null,"ATENDE NBR9050-2020",null,"NÃO SE APLICA","OBSERVAÇÕES",null,"ATENDE NBR9050-2020",null,"NÃO SE APLICA","OBSERVAÇÕES",null,"ATENDE NBR9050-2020",null,"NÃO SE APLICA","OBSERVAÇÕES",null,"ATENDE NBR9050-2020",null,"NÃO SE APLICA","OBSERVAÇÕES",null,"ATENDE NBR9050-2020",null,"NÃO SE APLICA","OBSERVAÇÕES",null,"ATENDE NBR9050-2020",null,"NÃO SE APLICA","OBSERVAÇÕES"]
[null,null,"7.3 ASSENTOS FIXOS - ESPERA ATENDIMENTO",null,"SIM","NÃO",null,null,null,"SIM","NÃO",null,null,null,"SIM","NÃO",null,null,null,"SIM","NÃO",null,null,null,"SIM","NÃO",null,null,null,"SIM","NÃO",null,null,null,"SIM","NÃO",null,null,null,"SIM","NÃO",null,null,null,"SIM","NÃO",null,null,null,"SIM","NÃO",null,null,null,"SIM","NÃO",null,null,null,"SIM","NÃO",null,null,null,"SIM","NÃO",null,null,null,"SIM","NÃO",null,null,null,"SIM","NÃO",null,null,null,"SIM","NÃO",null,null,null,"SIM","NÃO",null,null,null,"SIM","NÃO",null,null,null,"SIM","NÃO",null,null,null,"SIM","NÃO",null,null,null,"SIM","NÃO",null,null,null,"SIM","NÃO",null,null,null,"SIM","NÃO",null,null,null,"SIM","NÃO",null,null,null,"SIM","NÃO"]
["8.9.3 e\n6.1","a)","Existe espaço (M.R.) ao lado dos assentos fixos em rotas acessíveis, sem interferir com a faixa livre de circulação e sinalização horizontal com o Símbolo Internacional de Acesso (SIA) medindo 0,80 x 1,20 m?",null,null,null,"X",null,null,null,null,"X",null,null,null,null,"X",null,null,null,null,"X"]
["5.3.5.1 e\nDecreto nº 5.296/04","b)","Existe assento de uso preferencial sinalizado com o Símbolo Internacional de Acesso e com as Figuras 38 a 42 da NBR 9050:2020?",null,null,null,"X",null,null,null,null,"X",null,null,null,null,"X",null,null,null,null,"X"]
["10.19.3","c)","Existe assento para pessoa obesa (5%, com no mínimo um)?",null,null,null,"X",null,null,null,null,"X",null,null,null,null,"X",null,null,null,null,"X"]
["10.19.3","d)","Existe espaços (sinalizados) para P.C.R. (5%, com no mínimo um)?",null,null,null,"X",null,null,null,null,"X",null,null,null,null,"X",null,null,null,null,"X"]
["4.7.1","d)","O assento para pessoa obesa possui largura mínima de 0,75 m, profundidade entre 0,47 m e 0,51 m e altura do assento entre 0,41 m e 0,45 m e suporta carga de 250 Kg?",null,null,null,"X",null,null,null,null,"X",null,null,null,null,"X",null,null,null,null,"X",null,null,null,null,null,null,null,null,null,null,null,null,null,null,null,null,null,null,null,null,null,null,null,null,null,null,null,null,null,null,null,null,null,null,null,null,null,null,null,null,null,null,null,null,null,null,null,null,null,null,null,null,null,null,null,null,null,null,null,{"$f":"IF(CC13=\"X\",\"X\",\"\")","v":""},null,null,null,null,{"$f":"IF(CH13=\"X\",\"X\",\"\")","v":""},null,null,null,null,{"$f":"IF(CM13=\"X\",\"X\",\"\")","v":""},null,null,null,null,{"$f":"IF(CR13=\"X\",\"X\",\"\")","v":""},null,null,null,null,{"$f":"IF(CW13=\"X\",\"X\",\"\")","v":""},null,null,null,null,{"$f":"IF(DB13=\"X\",\"X\",\"\")","v":""},null,null,null,null,{"$f":"IF(DG13=\"X\",\"X\",\"\")","v":""},null,null,null,null,{"$f":"IF(DL13=\"X\",\"X\",\"\")","v":""},null,null,null,null,{"$f":"IF(DQ13=\"X\",\"X\",\"\")","v":""},null,null,null,null,{"$f":"IF(DV13=\"X\",\"X\",\"\")","v":""}]
["6.1","e)","No espaço de circulação, há livre passagem sem interrupções por mobiliário, vaso de planta etc.?",null,null,null,"X",null,null,null,null,"X",null,null,null,null,"X",null,null,null,null,"X",null,null,null,null,null,null,null,null,null,null,null,null,null,null,null,null,null,null,null,null,null,null,null,null,null,null,null,null,null,null,null,null,null,null,null,null,null,null,null,null,null,null,null,null,null,null,null,null,null,null,null,null,null,null,null,null,null,null,null,{"$f":"IF(CC13=\"X\",\"X\",\"\")","v":""},null,null,null,null,{"$f":"IF(CH13=\"X\",\"X\",\"\")","v":""},null,null,null,null,{"$f":"IF(CM13=\"X\",\"X\",\"\")","v":""},null,null,null,null,{"$f":"IF(CR13=\"X\",\"X\",\"\")","v":""},null,null,null,null,{"$f":"IF(CW13=\"X\",\"X\",\"\")","v":""},null,null,null,null,{"$f":"IF(DB13=\"X\",\"X\",\"\")","v":""},null,null,null,null,{"$f":"IF(DG13=\"X\",\"X\",\"\")","v":""},null,null,null,null,{"$f":"IF(DL13=\"X\",\"X\",\"\")","v":""},null,null,null,null,{"$f":"IF(DQ13=\"X\",\"X\",\"\")","v":""},null,null,null,null,{"$f":"IF(DV13=\"X\",\"X\",\"\")","v":""}]
[]
[]
[null,null,null,null,"SIM","NÃO","JUSTIFICATIVA",null,null,"SIM","NÃO","JUSTIFICATIVA",null,null,"SIM","NÃO","JUSTIFICATIVA",null,null,"SIM","NÃO","JUSTIFICATIVA",null,null,"SIM","NÃO","JUSTIFICATIVA",null,null,"SIM","NÃO","JUSTIFICATIVA",null,null,"SIM","NÃO","JUSTIFICATIVA",null,null,"SIM","NÃO","JUSTIFICATIVA",null,null,"SIM","NÃO","JUSTIFICATIVA",null,null,"SIM","NÃO","JUSTIFICATIVA",null,null,"SIM","NÃO","JUSTIFICATIVA",null,null,"SIM","NÃO","JUSTIFICATIVA",null,null,"SIM","NÃO","JUSTIFICATIVA",null,null,"SIM","NÃO","JUSTIFICATIVA",null,null,"SIM","NÃO","JUSTIFICATIVA",null,null,"SIM","NÃO","JUSTIFICATIVA",null,null,"SIM","NÃO","JUSTIFICATIVA",null,null,"SIM","NÃO","JUSTIFICATIVA",null,null,"SIM","NÃO","JUSTIFICATIVA",null,null,"SIM","NÃO","JUSTIFICATIVA",null,null,"SIM","NÃO","JUSTIFICATIVA",null,null,"SIM","NÃO","JUSTIFICATIVA",null,null,"SIM","NÃO","JUSTIFICATIVA",null,null,"SIM","NÃO","JUSTIFICATIVA",null,null,"SIM","NÃO","JUSTIFICATIVA"]
[null,null,"NECESSITA PROJETO ?",null,null,"X",null,null,null,null,"X",null,null,null,null,"X",null,null,null,null,"X"]

{"sheet":"7.4_Telefones","index":13,"n_rows":18,"n_cols":128,"rows_kept":18,"cut":false,"hidden":false,"merged":[[17,106,17,107],[17,111,17,112],[17,116,17,117],[17,121,17,122],[17,126,17,127],[17,81,17,82],[17,86,17,87],[17,91,17,92],[17,96,17,97],[17,101,17,102],[16,106,16,107],[16,111,16,112],[16,116,16,117],[16,121,16,122],[16,126,16,127],[16,81,16,82],[16,86,16,87],[16,91,16,92],[16,96,16,97],[16,101,16,102],[8,121,9,121],[8,122,9,122],[8,124,8,125],[8,126,9,126],[8,127,9,127],[8,112,9,112],[8,114,8,115],[8,116,9,116],[8,117,9,117],[8,119,8,120],[8,104,8,105],[8,106,9,106],[8,107,9,107],[8,109,8,110],[8,111,9,111],[8,96,9,96],[8,97,9,97],[8,99,8,100],[8,101,9,101],[8,102,9,102],[8,87,9,87],[8,89,8,90],[8,91,9,91],[8,92,9,92],[8,94,8,95],[8,79,8,80],[8,81,9,81],[8,82,9,82],[8,84,8,85],[8,86,9,86],[6,104,6,107],[6,109,6,112],[6,114,6,117],[6,119,6,122],[6,124,6,127],[6,79,6,82],[6,84,6,87],[6,89,6,92],[6,94,6,97],[6,99,6,102],[16,6,16,7],[16,11,16,12],[16,16,16,17],[17,6,17,7],[17,11,17,12],[17,16,17,17],[6,14,6,17],[8,17,9,17],[8,12,9,12],[8,7,9,7],[8,11,9,11],[8,14,8,15],[8,16,9,16],[0,0,0,2],[2,0,2,3],[8,4,8,5],[8,6,9,6],[8,9,8,10],[8,0,9,0],[6,4,6,7],[6,9,6,12],[6,19,6,22],[8,19,8,20],[8,21,9,21],[8,22,9,22],[17,21,17,22],[17,26,17,27],[17,31,17,32],[6,34,6,37],[6,39,6,42],[6,44,6,47],[16,36,16,37],[16,41,16,42],[16,46,16,47],[6,24,6,27],[6,29,6,32],[8,24,8,25],[8,26,9,26],[8,27,9,27],[8,29,8,30],[8,31,9,31],[8,32,9,32],[16,21,16,22],[16,26,16,27],[16,31,16,32],[6,49,6,52],[6,54,6,57],[6,59,6,62],[8,34,8,35],[8,36,9,36],[8,37,9,37],[8,39,8,40],[8,41,9,41],[8,42,9,42],[8,44,8,45],[8,46,9,46],[8,47,9,47],[8,49,8,50],[8,51,9,51],[8,52,9,52],[8,54,8,55],[8,56,9,56],[8,57,9,57],[8,59,8,60],[8,61,9,61],[8,62,9,62],[16,51,16,52],[16,56,16,57],[16,61,16,62],[16,66,16,67],[16,71,16,72],[16,76,16,77],[17,36,17,37],[17,41,17,42],[17,46,17,47],[17,51,17,52],[17,56,17,57],[17,66,17,67],[17,71,17,72],[17,76,17,77],[17,61,17,62],[6,64,6,67],[6,69,6,72],[6,74,6,77],[8,64,8,65],[8,66,9,66],[8,67,9,67],[8,69,8,70],[8,71,9,71],[8,72,9,72],[8,74,8,75],[8,76,9,76],[8,77,9,77]]}
[{"$f":"'1_Informações e outros'!C1","v":"Ministério da Mulher, da Família e dos Direitos Humanos\nSecretaria Nacional dos Direitos da Pessoa com Deficiência"}]
[]
["LAUDO / CHECK LIST DE ACESSIBILIDADE PARA AVALIAÇÃO DE CONFORMIDADE ÀS NORMAS DE ACESSIBILIDADE (CONFORME NBR 9050:2020) "]
[]
["UNIDADE / ÓRGÃO",null,{"$f":"'1_Informações e outros'!E5","v":"MINISTÉRIO DA MULHER, DA FAMÍLIA E DOS DIREITOS HUMANOS"}]
[]
[{"$f":"'1_Informações e outros'!M5","v":4},null,null,null,{"$f":"'4.1_Circul'!E7","v":"8º PAVTO"},null,null,null,null,{"$f":"'4.1_Circul'!J7","v":"9º PAVTO"},null,null,null,null,{"$f":"'4.1_Circul'!O7","v":"10º PAVTO"},null,null,null,null,{"$f":"'4.1_Circul'!T7","v":"TÉRREO"},null,null,null,null,{"$f":"'4.1_Circul'!Y7","v":"5º PAVTO"},null,null,null,null,{"$f":"'4.1_Circul'!AD7","v":"6º PAVTO"},null,null,null,null,{"$f":"'4.1_Circul'!AI7","v":"7º PAVTO"},null,null,null,null,{"$f":"'4.1_Circul'!AN7","v":"8º PAVTO"},null,null,null,null,{"$f":"'4.1_Circul'!AS7","v":"9º PAVTO"},null,null,null,null,{"$f":"'4.1_Circul'!AX7","v":"10º PAVTO"},null,null,null,null,{"$f":"'4.1_Circul'!BC7","v":"11º PAVTO"},null,null,null,null,{"$f":"'4.1_Circul'!BH7","v":"12º PAVTO"},null,null,null,null,{"$f":"'4.1_Circul'!BM7","v":"13º PAVTO"},null,null,null,null,{"$f":"'4.1_Circul'!BR7","v":"14º PAVTO"},null,null,null,null,{"$f":"'4.1_Circul'!BW7","v":"15º PAVTO"},null,null,null,null,{"$f":"'4.1_Circul'!CB7","v":"16º PAVTO"},null,null,null,null,{"$f":"'4.1_Circul'!CG7","v":"17º PAVTO"},null,null,null,null,{"$f":"'4.1_Circul'!CL7","v":"18º PAVTO"},null,null,null,null,{"$f":"'4.1_Circul'!CQ7","v":"19º PAVTO"},null,null,null,null,{"$f":"'4.1_Circul'!CV7","v":"20º PAVTO"},null,null,null,null,{"$f":"'4.1_Circul'!DA7","v":"21º PAVTO"},null,null,null,null,{"$f":"'4.1_Circul'!DF7","v":"22º PAVTO"},null,null,null,null,{"$f":"'4.1_Circul'!DK7","v":"23º PAVTO"},null,null,null,null,{"$f":"'4.1_Circul'!DP7","v":"24º PAVTO"},null,null,null,null,{"$f":"'4.1_Circul'!DU7","v":"25º PAVTO"}]
[]
["Item da NBR9050",null,"07. MOBILIÁRIO",null,"ATENDE NBR9050-2020",null,"NÃO SE APLICA","OBSERVAÇÕES",null,"ATENDE NBR9050-2020",null,"NÃO SE APLICA","OBSERVAÇÕES",null,"ATENDE NBR9050-2020",null,"NÃO SE APLICA","OBSERVAÇÕES",null,"ATENDE NBR9050-2020",null,"NÃO SE APLICA","OBSERVAÇÕES",null,"ATENDE NBR9050-2020",null,"NÃO SE APLICA","OBSERVAÇÕES",null,"ATENDE NBR9050-2020",null,"NÃO SE APLICA","OBSERVAÇÕES",null,"ATENDE NBR9050-2020",null,"NÃO SE APLICA","OBSERVAÇÕES",null,"ATENDE NBR9050-2020",null,"NÃO SE APLICA","OBSERVAÇÕES",null,"ATENDE NBR9050-2020",null,"NÃO SE APLICA","OBSERVAÇÕES",null,"ATENDE NBR9050-2020",null,"NÃO SE APLICA","OBSERVAÇÕES",null,"ATENDE NBR9050-2020",null,"NÃO SE APLICA","OBSERVAÇÕES",null,"ATENDE NBR9050-2020",null,"NÃO SE APLICA","OBSERVAÇÕES",null,"ATENDE NBR9050-2020",null,"NÃO SE APLICA","OBSERVAÇÕES",null,"ATENDE NBR9050-2020",null,"NÃO SE APLICA","OBSERVAÇÕES",null,"ATENDE NBR9050-2020",null,"NÃO SE APLICA","OBSERVAÇÕES",null,"ATENDE NBR9050-2020",null,"NÃO SE APLICA","OBSERVAÇÕES",null,"ATENDE NBR9050-2020",null,"NÃO SE APLICA","OBSERVAÇÕES",null,"ATENDE NBR9050-2020",null,"NÃO SE APLICA","OBSERVAÇÕES",null,"ATENDE NBR9050-2020",null,"NÃO SE APLICA","OBSERVAÇÕES",null,"ATENDE NBR9050-2020",null,"NÃO SE APLICA","OBSERVAÇÕES",null,"ATENDE NBR9050-2020",null,"NÃO SE APLICA","OBSERVAÇÕES",null,"ATENDE NBR9050-2020",null,"NÃO SE APLICA","OBSERVAÇÕES",null,"ATENDE NBR9050-2020",null,"NÃO SE APLICA","OBSERVAÇÕES",null,"ATENDE NBR9050-2020",null,"NÃO SE APLICA","OBSERVAÇÕES",null,"ATENDE NBR9050-2020",null,"NÃO SE APLICA","OBSERVAÇÕES"]
[null,null,"7.4 TELEFONES PÚBLICOS",null,"SIM","NÃO",null,null,null,"SIM","NÃO",null,null,null,"SIM","NÃO",null,null,null,"SIM","NÃO",null,null,null,"SIM","NÃO",null,null,null,"SIM","NÃO",null,null,null,"SIM","NÃO",null,null,null,"SIM","NÃO",null,null,null,"SIM","NÃO",null,null,null,"SIM","NÃO",null,null,null,"SIM","NÃO",null,null,null,"SIM","NÃO",null,null,null,"SIM","NÃO",null,null,null,"SIM","NÃO",null,null,null,"SIM","NÃO",null,null,null,"SIM","NÃO",null,null,null,"SIM","NÃO",null,null,null,"SIM","NÃO",null,null,null,"SIM","NÃO",null,null,null,"SIM","NÃO",null,null,null,"SIM","NÃO",null,null,null,"SIM","NÃO",null,null,null,"SIM","NÃO",null,null,null,"SIM","NÃO",null,null,null,"SIM","NÃO"]
[null,"a)","Existe telefone público?",null,null,null,"X",null,null,null,null,"X",null,null,null,null,"X",null,null,"X"]
["8.1","b)","Caso existam telefones públicos, pelo menos um permite o acesso de pessoas em cadeiras de rodas?",null,null,null,"X",null,null,null,null,"X",null,null,null,null,"X",null,null,null,"X",{"$f":"IF(OR(U$11=\"X\",V$11=\"X\"),\"X\",\"\")","v":""},"Altura do telefone é de 1,30m do piso, sendo superior ao máximo permitido pela NBR9050:2020 que permite a altura de no máximo 1.20m do piso.",null,null,null,{"$f":"IF(OR(Z$11=\"X\",AA$11=\"X\"),\"X\",\"\")","v":""},null,null,null,null,{"$f":"IF(OR(AE$11=\"X\",AF$11=\"X\"),\"X\",\"\")","v":""},null,null,null,null,{"$f":"IF(OR(AJ$11=\"X\",AK$11=\"X\"),\"X\",\"\")","v":""},null,null,null,null,{"$f":"IF(OR(AO$11=\"X\",AP$11=\"X\"),\"X\",\"\")","v":""},null,null,null,null,{"$f":"IF(OR(AT$11=\"X\",AU$11=\"X\"),\"X\",\"\")","v":""},null,null,null,null,{"$f":"IF(OR(AY$11=\"X\",AZ$11=\"X\"),\"X\",\"\")","v":""},null,null,null,null,{"$f":"IF(OR(BD$11=\"X\",BE$11=\"X\"),\"X\",\"\")","v":""},null,null,null,null,{"$f":"IF(OR(BI$11=\"X\",BJ$11=\"X\"),\"X\",\"\")","v":""},null,null,null,null,{"$f":"IF(OR(BN$11=\"X\",BO$11=\"X\"),\"X\",\"\")","v":""},null,null,null,null,{"$f":"IF(OR(BS$11=\"X\",BT$11=\"X\"),\"X\",\"\")","v":""},null,null,null,null,{"$f":"IF(OR(BX$11=\"X\",BY$11=\"X\"),\"X\",\"\")","v":""},null,null,null,null,{"$f":"IF(OR(CC$11=\"X\",CD$11=\"X\"),\"X\",\"\")","v":""},null,null,null,null,{"$f":"IF(OR(CH$11=\"X\",CI$11=\"X\"),\"X\",\"\")","v":""},null,null,null,null,{"$f":"IF(OR(CM$11=\"X\",CN$11=\"X\"),\"X\",\"\")","v":""},null,null,null,null,{"$f":"IF(OR(CR$11=\"X\",CS$11=\"X\"),\"X\",\"\")","v":""},null,null,null,null,{"$f":"IF(OR(CW$11=\"X\",CX$11=\"X\"),\"X\",\"\")","v":""},null,null,null,null,{"$f":"IF(OR(DB$11=\"X\",DC$11=\"X\"),\"X\",\"\")","v":""},null,null,null,null,{"$f":"IF(OR(DG$11=\"X\",DH$11=\"X\"),\"X\",\"\")","v":""},null,null,null,null,{"$f":"IF(OR(DL$11=\"X\",DM$11=\"X\"),\"X\",\"\")","v":""},null,null,null,null,{"$f":"IF(OR(DQ$11=\"X\",DR$11=\"X\"),\"X\",\"\")","v":""},null,null,null,null,{"$f":"IF(OR(DV$11=\"X\",DW$11=\"X\"),\"X\",\"\")","v":""}]
["8.1","c)","O telefone que permite o acesso de pessoas em cadeiras de rodas possui sinalização?",null,null,null,"X",null,null,null,null,"X",null,null,null,null,"X",null,null,null,"X",{"$f":"IF(OR(U$11=\"X\",V$11=\"X\"),\"X\",\"\")","v":""},"Aplicar a sinalização. ",null,null,null,{"$f":"IF(OR(Z$11=\"X\",AA$11=\"X\"),\"X\",\"\")","v":""},null,null,null,null,{"$f":"IF(OR(AE$11=\"X\",AF$11=\"X\"),\"X\",\"\")","v":""},null,null,null,null,{"$f":"IF(OR(AJ$11=\"X\",AK$11=\"X\"),\"X\",\"\")","v":""},null,null,null,null,{"$f":"IF(OR(AO$11=\"X\",AP$11=\"X\"),\"X\",\"\")","v":""},null,null,null,null,{"$f":"IF(OR(AT$11=\"X\",AU$11=\"X\"),\"X\",\"\")","v":""},null,null,null,null,{"$f":"IF(OR(AY$11=\"X\",AZ$11=\"X\"),\"X\",\"\")","v":""},null,null,null,null,{"$f":"IF(OR(BD$11=\"X\",BE$11=\"X\"),\"X\",\"\")","v":""},null,null,null,null,{"$f":"IF(OR(BI$11=\"X\",BJ$11=\"X\"),\"X\",\"\")","v":""},null,null,null,null,{"$f":"IF(OR(BN$11=\"X\",BO$11=\"X\"),\"X\",\"\")","v":""},null,null,null,null,{"$f":"IF(OR(BS$11=\"X\",BT$11=\"X\"),\"X\",\"\")","v":""},null,null,null,null,{"$f":"IF(OR(BX$11=\"X\",BY$11=\"X\"),\"X\",\"\")","v":""},null,null,null,null,{"$f":"IF(OR(CC$11=\"X\",CD$11=\"X\"),\"X\",\"\")","v":""},null,null,null,null,{"$f":"IF(OR(CH$11=\"X\",CI$11=\"X\"),\"X\",\"\")","v":""},null,null,null,null,{"$f":"IF(OR(CM$11=\"X\",CN$11=\"X\"),\"X\",\"\")","v":""},null,null,null,null,{"$f":"IF(OR(CR$11=\"X\",CS$11=\"X\"),\"X\",\"\")","v":""},null,null,null,null,{"$f":"IF(OR(CW$11=\"X\",CX$11=\"X\"),\"X\",\"\")","v":""},null,null,null,null,{"$f":"IF(OR(DB$11=\"X\",DC$11=\"X\"),\"X\",\"\")","v":""},null,null,null,null,{"$f":"IF(OR(DG$11=\"X\",DH$11=\"X\"),\"X\",\"\")","v":""},null,null,null,null,{"$f":"IF(OR(DL$11=\"X\",DM$11=\"X\"),\"X\",\"\")","v":""},null,null,null,null,{"$f":"IF(OR(DQ$11=\"X\",DR$11=\"X\"),\"X\",\"\")","v":""},null,null,null,null,{"$f":"IF(OR(DV$11=\"X\",DW$11=\"X\"),\"X\",\"\")","v":""}]
["8.3.2","d)","Em edificações de grande porte e equipamentos urbanos, pelo menos um dos telefones possui transmissão de mensagens de texto (TDD) ou tecnologia similar, instalado a uma altura entre 0,75 m e 0,80 m do piso acabado?",null,null,null,"X",null,null,null,null,"X",null,null,null,null,"X",null,null,"X",null,"",null,null,null,null,"",null,null,null,null,"",null,null,null,null,"",null,null,null,null,"",null,null,null,null,"",null,null,null,null,"",null,null,null,null,"",null,null,null,null,"",null,null,null,null,"",null,null,null,null,"",null,null,null,null,"",null,null,null,null,"",null,null,null,null,"",null,null,null,null,"",null,null,null,null,"",null,null,null,null,"",null,null,null,null,"",null,null,null,null,"",null,null,null,null,"",null,null,null,null,"",null,null,null,null,""]
["8.3.2","e)","O telefone com amplificador de sinais ou com texto possui sinalização?",null,null,null,"X",null,null,null,null,"X",null,null,null,null,"X",null,null,null,"X","","Aplicar a sinalização. ",null,null,null,"",null,null,null,null,"",null,null,null,null,"",null,null,null,null,"",null,null,null,null,"",null,null,null,null,"",null,null,null,null,"",null,null,null,null,"",null,null,null,null,"",null,null,null,null,"",null,null,null,null,"",null,null,null,null,"",null,null,null,null,"",null,null,null,null,"",null,null,null,null,"",null,null,null,null,"",null,null,null,null,"",null,null,null,null,"",null,null,null,null,"",null,null,null,null,"",null,null,null,null,""]
[]
[null,null,null,null,"SIM","NÃO","JUSTIFICATIVA",null,null,"SIM","NÃO","JUSTIFICATIVA",null,null,"SIM","NÃO","JUSTIFICATIVA",null,null,"SIM","NÃO","JUSTIFICATIVA",null,null,"SIM","NÃO","JUSTIFICATIVA",null,null,"SIM","NÃO","JUSTIFICATIVA",null,null,"SIM","NÃO","JUSTIFICATIVA",null,null,"SIM","NÃO","JUSTIFICATIVA",null,null,"SIM","NÃO","JUSTIFICATIVA",null,null,"SIM","NÃO","JUSTIFICATIVA",null,null,"SIM","NÃO","JUSTIFICATIVA",null,null,"SIM","NÃO","JUSTIFICATIVA",null,null,"SIM","NÃO","JUSTIFICATIVA",null,null,"SIM","NÃO","JUSTIFICATIVA",null,null,"SIM","NÃO","JUSTIFICATIVA",null,null,"SIM","NÃO","JUSTIFICATIVA",null,null,"SIM","NÃO","JUSTIFICATIVA",null,null,"SIM","NÃO","JUSTIFICATIVA",null,null,"SIM","NÃO","JUSTIFICATIVA",null,null,"SIM","NÃO","JUSTIFICATIVA",null,null,"SIM","NÃO","JUSTIFICATIVA",null,null,"SIM","NÃO","JUSTIFICATIVA",null,null,"SIM","NÃO","JUSTIFICATIVA",null,null,"SIM","NÃO","JUSTIFICATIVA",null,null,"SIM","NÃO","JUSTIFICATIVA"]
[null,null,"NECESSITA PROJETO ?",null,null,"X",null,null,null,null,"X",null,null,null,null,"X",null,null,null,null,"X","Deve ser ajustadas altura do telefone para altura de no máximo 1.20m em relação ao piso acabado deixando altura livre inferior de até 0,73m, e devidamente sinalizado com o símbolo de acesso por pessoas em cadeira de rodas e o símbolo internacional de pessoas com deficiência auditiva."]

{"sheet":"7.5_Interiores","index":14,"n_rows":16,"n_cols":128,"rows_kept":16,"cut":false,"hidden":false,"merged":[[15,106,15,107],[15,111,15,112],[15,116,15,117],[15,121,15,122],[15,126,15,127],[15,81,15,82],[15,86,15,87],[15,91,15,92],[15,96,15,97],[15,101,15,102],[14,106,14,107],[14,111,14,112],[14,116,14,117],[14,121,14,122],[14,126,14,127],[14,81,14,82],[14,86,14,87],[14,91,14,92],[14,96,14,97],[14,101,14,102],[8,121,9,121],[8,122,9,122],[8,124,8,125],[8,126,9,126],[8,127,9,127],[8,112,9,112],[8,114,8,115],[8,116,9,116],[8,117,9,117],[8,119,8,120],[8,104,8,105],[8,106,9,106],[8,107,9,107],[8,109,8,110],[8,111,9,111],[8,96,9,96],[8,97,9,97],[8,99,8,100],[8,101,9,101],[8,102,9,102],[8,87,9,87],[8,89,8,90],[8,91,9,91],[8,92,9,92],[8,94,8,95],[8,79,8,80],[8,81,9,81],[8,82,9,82],[8,84,8,85],[8,86,9,86],[6,104,6,107],[6,109,6,112],[6,114,6,117],[6,119,6,122],[6,124,6,127],[6,79,6,82],[6,84,6,87],[6,89,6,92],[6,94,6,97],[6,99,6,102],[14,6,14,7],[14,11,14,12],[14,16,14,17],[15,6,15,7],[15,11,15,12],[15,16,15,17],[6,14,6,17],[8,17,9,17],[8,12,9,12],[8,7,9,7],[8,11,9,11],[8,14,8,15],[8,16,9,16],[0,0,0,2],[2,0,2,3],[8,4,8,5],[8,6,9,6],[8,9,8,10],[8,0,9,0],[6,4,6,7],[6,9,6,12],[6,19,6,22],[8,19,8,20],[8,21,9,21],[8,22,9,22],[15,21,15,22],[15,26,15,27],[15,31,15,32],[6,34,6,37],[6,39,6,42],[6,44,6,47],[14,36,14,37],[14,41,14,42],[14,46,14,47],[6,24,6,27],[6,29,6,32],[8,24,8,25],[8,26,9,26],[8,27,9,27],[8,29,8,30],[8,31,9,31],[8,32,9,32],[14,21,14,22],[14,26,14,27],[14,31,14,32],[6,49,6,52],[6,54,6,57],[6,59,6,62],[8,34,8,35],[8,36,9,36],[8,37,9,37],[8,39,8,40],[8,41,9,41],[8,42,9,42],[8,44,8,45],[8,46,9,46],[8,47,9,47],[8,49,8,50],[8,51,9,51],[8,52,9,52],[8,54,8,55],[8,56,9,56],[8,57,9,57],[8,59,8,60],[8,61,9,61],[8,62,9,62],[14,51,14,52],[14,56,14,57],[14,61,14,62],[14,66,14,67],[14,71,14,72],[14,76,14,77],[15,36,15,37],[15,41,15,42],[15,46,15,47],[15,51,15,52],[15,56,15,57],[15,66,15,67],[15,71,15,72],[15,76,15,77],[15,61,15,62],[6,64,6,67],[6,69,6,72],[6,74,6,77],[8,64,8,65],[8,66,9,66],[8,67,9,67],[8,69,8,70],[8,71,9,71],[8,72,9,72],[8,74,8,75],[8,76,9,76],[8,77,9,77]]}
[{"$f":"'1_Informações e outros'!C1","v":"Ministério da Mulher, da Família e dos Direitos Humanos\nSecretaria Nacional dos Direitos da Pessoa com Deficiência"}]
[]
["LAUDO / CHECK LIST DE ACESSIBILIDADE PARA AVALIAÇÃO DE CONFORMIDADE ÀS NORMAS DE ACESSIBILIDADE (CONFORME NBR 9050:2020) "]
[]
["UNIDADE / ÓRGÃO",null,{"$f":"'1_Informações e outros'!E5","v":"MINISTÉRIO DA MULHER, DA FAMÍLIA E DOS DIREITOS HUMANOS"}]
[]
[{"$f":"'1_Informações e outros'!M5","v":4},null,null,null,{"$f":"'4.1_Circul'!E7","v":"8º PAVTO"},null,null,null,null,{"$f":"'4.1_Circul'!J7","v":"9º PAVTO"},null,null,null,null,{"$f":"'4.1_Circul'!O7","v":"10º PAVTO"},null,null,null,null,{"$f":"'4.1_Circul'!T7","v":"TÉRREO"},null,null,null,null,{"$f":"'4.1_Circul'!Y7","v":"5º PAVTO"},null,null,null,null,{"$f":"'4.1_Circul'!AD7","v":"6º PAVTO"},null,null,null,null,{"$f":"'4.1_Circul'!AI7","v":"7º PAVTO"},null,null,null,null,{"$f":"'4.1_Circul'!AN7","v":"8º PAVTO"},null,null,null,null,{"$f":"'4.1_Circul'!AS7","v":"9º PAVTO"},null,null,null,null,{"$f":"'4.1_Circul'!AX7","v":"10º PAVTO"},null,null,null,null,{"$f":"'4.1_Circul'!BC7","v":"11º PAVTO"},null,null,null,null,{"$f":"'4.1_Circul'!BH7","v":"12º PAVTO"},null,null,null,null,{"$f":"'4.1_Circul'!BM7","v":"13º PAVTO"},null,null,null,null,{"$f":"'4.1_Circul'!BR7","v":"14º PAVTO"},null,null,null,null,{"$f":"'4.1_Circul'!BW7","v":"15º PAVTO"},null,null,null,null,{"$f":"'4.1_Circul'!CB7","v":"16º PAVTO"},null,null,null,null,{"$f":"'4.1_Circul'!CG7","v":"17º PAVTO"},null,null,null,null,{"$f":"'4.1_Circul'!CL7","v":"18º PAVTO"},null,null,null,null,{"$f":"'4.1_Circul'!CQ7","v":"19º PAVTO"},null,null,null,null,{"$f":"'4.1_Circul'!CV7","v":"20º PAVTO"},null,null,null,null,{"$f":"'4.1_Circul'!DA7","v":"21º PAVTO"},null,null,null,null,{"$f":"'4.1_Circul'!DF7","v":"22º PAVTO"},null,null,null,null,{"$f":"'4.1_Circul'!DK7","v":"23º PAVTO"},null,null,null,null,{"$f":"'4.1_Circul'!DP7","v":"24º PAVTO"},null,null,null,null,{"$f":"'4.1_Circul'!DU7","v":"25º PAVTO"}]
[]
["Item da NBR9050",null,"07. MOBILIÁRIO",null,"ATENDE NBR9050-2020",null,"NÃO SE APLICA","OBSERVAÇÕES",null,"ATENDE NBR9050-2020",null,"NÃO SE APLICA","OBSERVAÇÕES",null,"ATENDE NBR9050-2020",null,"NÃO SE APLICA","OBSERVAÇÕES",null,"ATENDE NBR9050-2020",null,"NÃO SE APLICA","OBSERVAÇÕES",null,"ATENDE NBR9050-2020",null,"NÃO SE APLICA","OBSERVAÇÕES",null,"ATENDE NBR9050-2020",null,"NÃO SE APLICA","OBSERVAÇÕES",null,"ATENDE NBR9050-2020",null,"NÃO SE APLICA","OBSERVAÇÕES",null,"ATENDE NBR9050-2020",null,"NÃO SE APLICA","OBSERVAÇÕES",null,"ATENDE NBR9050-2020",null,"NÃO SE APLICA","OBSERVAÇÕES",null,"ATENDE NBR9050-2020",null,"NÃO SE APLICA","OBSERVAÇÕES",null,"ATENDE NBR9050-2020",null,"NÃO SE APLICA","OBSERVAÇÕES",null,"ATENDE NBR9050-2020",null,"NÃO SE APLICA","OBSERVAÇÕES",null,"ATENDE NBR9050-2020",null,"NÃO SE APLICA","OBSERVAÇÕES",null,"ATENDE NBR9050-2020",null,"NÃO SE APLICA","OBSERVAÇÕES",null,"ATENDE NBR9050-2020",null,"NÃO SE APLICA","OBSERVAÇÕES",null,"ATENDE NBR9050-2020",null,"NÃO SE APLICA","OBSERVAÇÕES",null,"ATENDE NBR9050-2020",null,"NÃO SE APLICA","OBSERVAÇÕES",null,"ATENDE NBR9050-2020",null,"NÃO SE APLICA","OBSERVAÇÕES",null,"ATENDE NBR9050-2020",null,"NÃO SE APLICA","OBSERVAÇÕES",null,"ATENDE NBR9050-2020",null,"NÃO SE APLICA","OBSERVAÇÕES",null,"ATENDE NBR9050-2020",null,"NÃO SE APLICA","OBSERVAÇÕES",null,"ATENDE NBR9050-2020",null,"NÃO SE APLICA","OBSERVAÇÕES",null,"ATENDE NBR9050-2020",null,"NÃO SE APLICA","OBSERVAÇÕES",null,"ATENDE NBR9050-2020",null,"NÃO SE APLICA","OBSERVAÇÕES",null,"ATENDE NBR9050-2020",null,"NÃO SE APLICA","OBSERVAÇÕES"]
[null,null,"7.5 INTERIOR DAS SALAS",null,"SIM","NÃO",null,null,null,"SIM","NÃO",null,null,null,"SIM","NÃO",null,null,null,"SIM","NÃO",null,null,null,"SIM","NÃO",null,null,null,"SIM","NÃO",null,null,null,"SIM","NÃO",null,null,null,"SIM","NÃO",null,null,null,"SIM","NÃO",null,null,null,"SIM","NÃO",null,null,null,"SIM","NÃO",null,null,null,"SIM","NÃO",null,null,null,"SIM","NÃO",null,null,null,"SIM","NÃO",null,null,null,"SIM","NÃO",null,null,null,"SIM","NÃO",null,null,null,"SIM","NÃO",null,null,null,"SIM","NÃO",null,null,null,"SIM","NÃO",null,null,null,"SIM","NÃO",null,null,null,"SIM","NÃO",null,null,null,"SIM","NÃO",null,null,null,"SIM","NÃO",null,null,null,"SIM","NÃO",null,null,null,"SIM","NÃO"]
["4.3","a)","A circulação entre os móveis ou passagens internas é no mínimo de 0,90 m e possui áreas de giro para retorno?",null,null,"X",null,"Em diversas salas o layout e disposição do mobiliário compromete a livre circulação, em alguns casos mantendo somente 0,50m de passagem. Os locais de circulação que estão com cadeiras giratórias voltadas para as mesas de trabalho devem ter maior atenção quando em uso, porque impossibilita a livre circulação deixando a passagem abaixo do mínimo necessário. Salas 836 - Coord-geral das pessoas com doenças raras - CGPDRE e coord-geral da comissão interministerial de avaliação - CGCIA, 836A - Gabinete da coordenação geral das pessoas com doenças raras - CGPDR, 836B - Coord-geral da comissão interministerial de avaliação – CGCIA, 832A - Gabinete da coordenação geral do conselho nacional dos direitos da pessoa com deficiência - CONADE, 832B - Gabinete da presidência, 826A - Assessoria - DPTDPD, 800 - Secretaria nacional dos direitos da pessoa com deficiência - SNDPD, 816 - Sala de copias e impressões, 818c - Gabinete do departamento de gestão e relações interinstitucionais - DGRI, 812B - Assessoria - SNDPD, Copa, 823 - Depart. de promoção e fortalecimento dos direitos da criança e do adolescente - DEPFDCA e Depart. de enfrentamento de violações aos direitos da criança e do adolescente - DEEVSCA, 823A - Coordenação-geral de assuntos socioeducativos - CGAS, 823A1 - Coordenação geral de defesa e do direito da criança e do adolescente - CGDDCA, 823B - Diretoria do depart. de enfretamento de violações aos direitos da criança e do adolescente - DEEVDCA, 823D - Sala de reunião, 823E - Diretoria do depart. de promoção e fortalecimento dos direitos da criança e do adolescente - DEPFDCA, 823F - Gabinete da coordenação-geral de fortalecimento de garantias de direitos - CGFGD,  813 - Coordenação geral de políticas temáticas - CGPTDCA/Chefe de gabinete - SNDCA, 803 - Secretaria nacional dos direitos da criança e do adolescente - SNDCA, 803c1 - Coordenação de gestão - SNDCA  e as sala 803c, 803c2 - Assessoria - SNDCA.",null,null,"X",null,"Em diversas salas o layout e disposição do mobiliário compromete a livre circulação, em alguns casos mantendo o espaço livre de passagem muito abaixo de 0,900m exigidos em norma. Os locais de circulação que estão com cadeiras giratórias voltadas para as mesas de trabalho devem ter maior atenção quando em uso, porque impossibilita a livre circulação deixando a passagem abaixo do mínimo necessário. Salas que devem ser repensadas a disposição do mobiliário: 901C - Coordenação-geral do conselho nacional dos direitos do idoso - CNDI, 926A - Acessória técnica e administrativa - MNPCT, 926B - Perícia, 926C - Perícia, 926D - Perícia, 926E - Coordenação-geral do mecanismo nacional de prevenção e combate a tortura - MNPCT, 926F - Sala de reunião - MNPCT, 923 - Departamento de promoção e educação em direitos humanos - DEPEDH, 923 - Depart. de promoção dos direitos de lésbicas, gays, bissexuais, travestis e transexuais – DELGBT, e nesta sala possuem três salas sem identificação que não possuem espaço de giro para retorno por uma pessoa em cadeira de rodas. 900C - Chefe de gabinete e assessoria - SNPG, 939E – Gabinete da coordenação-geral de combate a tortura e a violência institucional - CGCT, 939B – Diretoria do departamento de proteção e defesa dos direitos humanos – DEPDDH, 939C – Gabinete da coordenação-geral de proteção a testemunha e aos defensores de direitos humanos – CGPTDDH, 939D – Gabinete da coordenação-geral de combate ao trabalho escravo -CGCTE.",null,null,"X",null,"Em diversas salas o layout e disposição do mobiliário compromete a livre circulação, em alguns casos mantendo o espaço livre de passagem muito abaixo de 0,90m exigidos em norma. Os locais de circulação que estão com cadeiras giratórias voltadas para as mesas de trabalho devem ter maior atenção quando em uso, porque impossibilita a livre circulação deixando a passagem abaixo do mínimo necessário. Salas que devem ser repensadas a disposição do mobiliário: 1029A - Gabinete da coordenação-geral de elaboração de estudos e diagnósticos - CGLAD, 1029C - Diretoria do departamento de monitoramento de políticas étnico-racial -DIMOPE, 1036 – Coordenação de logistica – COLOG, 1026 - Coordenação de contratos e gestão de atas - CCGA, 1003C - Secretaria nacional de políticas de promoção da igualdade racial - SNPIR, e duas salas sem identificação na 1003C, 1000D - Coordenação geral de contabilidade e transferências - CGCONT, 1032 - Coordenação gestão documental e eventos - COGEDE, 1016 - Coordenação-geralde gestão de pessoas – CGGP e a copa.",null,null,null,"X"]
["9.3.1.3","b)","As mesas possuem largura mínima de 0,90 m e altura da superfície de trabalho entre 0,75 m e 0,85 m?",null,"X",null,null,null,null,"X",null,null,null,null,"X",null,null," ",null,null,null,"X"]
["9.3.1.4","c)","As mesas permitem aproximação frontal da cadeira de rodas, com uma altura livre mínima de 0,73 m embaixo da superfície de trabalho, garantindo largura mínima de 0,80 m e profundidade mínima de 0,50 m?",null,"X",null,null,null,null,"X",null,null,null,null,"X",null,null,null,null,null,null,"X"]
[]
[null,null,null,null,"SIM","NÃO","JUSTIFICATIVA",null,null,"SIM","NÃO","JUSTIFICATIVA",null,null,"SIM","NÃO","JUSTIFICATIVA",null,null,"SIM","NÃO","JUSTIFICATIVA",null,null,"SIM","NÃO","JUSTIFICATIVA",null,null,"SIM","NÃO","JUSTIFICATIVA",null,null,"SIM","NÃO","JUSTIFICATIVA",null,null,"SIM","NÃO","JUSTIFICATIVA",null,null,"SIM","NÃO","JUSTIFICATIVA",null,null,"SIM","NÃO","JUSTIFICATIVA",null,null,"SIM","NÃO","JUSTIFICATIVA",null,null,"SIM","NÃO","JUSTIFICATIVA",null,null,"SIM","NÃO","JUSTIFICATIVA",null,null,"SIM","NÃO","JUSTIFICATIVA",null,null,"SIM","NÃO","JUSTIFICATIVA",null,null,"SIM","NÃO","JUSTIFICATIVA",null,null,"SIM","NÃO","JUSTIFICATIVA",null,null,"SIM","NÃO","JUSTIFICATIVA",null,null,"SIM","NÃO","JUSTIFICATIVA",null,null,"SIM","NÃO","JUSTIFICATIVA",null,null,"SIM","NÃO","JUSTIFICATIVA",null,null,"SIM","NÃO","JUSTIFICATIVA",null,null,"SIM","NÃO","JUSTIFICATIVA",null,null,"SIM","NÃO","JUSTIFICATIVA",null,null,"SIM","NÃO","JUSTIFICATIVA"]
[null,null,"NECESSITA PROJETO ?",null,null,"X","Deve-se locar as estações de trabalho, objetos de decoração, bancos e armários de forma que respeite a passagem mínima de 0,90m e as condições de manobras das cadeiras de rodas com deslocamento é sem deslocamento nas passagens internas das salas, circulações e corredores.",null,null,null,"X","Deve-se locar as estações de trabalho, objetos de decoração, bancos e armários de forma que respeite a passagem mínima de 0,90m e as condições de manobras das cadeiras de rodas com deslocamento é sem deslocamento nas passagens internas das salas, circulações e corredores.",null,null,null,"X","Deve-se locar as estações de trabalho, objetos de decoração, bancos e armários de forma que respeite a passagem mínima de 0,90m e as condições de manobras das cadeiras de rodas com deslocamento é sem deslocamento nas passagens internas das salas, circulações e corredores.",null,null,null,"X"]

{"sheet":"8_Vestiários","index":15,"n_rows":39,"n_cols":128,"rows_kept":39,"cut":false,"hidden":false,"merged":[[38,106,38,107],[38,111,38,112],[38,116,38,117],[38,121,38,122],[38,126,38,127],[38,81,38,82],[38,86,38,87],[38,91,38,92],[38,96,38,97],[38,101,38,102],[37,106,37,107],[37,111,37,112],[37,116,37,117],[37,121,37,122],[37,126,37,127],[37,81,37,82],[37,86,37,87],[37,91,37,92],[37,96,37,97],[37,101,37,102],[8,121,9,121],[8,122,9,122],[8,124,8,125],[8,126,9,126],[8,127,9,127],[8,112,9,112],[8,114,8,115],[8,116,9,116],[8,117,9,117],[8,119,8,120],[8,104,8,105],[8,106,9,106],[8,107,9,107],[8,109,8,110],[8,111,9,111],[8,96,9,96],[8,97,9,97],[8,99,8,100],[8,101,9,101],[8,102,9,102],[8,87,9,87],[8,89,8,90],[8,91,9,91],[8,92,9,92],[8,94,8,95],[8,79,8,80],[8,81,9,81],[8,82,9,82],[8,84,8,85],[8,86,9,86],[6,104,6,107],[6,109,6,112],[6,114,6,117],[6,119,6,122],[6,124,6,127],[6,79,6,82],[6,84,6,87],[6,89,6,92],[6,94,6,97],[6,99,6,102],[37,6,37,7],[37,11,37,12],[37,16,37,17],[38,6,38,7],[38,11,38,12],[38,16,38,17],[8,0,9,0],[8,2,9,2],[8,17,9,17],[8,12,9,12],[8,7,9,7],[8,4,8,5],[8,6,9,6],[8,9,8,10],[8,11,9,11],[8,14,8,15],[8,16,9,16],[0,0,0,2],[2,0,2,3],[6,4,6,7],[6,9,6,12],[6,14,6,17],[6,19,6,22],[6,24,6,27],[6,29,6,32],[8,19,8,20],[8,21,9,21],[8,22,9,22],[8,24,8,25],[8,26,9,26],[8,27,9,27],[8,29,8,30],[8,31,9,31],[8,32,9,32],[37,21,37,22],[37,26,37,27],[37,31,37,32],[38,21,38,22],[38,26,38,27],[38,31,38,32],[6,34,6,37],[6,39,6,42],[6,44,6,47],[37,36,37,37],[37,41,37,42],[37,46,37,47],[6,49,6,52],[6,54,6,57],[6,59,6,62],[8,34,8,35],[8,36,9,36],[8,37,9,37],[8,39,8,40],[8,41,9,41],[8,42,9,42],[8,44,8,45],[8,46,9,46],[8,47,9,47],[8,49,8,50],[8,51,9,51],[8,52,9,52],[8,54,8,55],[8,56,9,56],[8,57,9,57],[8,59,8,60],[8,61,9,61],[8,62,9,62],[37,51,37,52],[37,56,37,57],[37,61,37,62],[37,66,37,67],[37,71,37,72],[37,76,37,77],[38,36,38,37],[38,41,38,42],[38,46,38,47],[38,51,38,52],[38,56,38,57],[38,66,38,67],[38,71,38,72],[38,76,38,77],[38,61,38,62],[6,64,6,67],[6,69,6,72],[6,74,6,77],[8,64,8,65],[8,66,9,66],[8,67,9,67],[8,69,8,70],[8,71,9,71],[8,72,9,72],[8,74,8,75],[8,76,9,76],[8,77,9,77]]}
[{"$f":"'1_Informações e outros'!C1","v":"Ministério da Mulher, da Família e dos Direitos Humanos\nSecretaria Nacional dos Direitos da Pessoa com Deficiência"}]
[]
["LAUDO / CHECK LIST DE ACESSIBILIDADE PARA AVALIAÇÃO DE CONFORMIDADE ÀS NORMAS DE ACESSIBILIDADE (CONFORME NBR 9050:2020) "]
[]
["UNIDADE / ÓRGÃO",null,{"$f":"'1_Informações e outros'!E5","v":"MINISTÉRIO DA MULHER, DA FAMÍLIA E DOS DIREITOS HUMANOS"}]
[]
[{"$f":"'1_Informações e outros'!M5","v":4},null,null,null,{"$f":"'4.1_Circul'!E7","v":"8º PAVTO"},null,null,null,null,{"$f":"'4.1_Circul'!J7","v":"9º PAVTO"},null,null,null,null,{"$f":"'4.1_Circul'!O7","v":"10º PAVTO"},null,null,null,null,{"$f":"'4.1_Circul'!T7","v":"TÉRREO"},null,null,null,null,{"$f":"'4.1_Circul'!Y7","v":"5º PAVTO"},null,null,null,null,{"$f":"'4.1_Circul'!AD7","v":"6º PAVTO"},null,null,null,null,{"$f":"'4.1_Circul'!AI7","v":"7º PAVTO"},null,null,null,null,{"$f":"'4.1_Circul'!AN7","v":"8º PAVTO"},null,null,null,null,{"$f":"'4.1_Circul'!AS7","v":"9º PAVTO"},null,null,null,null,{"$f":"'4.1_Circul'!AX7","v":"10º PAVTO"},null,null,null,null,{"$f":"'4.1_Circul'!BC7","v":"11º PAVTO"},null,null,null,null,{"$f":"'4.1_Circul'!BH7","v":"12º PAVTO"},null,null,null,null,{"$f":"'4.1_Circul'!BM7","v":"13º PAVTO"},null,null,null,null,{"$f":"'4.1_Circul'!BR7","v":"14º PAVTO"},null,null,null,null,{"$f":"'4.1_Circul'!BW7","v":"15º PAVTO"},null,null,null,null,{"$f":"'4.1_Circul'!CB7","v":"16º PAVTO"},null,null,null,null,{"$f":"'4.1_Circul'!CG7","v":"17º PAVTO"},null,null,null,null,{"$f":"'4.1_Circul'!CL7","v":"18º PAVTO"},null,null,null,null,{"$f":"'4.1_Circul'!CQ7","v":"19º PAVTO"},null,null,null,null,{"$f":"'4.1_Circul'!CV7","v":"20º PAVTO"},null,null,null,null,{"$f":"'4.1_Circul'!DA7","v":"21º PAVTO"},null,null,null,null,{"$f":"'4.1_Circul'!DF7","v":"22º PAVTO"},null,null,null,null,{"$f":"'4.1_Circul'!DK7","v":"23º PAVTO"},null,null,null,null,{"$f":"'4.1_Circul'!DP7","v":"24º PAVTO"},null,null,null,null,{"$f":"'4.1_Circul'!DU7","v":"25º PAVTO"}]
[]
["Item da NBR9050",null,"8. VESTIÁRIOS",null,"ATENDE NBR9050-2020",null,"NÃO SE APLICA","OBSERVAÇÕES",null,"ATENDE NBR9050-2020",null,"NÃO SE APLICA","OBSERVAÇÕES",null,"ATENDE NBR9050-2020",null,"NÃO SE APLICA","OBSERVAÇÕES",null,"ATENDE NBR9050-2020",null,"NÃO SE APLICA","OBSERVAÇÕES",null,"ATENDE NBR9050-2020",null,"NÃO SE APLICA","OBSERVAÇÕES",null,"ATENDE NBR9050-2020",null,"NÃO SE APLICA","OBSERVAÇÕES",null,"ATENDE NBR9050-2020",null,"NÃO SE APLICA","OBSERVAÇÕES",null,"ATENDE NBR9050-2020",null,"NÃO SE APLICA","OBSERVAÇÕES",null,"ATENDE NBR9050-2020",null,"NÃO SE APLICA","OBSERVAÇÕES",null,"ATENDE NBR9050-2020",null,"NÃO SE APLICA","OBSERVAÇÕES",null,"ATENDE NBR9050-2020",null,"NÃO SE APLICA","OBSERVAÇÕES",null,"ATENDE NBR9050-2020",null,"NÃO SE APLICA","OBSERVAÇÕES",null,"ATENDE NBR9050-2020",null,"NÃO SE APLICA","OBSERVAÇÕES",null,"ATENDE NBR9050-2020",null,"NÃO SE APLICA","OBSERVAÇÕES",null,"ATENDE NBR9050-2020",null,"NÃO SE APLICA","OBSERVAÇÕES",null,"ATENDE NBR9050-2020",null,"NÃO SE APLICA","OBSERVAÇÕES",null,"ATENDE NBR9050-2020",null,"NÃO SE APLICA","OBSERVAÇÕES",null,"ATENDE NBR9050-2020",null,"NÃO SE APLICA","OBSERVAÇÕES",null,"ATENDE NBR9050-2020",null,"NÃO SE APLICA","OBSERVAÇÕES",null,"ATENDE NBR9050-2020",null,"NÃO SE APLICA","OBSERVAÇÕES",null,"ATENDE NBR9050-2020",null,"NÃO SE APLICA","OBSERVAÇÕES",null,"ATENDE NBR9050-2020",null,"NÃO SE APLICA","OBSERVAÇÕES",null,"ATENDE NBR9050-2020",null,"NÃO SE APLICA","OBSERVAÇÕES",null,"ATENDE NBR9050-2020",null,"NÃO SE APLICA","OBSERVAÇÕES",null,"ATENDE NBR9050-2020",null,"NÃO SE APLICA","OBSERVAÇÕES"]
[null,null,null,null,"SIM","NÃO",null,null,null,"SIM","NÃO",null,null,null,"SIM","NÃO",null,null,null,"SIM","NÃO",null,null,null,"SIM","NÃO",null,null,null,"SIM","NÃO",null,null,null,"SIM","NÃO",null,null,null,"SIM","NÃO",null,null,null,"SIM","NÃO",null,null,null,"SIM","NÃO",null,null,null,"SIM","NÃO",null,null,null,"SIM","NÃO",null,null,null,"SIM","NÃO",null,null,null,"SIM","NÃO",null,null,null,"SIM","NÃO",null,null,null,"SIM","NÃO",null,null,null,"SIM","NÃO",null,null,null,"SIM","NÃO",null,null,null,"SIM","NÃO",null,null,null,"SIM","NÃO",null,null,null,"SIM","NÃO",null,null,null,"SIM","NÃO",null,null,null,"SIM","NÃO",null,null,null,"SIM","NÃO",null,null,null,"SIM","NÃO"]
[null,"a)","Existe vestiário?",null,null,null,"X",null,null,null,null,"X",null,null,null,null,"X",null,null,null,null,"X"]
["6.11.2.4","b)","A porta possui um vão livre de 0,80 m?",null,null,null,{"$f":"IF(OR(F11=\"X\",G11=\"X\"),\"X\",\"\")","v":"X"},null,null,null,null,{"$f":"IF(OR(K11=\"X\",L11=\"X\"),\"X\",\"\")","v":"X"},null,null,null,null,{"$f":"IF(OR(P11=\"X\",Q11=\"X\"),\"X\",\"\")","v":"X"},null,null,null,null,{"$f":"IF(OR(U11=\"X\",V11=\"X\"),\"X\",\"\")","v":"X"},null,null,null,null,{"$f":"IF(OR(Z11=\"X\",AA11=\"X\"),\"X\",\"\")","v":""},null,null,null,null,{"$f":"IF(OR(AE11=\"X\",AF11=\"X\"),\"X\",\"\")","v":""},null,null,null,null,{"$f":"IF(OR(AJ11=\"X\",AK11=\"X\"),\"X\",\"\")","v":""},null,null,null,null,{"$f":"IF(OR(AO11=\"X\",AP11=\"X\"),\"X\",\"\")","v":""},null,null,null,null,{"$f":"IF(OR(AT11=\"X\",AU11=\"X\"),\"X\",\"\")","v":""},null,null,null,null,{"$f":"IF(OR(AY11=\"X\",AZ11=\"X\"),\"X\",\"\")","v":""},null,null,null,null,{"$f":"IF(OR(BD11=\"X\",BE11=\"X\"),\"X\",\"\")","v":""},null,null,null,null,{"$f":"IF(OR(BI11=\"X\",BJ11=\"X\"),\"X\",\"\")","v":""},null,null,null,null,{"$f":"IF(OR(BN11=\"X\",BO11=\"X\"),\"X\",\"\")","v":""},null,null,null,null,{"$f":"IF(OR(BS11=\"X\",BT11=\"X\"),\"X\",\"\")","v":""},null,null,null,null,{"$f":"IF(OR(BX11=\"X\",BY11=\"X\"),\"X\",\"\")","v":""},null,null,null,null,{"$f":"IF(OR(CC11=\"X\",CD11=\"X\"),\"X\",\"\")","v":""},null,null,null,null,{"$f":"IF(OR(CH11=\"X\",CI11=\"X\"),\"X\",\"\")","v":""},null,null,null,null,{"$f":"IF(OR(CM11=\"X\",CN11=\"X\"),\"X\",\"\")","v":""},null,null,null,null,{"$f":"IF(OR(CR11=\"X\",CS11=\"X\"),\"X\",\"\")","v":""},null,null,null,null,{"$f":"IF(OR(CW11=\"X\",CX11=\"X\"),\"X\",\"\")","v":""},null,null,null,null,{"$f":"IF(OR(DB11=\"X\",DC11=\"X\"),\"X\",\"\")","v":""},null,null,null,null,{"$f":"IF(OR(DG11=\"X\",DH11=\"X\"),\"X\",\"\")","v":""},null,null,null,null,{"$f":"IF(OR(DL11=\"X\",DM11=\"X\"),\"X\",\"\")","v":""},null,null,null,null,{"$f":"IF(OR(DQ11=\"X\",DR11=\"X\"),\"X\",\"\")","v":""},null,null,null,null,{"$f":"IF(OR(DV11=\"X\",DW11=\"X\"),\"X\",\"\")","v":""}]
["6.11.2.7 / 7.11.5\n4.6.6.3","c)","A porta possui puxador horizontal, com diâmetro entre 25 mm a 35 mm, com comprimento mínimo de 0,40 m, afixado na parte interna da porta, afastado 0,10 m do batente (do lado da dobradiça) e instalado na altura da maçaneta conforme Figura 86? Na inexistência de maçaneta, o puxador horizontal está instalado a uma altura entre 0,80 m a 1,10 m medidos do eixo do puxador ao piso acabado?",null,null,null,{"$f":"IF(OR(F11=\"X\",G11=\"X\"),\"X\",\"\")","v":"X"},null,null,null,null,{"$f":"IF(OR(K11=\"X\",L11=\"X\"),\"X\",\"\")","v":"X"},null,null,null,null,{"$f":"IF(OR(P11=\"X\",Q11=\"X\"),\"X\",\"\")","v":"X"},null,null,null,null,{"$f":"IF(OR(U11=\"X\",V11=\"X\"),\"X\",\"\")","v":"X"},null,null,null,null,{"$f":"IF(OR(Z11=\"X\",AA11=\"X\"),\"X\",\"\")","v":""},null,null,null,null,{"$f":"IF(OR(AE11=\"X\",AF11=\"X\"),\"X\",\"\")","v":""},null,null,null,null,{"$f":"IF(OR(AJ11=\"X\",AK11=\"X\"),\"X\",\"\")","v":""},null,null,null,null,{"$f":"IF(OR(AO11=\"X\",AP11=\"X\"),\"X\",\"\")","v":""},null,null,null,null,{"$f":"IF(OR(AT11=\"X\",AU11=\"X\"),\"X\",\"\")","v":""},null,null,null,null,{"$f":"IF(OR(AY11=\"X\",AZ11=\"X\"),\"X\",\"\")","v":""},null,null,null,null,{"$f":"IF(OR(BD11=\"X\",BE11=\"X\"),\"X\",\"\")","v":""},null,null,null,null,{"$f":"IF(OR(BI11=\"X\",BJ11=\"X\"),\"X\",\"\")","v":""},null,null,null,null,{"$f":"IF(OR(BN11=\"X\",BO11=\"X\"),\"X\",\"\")","v":""},null,null,null,null,{"$f":"IF(OR(BS11=\"X\",BT11=\"X\"),\"X\",\"\")","v":""},null,null,null,null,{"$f":"IF(OR(BX11=\"X\",BY11=\"X\"),\"X\",\"\")","v":""},null,null,null,null,{"$f":"IF(OR(CC11=\"X\",CD11=\"X\"),\"X\",\"\")","v":""},null,null,null,null,{"$f":"IF(OR(CH11=\"X\",CI11=\"X\"),\"X\",\"\")","v":""},null,null,null,null,{"$f":"IF(OR(CM11=\"X\",CN11=\"X\"),\"X\",\"\")","v":""},null,null,null,null,{"$f":"IF(OR(CR11=\"X\",CS11=\"X\"),\"X\",\"\")","v":""},null,null,null,null,{"$f":"IF(OR(CW11=\"X\",CX11=\"X\"),\"X\",\"\")","v":""},null,null,null,null,{"$f":"IF(OR(DB11=\"X\",DC11=\"X\"),\"X\",\"\")","v":""},null,null,null,null,{"$f":"IF(OR(DG11=\"X\",DH11=\"X\"),\"X\",\"\")","v":""},null,null,null,null,{"$f":"IF(OR(DL11=\"X\",DM11=\"X\"),\"X\",\"\")","v":""},null,null,null,null,{"$f":"IF(OR(DQ11=\"X\",DR11=\"X\"),\"X\",\"\")","v":""},null,null,null,null,{"$f":"IF(OR(DV11=\"X\",DW11=\"X\"),\"X\",\"\")","v":""}]
["4.6.6.1","d)","A maçaneta é do tipo alavanca, com pelo menos 100 mm de comprimento e acabamento sem arestas e recurvado na extremidade, apresentando uma distância mínima de 40 mm da superfície da porta e instalada a uma altura entre 0,80 m e 1,10 m do piso acabado?",null,null,null,{"$f":"IF(OR(F11=\"X\",G11=\"X\"),\"X\",\"\")","v":"X"},null,null,null,null,{"$f":"IF(OR(K11=\"X\",L11=\"X\"),\"X\",\"\")","v":"X"},null,null,null,null,{"$f":"IF(OR(P11=\"X\",Q11=\"X\"),\"X\",\"\")","v":"X"},null,null,null,null,{"$f":"IF(OR(U11=\"X\",V11=\"X\"),\"X\",\"\")","v":"X"},null,null,null,null,{"$f":"IF(OR(Z11=\"X\",AA11=\"X\"),\"X\",\"\")","v":""},null,null,null,null,{"$f":"IF(OR(AE11=\"X\",AF11=\"X\"),\"X\",\"\")","v":""},null,null,null,null,{"$f":"IF(OR(AJ11=\"X\",AK11=\"X\"),\"X\",\"\")","v":""},null,null,null,null,{"$f":"IF(OR(AO11=\"X\",AP11=\"X\"),\"X\",\"\")","v":""},null,null,null,null,{"$f":"IF(OR(AT11=\"X\",AU11=\"X\"),\"X\",\"\")","v":""},null,null,null,null,{"$f":"IF(OR(AY11=\"X\",AZ11=\"X\"),\"X\",\"\")","v":""},null,null,null,null,{"$f":"IF(OR(BD11=\"X\",BE11=\"X\"),\"X\",\"\")","v":""},null,null,null,null,{"$f":"IF(OR(BI11=\"X\",BJ11=\"X\"),\"X\",\"\")","v":""},null,null,null,null,{"$f":"IF(OR(BN11=\"X\",BO11=\"X\"),\"X\",\"\")","v":""},null,null,null,null,{"$f":"IF(OR(BS11=\"X\",BT11=\"X\"),\"X\",\"\")","v":""},null,null,null,null,{"$f":"IF(OR(BX11=\"X\",BY11=\"X\"),\"X\",\"\")","v":""},null,null,null,null,{"$f":"IF(OR(CC11=\"X\",CD11=\"X\"),\"X\",\"\")","v":""},null,null,null,null,{"$f":"IF(OR(CH11=\"X\",CI11=\"X\"),\"X\",\"\")","v":""},null,null,null,null,{"$f":"IF(OR(CM11=\"X\",CN11=\"X\"),\"X\",\"\")","v":""},null,null,null,null,{"$f":"IF(OR(CR11=\"X\",CS11=\"X\"),\"X\",\"\")","v":""},null,null,null,null,{"$f":"IF(OR(CW11=\"X\",CX11=\"X\"),\"X\",\"\")","v":""},null,null,null,null,{"$f":"IF(OR(DB11=\"X\",DC11=\"X\"),\"X\",\"\")","v":""},null,null,null,null,{"$f":"IF(OR(DG11=\"X\",DH11=\"X\"),\"X\",\"\")","v":""},null,null,null,null,{"$f":"IF(OR(DL11=\"X\",DM11=\"X\"),\"X\",\"\")","v":""},null,null,null,null,{"$f":"IF(OR(DQ11=\"X\",DR11=\"X\"),\"X\",\"\")","v":""},null,null,null,null,{"$f":"IF(OR(DV11=\"X\",DW11=\"X\"),\"X\",\"\")","v":""}]
["5.4.1","e)","Possui sinalização visual no centro da porta ou na parede ao lado da maçaneta (altura entre 1,20 m e 1,60 m) no lado externo, informando o ambiente?",null,null,null,{"$f":"IF(OR(F11=\"X\",G11=\"X\"),\"X\",\"\")","v":"X"},null,null,null,null,{"$f":"IF(OR(K11=\"X\",L11=\"X\"),\"X\",\"\")","v":"X"},null,null,null,null,{"$f":"IF(OR(P11=\"X\",Q11=\"X\"),\"X\",\"\")","v":"X"},null,null,null,null,{"$f":"IF(OR(U11=\"X\",V11=\"X\"),\"X\",\"\")","v":"X"},null,null,null,null,{"$f":"IF(OR(Z11=\"X\",AA11=\"X\"),\"X\",\"\")","v":""},null,null,null,null,{"$f":"IF(OR(AE11=\"X\",AF11=\"X\"),\"X\",\"\")","v":""},null,null,null,null,{"$f":"IF(OR(AJ11=\"X\",AK11=\"X\"),\"X\",\"\")","v":""},null,null,null,null,{"$f":"IF(OR(AO11=\"X\",AP11=\"X\"),\"X\",\"\")","v":""},null,null,null,null,{"$f":"IF(OR(AT11=\"X\",AU11=\"X\"),\"X\",\"\")","v":""},null,null,null,null,{"$f":"IF(OR(AY11=\"X\",AZ11=\"X\"),\"X\",\"\")","v":""},null,null,null,null,{"$f":"IF(OR(BD11=\"X\",BE11=\"X\"),\"X\",\"\")","v":""},null,null,null,null,{"$f":"IF(OR(BI11=\"X\",BJ11=\"X\"),\"X\",\"\")","v":""},null,null,null,null,{"$f":"IF(OR(BN11=\"X\",BO11=\"X\"),\"X\",\"\")","v":""},null,null,null,null,{"$f":"IF(OR(BS11=\"X\",BT11=\"X\"),\"X\",\"\")","v":""},null,null,null,null,{"$f":"IF(OR(BX11=\"X\",BY11=\"X\"),\"X\",\"\")","v":""},null,null,null,null,{"$f":"IF(OR(CC11=\"X\",CD11=\"X\"),\"X\",\"\")","v":""},null,null,null,null,{"$f":"IF(OR(CH11=\"X\",CI11=\"X\"),\"X\",\"\")","v":""},null,null,null,null,{"$f":"IF(OR(CM11=\"X\",CN11=\"X\"),\"X\",\"\")","v":""},null,null,null,null,{"$f":"IF(OR(CR11=\"X\",CS11=\"X\"),\"X\",\"\")","v":""},null,null,null,null,{"$f":"IF(OR(CW11=\"X\",CX11=\"X\"),\"X\",\"\")","v":""},null,null,null,null,{"$f":"IF(OR(DB11=\"X\",DC11=\"X\"),\"X\",\"\")","v":""},null,null,null,null,{"$f":"IF(OR(DG11=\"X\",DH11=\"X\"),\"X\",\"\")","v":""},null,null,null,null,{"$f":"IF(OR(DL11=\"X\",DM11=\"X\"),\"X\",\"\")","v":""},null,null,null,null,{"$f":"IF(OR(DQ11=\"X\",DR11=\"X\"),\"X\",\"\")","v":""},null,null,null,null,{"$f":"IF(OR(DV11=\"X\",DW11=\"X\"),\"X\",\"\")","v":""}]
["5.4.1","f)","A sinalização visual está associada à sinalização tátil em relevo e Braille (instalada na parede adjacente ou no batente em altura entre 0,90 m e 1,20 m) ou sonora?",null,null,null,{"$f":"IF(OR(F11=\"X\",G11=\"X\"),\"X\",\"\")","v":"X"},null,null,null,null,{"$f":"IF(OR(K11=\"X\",L11=\"X\"),\"X\",\"\")","v":"X"},null,null,null,null,{"$f":"IF(OR(P11=\"X\",Q11=\"X\"),\"X\",\"\")","v":"X"},null,null,null,null,{"$f":"IF(OR(U11=\"X\",V11=\"X\"),\"X\",\"\")","v":"X"},null,null,null,null,{"$f":"IF(OR(Z11=\"X\",AA11=\"X\"),\"X\",\"\")","v":""},null,null,null,null,{"$f":"IF(OR(AE11=\"X\",AF11=\"X\"),\"X\",\"\")","v":""},null,null,null,null,{"$f":"IF(OR(AJ11=\"X\",AK11=\"X\"),\"X\",\"\")","v":""},null,null,null,null,{"$f":"IF(OR(AO11=\"X\",AP11=\"X\"),\"X\",\"\")","v":""},null,null,null,null,{"$f":"IF(OR(AT11=\"X\",AU11=\"X\"),\"X\",\"\")","v":""},null,null,null,null,{"$f":"IF(OR(AY11=\"X\",AZ11=\"X\"),\"X\",\"\")","v":""},null,null,null,null,{"$f":"IF(OR(BD11=\"X\",BE11=\"X\"),\"X\",\"\")","v":""},null,null,null,null,{"$f":"IF(OR(BI11=\"X\",BJ11=\"X\"),\"X\",\"\")","v":""},null,null,null,null,{"$f":"IF(OR(BN11=\"X\",BO11=\"X\"),\"X\",\"\")","v":""},null,null,null,null,{"$f":"IF(OR(BS11=\"X\",BT11=\"X\"),\"X\",\"\")","v":""},null,null,null,null,{"$f":"IF(OR(BX11=\"X\",BY11=\"X\"),\"X\",\"\")","v":""},null,null,null,null,{"$f":"IF(OR(CC11=\"X\",CD11=\"X\"),\"X\",\"\")","v":""},null,null,null,null,{"$f":"IF(OR(CH11=\"X\",CI11=\"X\"),\"X\",\"\")","v":""},null,null,null,null,{"$f":"IF(OR(CM11=\"X\",CN11=\"X\"),\"X\",\"\")","v":""},null,null,null,null,{"$f":"IF(OR(CR11=\"X\",CS11=\"X\"),\"X\",\"\")","v":""},null,null,null,null,{"$f":"IF(OR(CW11=\"X\",CX11=\"X\"),\"X\",\"\")","v":""},null,null,null,null,{"$f":"IF(OR(DB11=\"X\",DC11=\"X\"),\"X\",\"\")","v":""},null,null,null,null,{"$f":"IF(OR(DG11=\"X\",DH11=\"X\"),\"X\",\"\")","v":""},null,null,null,null,{"$f":"IF(OR(DL11=\"X\",DM11=\"X\"),\"X\",\"\")","v":""},null,null,null,null,{"$f":"IF(OR(DQ11=\"X\",DR11=\"X\"),\"X\",\"\")","v":""},null,null,null,null,{"$f":"IF(OR(DV11=\"X\",DW11=\"X\"),\"X\",\"\")","v":""}]
["6.3.4.1","g)","A entrada é sem desnível ou possui desnível entre 5 mm e 20 mm tratado conforme Figura 68?",null,null,null,{"$f":"IF(OR(F11=\"X\",G11=\"X\"),\"X\",\"\")","v":"X"},null,null,null,null,{"$f":"IF(OR(K11=\"X\",L11=\"X\"),\"X\",\"\")","v":"X"},null,null,null,null,{"$f":"IF(OR(P11=\"X\",Q11=\"X\"),\"X\",\"\")","v":"X"},null,null,null,null,{"$f":"IF(OR(U11=\"X\",V11=\"X\"),\"X\",\"\")","v":"X"},null,null,null,null,{"$f":"IF(OR(Z11=\"X\",AA11=\"X\"),\"X\",\"\")","v":""},null,null,null,null,{"$f":"IF(OR(AE11=\"X\",AF11=\"X\"),\"X\",\"\")","v":""},null,null,null,null,{"$f":"IF(OR(AJ11=\"X\",AK11=\"X\"),\"X\",\"\")","v":""},null,null,null,null,{"$f":"IF(OR(AO11=\"X\",AP11=\"X\"),\"X\",\"\")","v":""},null,null,null,null,{"$f":"IF(OR(AT11=\"X\",AU11=\"X\"),\"X\",\"\")","v":""},null,null,null,null,{"$f":"IF(OR(AY11=\"X\",AZ11=\"X\"),\"X\",\"\")","v":""},null,null,null,null,{"$f":"IF(OR(BD11=\"X\",BE11=\"X\"),\"X\",\"\")","v":""},null,null,null,null,{"$f":"IF(OR(BI11=\"X\",BJ11=\"X\"),\"X\",\"\")","v":""},null,null,null,null,{"$f":"IF(OR(BN11=\"X\",BO11=\"X\"),\"X\",\"\")","v":""},null,null,null,null,{"$f":"IF(OR(BS11=\"X\",BT11=\"X\"),\"X\",\"\")","v":""},null,null,null,null,{"$f":"IF(OR(BX11=\"X\",BY11=\"X\"),\"X\",\"\")","v":""},null,null,null,null,{"$f":"IF(OR(CC11=\"X\",CD11=\"X\"),\"X\",\"\")","v":""},null,null,null,null,{"$f":"IF(OR(CH11=\"X\",CI11=\"X\"),\"X\",\"\")","v":""},null,null,null,null,{"$f":"IF(OR(CM11=\"X\",CN11=\"X\"),\"X\",\"\")","v":""},null,null,null,null,{"$f":"IF(OR(CR11=\"X\",CS11=\"X\"),\"X\",\"\")","v":""},null,null,null,null,{"$f":"IF(OR(CW11=\"X\",CX11=\"X\"),\"X\",\"\")","v":""},null,null,null,null,{"$f":"IF(OR(DB11=\"X\",DC11=\"X\"),\"X\",\"\")","v":""},null,null,null,null,{"$f":"IF(OR(DG11=\"X\",DH11=\"X\"),\"X\",\"\")","v":""},null,null,null,null,{"$f":"IF(OR(DL11=\"X\",DM11=\"X\"),\"X\",\"\")","v":""},null,null,null,null,{"$f":"IF(OR(DQ11=\"X\",DR11=\"X\"),\"X\",\"\")","v":""},null,null,null,null,{"$f":"IF(OR(DV11=\"X\",DW11=\"X\"),\"X\",\"\")","v":""}]
["6.3.2","h)","O piso é antiderrapante?",null,null,null,{"$f":"IF(OR(F11=\"X\",G11=\"X\"),\"X\",\"\")","v":"X"},null,null,null,null,{"$f":"IF(OR(K11=\"X\",L11=\"X\"),\"X\",\"\")","v":"X"},null,null,null,null,{"$f":"IF(OR(P11=\"X\",Q11=\"X\"),\"X\",\"\")","v":"X"},null,null,null,null,{"$f":"IF(OR(U11=\"X\",V11=\"X\"),\"X\",\"\")","v":"X"},null,null,null,null,{"$f":"IF(OR(Z11=\"X\",AA11=\"X\"),\"X\",\"\")","v":""},null,null,null,null,{"$f":"IF(OR(AE11=\"X\",AF11=\"X\"),\"X\",\"\")","v":""},null,null,null,null,{"$f":"IF(OR(AJ11=\"X\",AK11=\"X\"),\"X\",\"\")","v":""},null,null,null,null,{"$f":"IF(OR(AO11=\"X\",AP11=\"X\"),\"X\",\"\")","v":""},null,null,null,null,{"$f":"IF(OR(AT11=\"X\",AU11=\"X\"),\"X\",\"\")","v":""},null,null,null,null,{"$f":"IF(OR(AY11=\"X\",AZ11=\"X\"),\"X\",\"\")","v":""},null,null,null,null,{"$f":"IF(OR(BD11=\"X\",BE11=\"X\"),\"X\",\"\")","v":""},null,null,null,null,{"$f":"IF(OR(BI11=\"X\",BJ11=\"X\"),\"X\",\"\")","v":""},null,null,null,null,{"$f":"IF(OR(BN11=\"X\",BO11=\"X\"),\"X\",\"\")","v":""},null,null,null,null,{"$f":"IF(OR(BS11=\"X\",BT11=\"X\"),\"X\",\"\")","v":""},null,null,null,null,{"$f":"IF(OR(BX11=\"X\",BY11=\"X\"),\"X\",\"\")","v":""},null,null,null,null,{"$f":"IF(OR(CC11=\"X\",CD11=\"X\"),\"X\",\"\")","v":""},null,null,null,null,{"$f":"IF(OR(CH11=\"X\",CI11=\"X\"),\"X\",\"\")","v":""},null,null,null,null,{"$f":"IF(OR(CM11=\"X\",CN11=\"X\"),\"X\",\"\")","v":""},null,null,null,null,{"$f":"IF(OR(CR11=\"X\",CS11=\"X\"),\"X\",\"\")","v":""},null,null,null,null,{"$f":"IF(OR(CW11=\"X\",CX11=\"X\"),\"X\",\"\")","v":""},null,null,null,null,{"$f":"IF(OR(DB11=\"X\",DC11=\"X\"),\"X\",\"\")","v":""},null,null,null,null,{"$f":"IF(OR(DG11=\"X\",DH11=\"X\"),\"X\",\"\")","v":""},null,null,null,null,{"$f":"IF(OR(DL11=\"X\",DM11=\"X\"),\"X\",\"\")","v":""},null,null,null,null,{"$f":"IF(OR(DQ11=\"X\",DR11=\"X\"),\"X\",\"\")","v":""},null,null,null,null,{"$f":"IF(OR(DV11=\"X\",DW11=\"X\"),\"X\",\"\")","v":""}]
["7.14.2","i)","Os bancos possuem encosto?",null,null,null,{"$f":"IF(OR(F11=\"X\",G11=\"X\"),\"X\",\"\")","v":"X"},null,null,null,null,{"$f":"IF(OR(K11=\"X\",L11=\"X\"),\"X\",\"\")","v":"X"},null,null,null,null,{"$f":"IF(OR(P11=\"X\",Q11=\"X\"),\"X\",\"\")","v":"X"},null,null,null,null,{"$f":"IF(OR(U11=\"X\",V11=\"X\"),\"X\",\"\")","v":"X"},null,null,null,null,{"$f":"IF(OR(Z11=\"X\",AA11=\"X\"),\"X\",\"\")","v":""},null,null,null,null,{"$f":"IF(OR(AE11=\"X\",AF11=\"X\"),\"X\",\"\")","v":""},null,null,null,null,{"$f":"IF(OR(AJ11=\"X\",AK11=\"X\"),\"X\",\"\")","v":""},null,null,null,null,{"$f":"IF(OR(AO11=\"X\",AP11=\"X\"),\"X\",\"\")","v":""},null,null,null,null,{"$f":"IF(OR(AT11=\"X\",AU11=\"X\"),\"X\",\"\")","v":""},null,null,null,null,{"$f":"IF(OR(AY11=\"X\",AZ11=\"X\"),\"X\",\"\")","v":""},null,null,null,null,{"$f":"IF(OR(BD11=\"X\",BE11=\"X\"),\"X\",\"\")","v":""},null,null,null,null,{"$f":"IF(OR(BI11=\"X\",BJ11=\"X\"),\"X\",\"\")","v":""},null,null,null,null,{"$f":"IF(OR(BN11=\"X\",BO11=\"X\"),\"X\",\"\")","v":""},null,null,null,null,{"$f":"IF(OR(BS11=\"X\",BT11=\"X\"),\"X\",\"\")","v":""},null,null,null,null,{"$f":"IF(OR(BX11=\"X\",BY11=\"X\"),\"X\",\"\")","v":""},null,null,null,null,{"$f":"IF(OR(CC11=\"X\",CD11=\"X\"),\"X\",\"\")","v":""},null,null,null,null,{"$f":"IF(OR(CH11=\"X\",CI11=\"X\"),\"X\",\"\")","v":""},null,null,null,null,{"$f":"IF(OR(CM11=\"X\",CN11=\"X\"),\"X\",\"\")","v":""},null,null,null,null,{"$f":"IF(OR(CR11=\"X\",CS11=\"X\"),\"X\",\"\")","v":""},null,null,null,null,{"$f":"IF(OR(CW11=\"X\",CX11=\"X\"),\"X\",\"\")","v":""},null,null,null,null,{"$f":"IF(OR(DB11=\"X\",DC11=\"X\"),\"X\",\"\")","v":""},null,null,null,null,{"$f":"IF(OR(DG11=\"X\",DH11=\"X\"),\"X\",\"\")","v":""},null,null,null,null,{"$f":"IF(OR(DL11=\"X\",DM11=\"X\"),\"X\",\"\")","v":""},null,null,null,null,{"$f":"IF(OR(DQ11=\"X\",DR11=\"X\"),\"X\",\"\")","v":""},null,null,null,null,{"$f":"IF(OR(DV11=\"X\",DW11=\"X\"),\"X\",\"\")","v":""}]
["7.14.2\nFigura 132","j)","Os bancos possuem profundidade mínima de 0,45 m, largura mínima de 0,70 m e altura de 0,46 m do piso, e possuem um espaço livre inferior com 0,30 m de profundidade, com área de transferência lateral com  dimensões mínimas de 0,80 x 1,20 m?",null,null,null,{"$f":"IF(OR(F11=\"X\",G11=\"X\"),\"X\",\"\")","v":"X"},null,null,null,null,{"$f":"IF(OR(K11=\"X\",L11=\"X\"),\"X\",\"\")","v":"X"},null,null,null,null,{"$f":"IF(OR(P11=\"X\",Q11=\"X\"),\"X\",\"\")","v":"X"},null,null,null,null,{"$f":"IF(OR(U11=\"X\",V11=\"X\"),\"X\",\"\")","v":"X"},null,null,null,null,{"$f":"IF(OR(Z11=\"X\",AA11=\"X\"),\"X\",\"\")","v":""},null,null,null,null,{"$f":"IF(OR(AE11=\"X\",AF11=\"X\"),\"X\",\"\")","v":""},null,null,null,null,{"$f":"IF(OR(AJ11=\"X\",AK11=\"X\"),\"X\",\"\")","v":""},null,null,null,null,{"$f":"IF(OR(AO11=\"X\",AP11=\"X\"),\"X\",\"\")","v":""},null,null,null,null,{"$f":"IF(OR(AT11=\"X\",AU11=\"X\"),\"X\",\"\")","v":""},null,null,null,null,{"$f":"IF(OR(AY11=\"X\",AZ11=\"X\"),\"X\",\"\")","v":""},null,null,null,null,{"$f":"IF(OR(BD11=\"X\",BE11=\"X\"),\"X\",\"\")","v":""},null,null,null,null,{"$f":"IF(OR(BI11=\"X\",BJ11=\"X\"),\"X\",\"\")","v":""},null,null,null,null,{"$f":"IF(OR(BN11=\"X\",BO11=\"X\"),\"X\",\"\")","v":""},null,null,null,null,{"$f":"IF(OR(BS11=\"X\",BT11=\"X\"),\"X\",\"\")","v":""},null,null,null,null,{"$f":"IF(OR(BX11=\"X\",BY11=\"X\"),\"X\",\"\")","v":""},null,null,null,null,{"$f":"IF(OR(CC11=\"X\",CD11=\"X\"),\"X\",\"\")","v":""},null,null,null,null,{"$f":"IF(OR(CH11=\"X\",CI11=\"X\"),\"X\",\"\")","v":""},null,null,null,null,{"$f":"IF(OR(CM11=\"X\",CN11=\"X\"),\"X\",\"\")","v":""},null,null,null,null,{"$f":"IF(OR(CR11=\"X\",CS11=\"X\"),\"X\",\"\")","v":""},null,null,null,null,{"$f":"IF(OR(CW11=\"X\",CX11=\"X\"),\"X\",\"\")","v":""},null,null,null,null,{"$f":"IF(OR(DB11=\"X\",DC11=\"X\"),\"X\",\"\")","v":""},null,null,null,null,{"$f":"IF(OR(DG11=\"X\",DH11=\"X\"),\"X\",\"\")","v":""},null,null,null,null,{"$f":"IF(OR(DL11=\"X\",DM11=\"X\"),\"X\",\"\")","v":""},null,null,null,null,{"$f":"IF(OR(DQ11=\"X\",DR11=\"X\"),\"X\",\"\")","v":""},null,null,null,null,{"$f":"IF(OR(DV11=\"X\",DW11=\"X\"),\"X\",\"\")","v":""}]
["7.14.3","k)","A altura de utilização dos armários está entre 0,40 m e 1,20 m do piso acabado?",null,null,null,{"$f":"IF(OR(F11=\"X\",G11=\"X\"),\"X\",\"\")","v":"X"},null,null,null,null,{"$f":"IF(OR(K11=\"X\",L11=\"X\"),\"X\",\"\")","v":"X"},null,null,null,null,{"$f":"IF(OR(P11=\"X\",Q11=\"X\"),\"X\",\"\")","v":"X"},null,null,null,null,{"$f":"IF(OR(U11=\"X\",V11=\"X\"),\"X\",\"\")","v":"X"},null,null,null,null,{"$f":"IF(OR(Z11=\"X\",AA11=\"X\"),\"X\",\"\")","v":""},null,null,null,null,{"$f":"IF(OR(AE11=\"X\",AF11=\"X\"),\"X\",\"\")","v":""},null,null,null,null,{"$f":"IF(OR(AJ11=\"X\",AK11=\"X\"),\"X\",\"\")","v":""},null,null,null,null,{"$f":"IF(OR(AO11=\"X\",AP11=\"X\"),\"X\",\"\")","v":""},null,null,null,null,{"$f":"IF(OR(AT11=\"X\",AU11=\"X\"),\"X\",\"\")","v":""},null,null,null,null,{"$f":"IF(OR(AY11=\"X\",AZ11=\"X\"),\"X\",\"\")","v":""},null,null,null,null,{"$f":"IF(OR(BD11=\"X\",BE11=\"X\"),\"X\",\"\")","v":""},null,null,null,null,{"$f":"IF(OR(BI11=\"X\",BJ11=\"X\"),\"X\",\"\")","v":""},null,null,null,null,{"$f":"IF(OR(BN11=\"X\",BO11=\"X\"),\"X\",\"\")","v":""},null,null,null,null,{"$f":"IF(OR(BS11=\"X\",BT11=\"X\"),\"X\",\"\")","v":""},null,null,null,null,{"$f":"IF(OR(BX11=\"X\",BY11=\"X\"),\"X\",\"\")","v":""},null,null,null,null,{"$f":"IF(OR(CC11=\"X\",CD11=\"X\"),\"X\",\"\")","v":""},null,null,null,null,{"$f":"IF(OR(CH11=\"X\",CI11=\"X\"),\"X\",\"\")","v":""},null,null,null,null,{"$f":"IF(OR(CM11=\"X\",CN11=\"X\"),\"X\",\"\")","v":""},null,null,null,null,{"$f":"IF(OR(CR11=\"X\",CS11=\"X\"),\"X\",\"\")","v":""},null,null,null,null,{"$f":"IF(OR(CW11=\"X\",CX11=\"X\"),\"X\",\"\")","v":""},null,null,null,null,{"$f":"IF(OR(DB11=\"X\",DC11=\"X\"),\"X\",\"\")","v":""},null,null,null,null,{"$f":"IF(OR(DG11=\"X\",DH11=\"X\"),\"X\",\"\")","v":""},null,null,null,null,{"$f":"IF(OR(DL11=\"X\",DM11=\"X\"),\"X\",\"\")","v":""},null,null,null,null,{"$f":"IF(OR(DQ11=\"X\",DR11=\"X\"),\"X\",\"\")","v":""},null,null,null,null,{"$f":"IF(OR(DV11=\"X\",DW11=\"X\"),\"X\",\"\")","v":""}]
["7.14.5","l)","Os cabides e porta-objetos estão instalados em altura entre 0,80 m e 1,20 m do piso acabado?",null,null,null,{"$f":"IF(OR(F11=\"X\",G11=\"X\"),\"X\",\"\")","v":"X"},null,null,null,null,{"$f":"IF(OR(K11=\"X\",L11=\"X\"),\"X\",\"\")","v":"X"},null,null,null,null,{"$f":"IF(OR(P11=\"X\",Q11=\"X\"),\"X\",\"\")","v":"X"},null,null,null,null,{"$f":"IF(OR(U11=\"X\",V11=\"X\"),\"X\",\"\")","v":"X"},null,null,null,null,{"$f":"IF(OR(Z11=\"X\",AA11=\"X\"),\"X\",\"\")","v":""},null,null,null,null,{"$f":"IF(OR(AE11=\"X\",AF11=\"X\"),\"X\",\"\")","v":""},null,null,null,null,{"$f":"IF(OR(AJ11=\"X\",AK11=\"X\"),\"X\",\"\")","v":""},null,null,null,null,{"$f":"IF(OR(AO11=\"X\",AP11=\"X\"),\"X\",\"\")","v":""},null,null,null,null,{"$f":"IF(OR(AT11=\"X\",AU11=\"X\"),\"X\",\"\")","v":""},null,null,null,null,{"$f":"IF(OR(AY11=\"X\",AZ11=\"X\"),\"X\",\"\")","v":""},null,null,null,null,{"$f":"IF(OR(BD11=\"X\",BE11=\"X\"),\"X\",\"\")","v":""},null,null,null,null,{"$f":"IF(OR(BI11=\"X\",BJ11=\"X\"),\"X\",\"\")","v":""},null,null,null,null,{"$f":"IF(OR(BN11=\"X\",BO11=\"X\"),\"X\",\"\")","v":""},null,null,null,null,{"$f":"IF(OR(BS11=\"X\",BT11=\"X\"),\"X\",\"\")","v":""},null,null,null,null,{"$f":"IF(OR(BX11=\"X\",BY11=\"X\"),\"X\",\"\")","v":""},null,null,null,null,{"$f":"IF(OR(CC11=\"X\",CD11=\"X\"),\"X\",\"\")","v":""},null,null,null,null,{"$f":"IF(OR(CH11=\"X\",CI11=\"X\"),\"X\",\"\")","v":""},null,null,null,null,{"$f":"IF(OR(CM11=\"X\",CN11=\"X\"),\"X\",\"\")","v":""},null,null,null,null,{"$f":"IF(OR(CR11=\"X\",CS11=\"X\"),\"X\",\"\")","v":""},null,null,null,null,{"$f":"IF(OR(CW11=\"X\",CX11=\"X\"),\"X\",\"\")","v":""},null,null,null,null,{"$f":"IF(OR(DB11=\"X\",DC11=\"X\"),\"X\",\"\")","v":""},null,null,null,null,{"$f":"IF(OR(DG11=\"X\",DH11=\"X\"),\"X\",\"\")","v":""},null,null,null,null,{"$f":"IF(OR(DL11=\"X\",DM11=\"X\"),\"X\",\"\")","v":""},null,null,null,null,{"$f":"IF(OR(DQ11=\"X\",DR11=\"X\"),\"X\",\"\")","v":""},null,null,null,null,{"$f":"IF(OR(DV11=\"X\",DW11=\"X\"),\"X\",\"\")","v":""}]
["7.14.5","m)","Os porta-objetos possuem profundidade máxima de 0,25 m e são isentos de superfícies cortantes ou abrasivas?",null,null,null,{"$f":"IF(OR(F11=\"X\",G11=\"X\"),\"X\",\"\")","v":"X"},null,null,null,null,{"$f":"IF(OR(K11=\"X\",L11=\"X\"),\"X\",\"\")","v":"X"},null,null,null,null,{"$f":"IF(OR(P11=\"X\",Q11=\"X\"),\"X\",\"\")","v":"X"},null,null,null,null,{"$f":"IF(OR(U11=\"X\",V11=\"X\"),\"X\",\"\")","v":"X"},null,null,null,null,{"$f":"IF(OR(Z11=\"X\",AA11=\"X\"),\"X\",\"\")","v":""},null,null,null,null,{"$f":"IF(OR(AE11=\"X\",AF11=\"X\"),\"X\",\"\")","v":""},null,null,null,null,{"$f":"IF(OR(AJ11=\"X\",AK11=\"X\"),\"X\",\"\")","v":""},null,null,null,null,{"$f":"IF(OR(AO11=\"X\",AP11=\"X\"),\"X\",\"\")","v":""},null,null,null,null,{"$f":"IF(OR(AT11=\"X\",AU11=\"X\"),\"X\",\"\")","v":""},null,null,null,null,{"$f":"IF(OR(AY11=\"X\",AZ11=\"X\"),\"X\",\"\")","v":""},null,null,null,null,{"$f":"IF(OR(BD11=\"X\",BE11=\"X\"),\"X\",\"\")","v":""},null,null,null,null,{"$f":"IF(OR(BI11=\"X\",BJ11=\"X\"),\"X\",\"\")","v":""},null,null,null,null,{"$f":"IF(OR(BN11=\"X\",BO11=\"X\"),\"X\",\"\")","v":""},null,null,null,null,{"$f":"IF(OR(BS11=\"X\",BT11=\"X\"),\"X\",\"\")","v":""},null,null,null,null,{"$f":"IF(OR(BX11=\"X\",BY11=\"X\"),\"X\",\"\")","v":""},null,null,null,null,{"$f":"IF(OR(CC11=\"X\",CD11=\"X\"),\"X\",\"\")","v":""},null,null,null,null,{"$f":"IF(OR(CH11=\"X\",CI11=\"X\"),\"X\",\"\")","v":""},null,null,null,null,{"$f":"IF(OR(CM11=\"X\",CN11=\"X\"),\"X\",\"\")","v":""},null,null,null,null,{"$f":"IF(OR(CR11=\"X\",CS11=\"X\"),\"X\",\"\")","v":""},null,null,null,null,{"$f":"IF(OR(CW11=\"X\",CX11=\"X\"),\"X\",\"\")","v":""},null,null,null,null,{"$f":"IF(OR(DB11=\"X\",DC11=\"X\"),\"X\",\"\")","v":""},null,null,null,null,{"$f":"IF(OR(DG11=\"X\",DH11=\"X\"),\"X\",\"\")","v":""},null,null,null,null,{"$f":"IF(OR(DL11=\"X\",DM11=\"X\"),\"X\",\"\")","v":""},null,null,null,null,{"$f":"IF(OR(DQ11=\"X\",DR11=\"X\"),\"X\",\"\")","v":""},null,null,null,null,{"$f":"IF(OR(DV11=\"X\",DW11=\"X\"),\"X\",\"\")","v":""}]
["7.11.1","n)","O espelho, quando instalado em parede sem pias, a borda inferior está no máximo a 0,50 m do piso e a borda superior a no mínimo 1,80 m? ",null,null,null,{"$f":"IF(OR(F11=\"X\",G11=\"X\"),\"X\",\"\")","v":"X"},null,null,null,null,{"$f":"IF(OR(K11=\"X\",L11=\"X\"),\"X\",\"\")","v":"X"},null,null,null,null,{"$f":"IF(OR(P11=\"X\",Q11=\"X\"),\"X\",\"\")","v":"X"},null,null,null,null,{"$f":"IF(OR(U11=\"X\",V11=\"X\"),\"X\",\"\")","v":"X"},null,null,null,null,{"$f":"IF(OR(Z11=\"X\",AA11=\"X\"),\"X\",\"\")","v":""},null,null,null,null,{"$f":"IF(OR(AE11=\"X\",AF11=\"X\"),\"X\",\"\")","v":""},null,null,null,null,{"$f":"IF(OR(AJ11=\"X\",AK11=\"X\"),\"X\",\"\")","v":""},null,null,null,null,{"$f":"IF(OR(AO11=\"X\",AP11=\"X\"),\"X\",\"\")","v":""},null,null,null,null,{"$f":"IF(OR(AT11=\"X\",AU11=\"X\"),\"X\",\"\")","v":""},null,null,null,null,{"$f":"IF(OR(AY11=\"X\",AZ11=\"X\"),\"X\",\"\")","v":""},null,null,null,null,{"$f":"IF(OR(BD11=\"X\",BE11=\"X\"),\"X\",\"\")","v":""},null,null,null,null,{"$f":"IF(OR(BI11=\"X\",BJ11=\"X\"),\"X\",\"\")","v":""},null,null,null,null,{"$f":"IF(OR(BN11=\"X\",BO11=\"X\"),\"X\",\"\")","v":""},null,null,null,null,{"$f":"IF(OR(BS11=\"X\",BT11=\"X\"),\"X\",\"\")","v":""},null,null,null,null,{"$f":"IF(OR(BX11=\"X\",BY11=\"X\"),\"X\",\"\")","v":""},null,null,null,null,{"$f":"IF(OR(CC11=\"X\",CD11=\"X\"),\"X\",\"\")","v":""},null,null,null,null,{"$f":"IF(OR(CH11=\"X\",CI11=\"X\"),\"X\",\"\")","v":""},null,null,null,null,{"$f":"IF(OR(CM11=\"X\",CN11=\"X\"),\"X\",\"\")","v":""},null,null,null,null,{"$f":"IF(OR(CR11=\"X\",CS11=\"X\"),\"X\",\"\")","v":""},null,null,null,null,{"$f":"IF(OR(CW11=\"X\",CX11=\"X\"),\"X\",\"\")","v":""},null,null,null,null,{"$f":"IF(OR(DB11=\"X\",DC11=\"X\"),\"X\",\"\")","v":""},null,null,null,null,{"$f":"IF(OR(DG11=\"X\",DH11=\"X\"),\"X\",\"\")","v":""},null,null,null,null,{"$f":"IF(OR(DL11=\"X\",DM11=\"X\"),\"X\",\"\")","v":""},null,null,null,null,{"$f":"IF(OR(DQ11=\"X\",DR11=\"X\"),\"X\",\"\")","v":""},null,null,null,null,{"$f":"IF(OR(DV11=\"X\",DW11=\"X\"),\"X\",\"\")","v":""}]
["7.11.1","o)","O espelho, quando instalado sobre o lavatório, a borda inferior está no máximo a 0,90 m do piso e a borda superior a no mínimo 1,80 m? ",null,null,null,{"$f":"IF(OR(F11=\"X\",G11=\"X\"),\"X\",\"\")","v":"X"},null,null,null,null,{"$f":"IF(OR(K11=\"X\",L11=\"X\"),\"X\",\"\")","v":"X"},null,null,null,null,{"$f":"IF(OR(P11=\"X\",Q11=\"X\"),\"X\",\"\")","v":"X"},null,null,null,null,{"$f":"IF(OR(U11=\"X\",V11=\"X\"),\"X\",\"\")","v":"X"},null,null,null,null,{"$f":"IF(OR(Z11=\"X\",AA11=\"X\"),\"X\",\"\")","v":""},null,null,null,null,{"$f":"IF(OR(AE11=\"X\",AF11=\"X\"),\"X\",\"\")","v":""},null,null,null,null,{"$f":"IF(OR(AJ11=\"X\",AK11=\"X\"),\"X\",\"\")","v":""},null,null,null,null,{"$f":"IF(OR(AO11=\"X\",AP11=\"X\"),\"X\",\"\")","v":""},null,null,null,null,{"$f":"IF(OR(AT11=\"X\",AU11=\"X\"),\"X\",\"\")","v":""},null,null,null,null,{"$f":"IF(OR(AY11=\"X\",AZ11=\"X\"),\"X\",\"\")","v":""},null,null,null,null,{"$f":"IF(OR(BD11=\"X\",BE11=\"X\"),\"X\",\"\")","v":""},null,null,null,null,{"$f":"IF(OR(BI11=\"X\",BJ11=\"X\"),\"X\",\"\")","v":""},null,null,null,null,{"$f":"IF(OR(BN11=\"X\",BO11=\"X\"),\"X\",\"\")","v":""},null,null,null,null,{"$f":"IF(OR(BS11=\"X\",BT11=\"X\"),\"X\",\"\")","v":""},null,null,null,null,{"$f":"IF(OR(BX11=\"X\",BY11=\"X\"),\"X\",\"\")","v":""},null,null,null,null,{"$f":"IF(OR(CC11=\"X\",CD11=\"X\"),\"X\",\"\")","v":""},null,null,null,null,{"$f":"IF(OR(CH11=\"X\",CI11=\"X\"),\"X\",\"\")","v":""},null,null,null,null,{"$f":"IF(OR(CM11=\"X\",CN11=\"X\"),\"X\",\"\")","v":""},null,null,null,null,{"$f":"IF(OR(CR11=\"X\",CS11=\"X\"),\"X\",\"\")","v":""},null,null,null,null,{"$f":"IF(OR(CW11=\"X\",CX11=\"X\"),\"X\",\"\")","v":""},null,null,null,null,{"$f":"IF(OR(DB11=\"X\",DC11=\"X\"),\"X\",\"\")","v":""},null,null,null,null,{"$f":"IF(OR(DG11=\"X\",DH11=\"X\"),\"X\",\"\")","v":""},null,null,null,null,{"$f":"IF(OR(DL11=\"X\",DM11=\"X\"),\"X\",\"\")","v":""},null,null,null,null,{"$f":"IF(OR(DQ11=\"X\",DR11=\"X\"),\"X\",\"\")","v":""},null,null,null,null,{"$f":"IF(OR(DV11=\"X\",DW11=\"X\"),\"X\",\"\")","v":""}]
[null,null,"Para cabinas individuais:"]
["7.14.1","p)","A cabina possui dimensão mínima de 1,80 x 1,80 m?",null,null,null,{"$f":"IF(OR(F11=\"X\",G11=\"X\"),\"X\",\"\")","v":"X"},null,null,null,null,{"$f":"IF(OR(K11=\"X\",L11=\"X\"),\"X\",\"\")","v":"X"},null,null,null,null,{"$f":"IF(OR(P11=\"X\",Q11=\"X\"),\"X\",\"\")","v":"X"},null,null,null,null,{"$f":"IF(OR(U11=\"X\",V11=\"X\"),\"X\",\"\")","v":"X"},null,null,null,null,{"$f":"IF(OR(Z11=\"X\",AA11=\"X\"),\"X\",\"\")","v":""},null,null,null,null,{"$f":"IF(OR(AE11=\"X\",AF11=\"X\"),\"X\",\"\")","v":""},null,null,null,null,{"$f":"IF(OR(AJ11=\"X\",AK11=\"X\"),\"X\",\"\")","v":""},null,null,null,null,{"$f":"IF(OR(AO11=\"X\",AP11=\"X\"),\"X\",\"\")","v":""},null,null,null,null,{"$f":"IF(OR(AT11=\"X\",AU11=\"X\"),\"X\",\"\")","v":""},null,null,null,null,{"$f":"IF(OR(AY11=\"X\",AZ11=\"X\"),\"X\",\"\")","v":""},null,null,null,null,{"$f":"IF(OR(BD11=\"X\",BE11=\"X\"),\"X\",\"\")","v":""},null,null,null,null,{"$f":"IF(OR(BI11=\"X\",BJ11=\"X\"),\"X\",\"\")","v":""},null,null,null,null,{"$f":"IF(OR(BN11=\"X\",BO11=\"X\"),\"X\",\"\")","v":""},null,null,null,null,{"$f":"IF(OR(BS11=\"X\",BT11=\"X\"),\"X\",\"\")","v":""},null,null,null,null,{"$f":"IF(OR(BX11=\"X\",BY11=\"X\"),\"X\",\"\")","v":""},null,null,null,null,{"$f":"IF(OR(CC11=\"X\",CD11=\"X\"),\"X\",\"\")","v":""},null,null,null,null,{"$f":"IF(OR(CH11=\"X\",CI11=\"X\"),\"X\",\"\")","v":""},null,null,null,null,{"$f":"IF(OR(CM11=\"X\",CN11=\"X\"),\"X\",\"\")","v":""},null,null,null,null,{"$f":"IF(OR(CR11=\"X\",CS11=\"X\"),\"X\",\"\")","v":""},null,null,null,null,{"$f":"IF(OR(CW11=\"X\",CX11=\"X\"),\"X\",\"\")","v":""},null,null,null,null,{"$f":"IF(OR(DB11=\"X\",DC11=\"X\"),\"X\",\"\")","v":""},null,null,null,null,{"$f":"IF(OR(DG11=\"X\",DH11=\"X\"),\"X\",\"\")","v":""},null,null,null,null,{"$f":"IF(OR(DL11=\"X\",DM11=\"X\"),\"X\",\"\")","v":""},null,null,null,null,{"$f":"IF(OR(DQ11=\"X\",DR11=\"X\"),\"X\",\"\")","v":""},null,null,null,null,{"$f":"IF(OR(DV11=\"X\",DW11=\"X\"),\"X\",\"\")","v":""}]
["7.14.1.2","q)","A porta da cabina possui um vão livre mínimo de 0,80 m?",null,null,null,{"$f":"IF(OR(F11=\"X\",G11=\"X\"),\"X\",\"\")","v":"X"},null,null,null,null,{"$f":"IF(OR(K11=\"X\",L11=\"X\"),\"X\",\"\")","v":"X"},null,null,null,null,{"$f":"IF(OR(P11=\"X\",Q11=\"X\"),\"X\",\"\")","v":"X"},null,null,null,null,{"$f":"IF(OR(U11=\"X\",V11=\"X\"),\"X\",\"\")","v":"X"},null,null,null,null,{"$f":"IF(OR(Z11=\"X\",AA11=\"X\"),\"X\",\"\")","v":""},null,null,null,null,{"$f":"IF(OR(AE11=\"X\",AF11=\"X\"),\"X\",\"\")","v":""},null,null,null,null,{"$f":"IF(OR(AJ11=\"X\",AK11=\"X\"),\"X\",\"\")","v":""},null,null,null,null,{"$f":"IF(OR(AO11=\"X\",AP11=\"X\"),\"X\",\"\")","v":""},null,null,null,null,{"$f":"IF(OR(AT11=\"X\",AU11=\"X\"),\"X\",\"\")","v":""},null,null,null,null,{"$f":"IF(OR(AY11=\"X\",AZ11=\"X\"),\"X\",\"\")","v":""},null,null,null,null,{"$f":"IF(OR(BD11=\"X\",BE11=\"X\"),\"X\",\"\")","v":""},null,null,null,null,{"$f":"IF(OR(BI11=\"X\",BJ11=\"X\"),\"X\",\"\")","v":""},null,null,null,null,{"$f":"IF(OR(BN11=\"X\",BO11=\"X\"),\"X\",\"\")","v":""},null,null,null,null,{"$f":"IF(OR(BS11=\"X\",BT11=\"X\"),\"X\",\"\")","v":""},null,null,null,null,{"$f":"IF(OR(BX11=\"X\",BY11=\"X\"),\"X\",\"\")","v":""},null,null,null,null,{"$f":"IF(OR(CC11=\"X\",CD11=\"X\"),\"X\",\"\")","v":""},null,null,null,null,{"$f":"IF(OR(CH11=\"X\",CI11=\"X\"),\"X\",\"\")","v":""},null,null,null,null,{"$f":"IF(OR(CM11=\"X\",CN11=\"X\"),\"X\",\"\")","v":""},null,null,null,null,{"$f":"IF(OR(CR11=\"X\",CS11=\"X\"),\"X\",\"\")","v":""},null,null,null,null,{"$f":"IF(OR(CW11=\"X\",CX11=\"X\"),\"X\",\"\")","v":""},null,null,null,null,{"$f":"IF(OR(DB11=\"X\",DC11=\"X\"),\"X\",\"\")","v":""},null,null,null,null,{"$f":"IF(OR(DG11=\"X\",DH11=\"X\"),\"X\",\"\")","v":""},null,null,null,null,{"$f":"IF(OR(DL11=\"X\",DM11=\"X\"),\"X\",\"\")","v":""},null,null,null,null,{"$f":"IF(OR(DQ11=\"X\",DR11=\"X\"),\"X\",\"\")","v":""},null,null,null,null,{"$f":"IF(OR(DV11=\"X\",DW11=\"X\"),\"X\",\"\")","v":""}]
["7.14.1.2","r)","O sentido de abertura da porta é para fora?",null,null,null,{"$f":"IF(OR(F11=\"X\",G11=\"X\"),\"X\",\"\")","v":"X"},null,null,null,null,{"$f":"IF(OR(K11=\"X\",L11=\"X\"),\"X\",\"\")","v":"X"},null,null,null,null,{"$f":"IF(OR(P11=\"X\",Q11=\"X\"),\"X\",\"\")","v":"X"},null,null,null,null,{"$f":"IF(OR(U11=\"X\",V11=\"X\"),\"X\",\"\")","v":"X"},null,null,null,null,{"$f":"IF(OR(Z11=\"X\",AA11=\"X\"),\"X\",\"\")","v":""},null,null,null,null,{"$f":"IF(OR(AE11=\"X\",AF11=\"X\"),\"X\",\"\")","v":""},null,null,null,null,{"$f":"IF(OR(AJ11=\"X\",AK11=\"X\"),\"X\",\"\")","v":""},null,null,null,null,{"$f":"IF(OR(AO11=\"X\",AP11=\"X\"),\"X\",\"\")","v":""},null,null,null,null,{"$f":"IF(OR(AT11=\"X\",AU11=\"X\"),\"X\",\"\")","v":""},null,null,null,null,{"$f":"IF(OR(AY11=\"X\",AZ11=\"X\"),\"X\",\"\")","v":""},null,null,null,null,{"$f":"IF(OR(BD11=\"X\",BE11=\"X\"),\"X\",\"\")","v":""},null,null,null,null,{"$f":"IF(OR(BI11=\"X\",BJ11=\"X\"),\"X\",\"\")","v":""},null,null,null,null,{"$f":"IF(OR(BN11=\"X\",BO11=\"X\"),\"X\",\"\")","v":""},null,null,null,null,{"$f":"IF(OR(BS11=\"X\",BT11=\"X\"),\"X\",\"\")","v":""},null,null,null,null,{"$f":"IF(OR(BX11=\"X\",BY11=\"X\"),\"X\",\"\")","v":""},null,null,null,null,{"$f":"IF(OR(CC11=\"X\",CD11=\"X\"),\"X\",\"\")","v":""},null,null,null,null,{"$f":"IF(OR(CH11=\"X\",CI11=\"X\"),\"X\",\"\")","v":""},null,null,null,null,{"$f":"IF(OR(CM11=\"X\",CN11=\"X\"),\"X\",\"\")","v":""},null,null,null,null,{"$f":"IF(OR(CR11=\"X\",CS11=\"X\"),\"X\",\"\")","v":""},null,null,null,null,{"$f":"IF(OR(CW11=\"X\",CX11=\"X\"),\"X\",\"\")","v":""},null,null,null,null,{"$f":"IF(OR(DB11=\"X\",DC11=\"X\"),\"X\",\"\")","v":""},null,null,null,null,{"$f":"IF(OR(DG11=\"X\",DH11=\"X\"),\"X\",\"\")","v":""},null,null,null,null,{"$f":"IF(OR(DL11=\"X\",DM11=\"X\"),\"X\",\"\")","v":""},null,null,null,null,{"$f":"IF(OR(DQ11=\"X\",DR11=\"X\"),\"X\",\"\")","v":""},null,null,null,null,{"$f":"IF(OR(DV11=\"X\",DW11=\"X\"),\"X\",\"\")","v":""}]
["7.14.1.2","s)","A maçaneta é do tipo alavanca, com pelo menos 100 mm de comprimento e acabamento sem arestas e recurvado na extremidade, apresentando uma distância mínima de 40 mm da superfície da porta e instalada a uma altura entre 0,80 m e 1,10 m do piso acabado?",null,null,null,{"$f":"IF(OR(F11=\"X\",G11=\"X\"),\"X\",\"\")","v":"X"},null,null,null,null,{"$f":"IF(OR(K11=\"X\",L11=\"X\"),\"X\",\"\")","v":"X"},null,null,null,null,{"$f":"IF(OR(P11=\"X\",Q11=\"X\"),\"X\",\"\")","v":"X"},null,null,null,null,{"$f":"IF(OR(U11=\"X\",V11=\"X\"),\"X\",\"\")","v":"X"},null,null,null,null,{"$f":"IF(OR(Z11=\"X\",AA11=\"X\"),\"X\",\"\")","v":""},null,null,null,null,{"$f":"IF(OR(AE11=\"X\",AF11=\"X\"),\"X\",\"\")","v":""},null,null,null,null,{"$f":"IF(OR(AJ11=\"X\",AK11=\"X\"),\"X\",\"\")","v":""},null,null,null,null,{"$f":"IF(OR(AO11=\"X\",AP11=\"X\"),\"X\",\"\")","v":""},null,null,null,null,{"$f":"IF(OR(AT11=\"X\",AU11=\"X\"),\"X\",\"\")","v":""},null,null,null,null,{"$f":"IF(OR(AY11=\"X\",AZ11=\"X\"),\"X\",\"\")","v":""},null,null,null,null,{"$f":"IF(OR(BD11=\"X\",BE11=\"X\"),\"X\",\"\")","v":""},null,null,null,null,{"$f":"IF(OR(BI11=\"X\",BJ11=\"X\"),\"X\",\"\")","v":""},null,null,null,null,{"$f":"IF(OR(BN11=\"X\",BO11=\"X\"),\"X\",\"\")","v":""},null,null,null,null,{"$f":"IF(OR(BS11=\"X\",BT11=\"X\"),\"X\",\"\")","v":""},null,null,null,null,{"$f":"IF(OR(BX11=\"X\",BY11=\"X\"),\"X\",\"\")","v":""},null,null,null,null,{"$f":"IF(OR(CC11=\"X\",CD11=\"X\"),\"X\",\"\")","v":""},null,null,null,null,{"$f":"IF(OR(CH11=\"X\",CI11=\"X\"),\"X\",\"\")","v":""},null,null,null,null,{"$f":"IF(OR(CM11=\"X\",CN11=\"X\"),\"X\",\"\")","v":""},null,null,null,null,{"$f":"IF(OR(CR11=\"X\",CS11=\"X\"),\"X\",\"\")","v":""},null,null,null,null,{"$f":"IF(OR(CW11=\"X\",CX11=\"X\"),\"X\",\"\")","v":""},null,null,null,null,{"$f":"IF(OR(DB11=\"X\",DC11=\"X\"),\"X\",\"\")","v":""},null,null,null,null,{"$f":"IF(OR(DG11=\"X\",DH11=\"X\"),\"X\",\"\")","v":""},null,null,null,null,{"$f":"IF(OR(DL11=\"X\",DM11=\"X\"),\"X\",\"\")","v":""},null,null,null,null,{"$f":"IF(OR(DQ11=\"X\",DR11=\"X\"),\"X\",\"\")","v":""},null,null,null,null,{"$f":"IF(OR(DV11=\"X\",DW11=\"X\"),\"X\",\"\")","v":""}]
["7.14.1.2 \n","t)","A porta possui puxador horizontal, com diâmetro entre 25 mm a 35 mm, com comprimento mínimo de 0,40 m, fixado na parte interna da porta, afastado 0,10 m do batente (do lado da dobradiça) e instalada na altura da macaneta , conforme a Figura 86? Na inexistência da maçaneta, o puxador está instalado a uma altura entre 0,80 m a 1,10 m medidos do eixo do puxador ao piso acabado?",null,null,null,{"$f":"IF(OR(F11=\"X\",G11=\"X\"),\"X\",\"\")","v":"X"},null,null,null,null,{"$f":"IF(OR(K11=\"X\",L11=\"X\"),\"X\",\"\")","v":"X"},null,null,null,null,{"$f":"IF(OR(P11=\"X\",Q11=\"X\"),\"X\",\"\")","v":"X"},null,null,null,null,{"$f":"IF(OR(U11=\"X\",V11=\"X\"),\"X\",\"\")","v":"X"},null,null,null,null,{"$f":"IF(OR(Z11=\"X\",AA11=\"X\"),\"X\",\"\")","v":""},null,null,null,null,{"$f":"IF(OR(AE11=\"X\",AF11=\"X\"),\"X\",\"\")","v":""},null,null,null,null,{"$f":"IF(OR(AJ11=\"X\",AK11=\"X\"),\"X\",\"\")","v":""},null,null,null,null,{"$f":"IF(OR(AO11=\"X\",AP11=\"X\"),\"X\",\"\")","v":""},null,null,null,null,{"$f":"IF(OR(AT11=\"X\",AU11=\"X\"),\"X\",\"\")","v":""},null,null,null,null,{"$f":"IF(OR(AY11=\"X\",AZ11=\"X\"),\"X\",\"\")","v":""},null,null,null,null,{"$f":"IF(OR(BD11=\"X\",BE11=\"X\"),\"X\",\"\")","v":""},null,null,null,null,{"$f":"IF(OR(BI11=\"X\",BJ11=\"X\"),\"X\",\"\")","v":""},null,null,null,null,{"$f":"IF(OR(BN11=\"X\",BO11=\"X\"),\"X\",\"\")","v":""},null,null,null,null,{"$f":"IF(OR(BS11=\"X\",BT11=\"X\"),\"X\",\"\")","v":""},null,null,null,null,{"$f":"IF(OR(BX11=\"X\",BY11=\"X\"),\"X\",\"\")","v":""},null,null,null,null,{"$f":"IF(OR(CC11=\"X\",CD11=\"X\"),\"X\",\"\")","v":""},null,null,null,null,{"$f":"IF(OR(CH11=\"X\",CI11=\"X\"),\"X\",\"\")","v":""},null,null,null,null,{"$f":"IF(OR(CM11=\"X\",CN11=\"X\"),\"X\",\"\")","v":""},null,null,null,null,{"$f":"IF(OR(CR11=\"X\",CS11=\"X\"),\"X\",\"\")","v":""},null,null,null,null,{"$f":"IF(OR(CW11=\"X\",CX11=\"X\"),\"X\",\"\")","v":""},null,null,null,null,{"$f":"IF(OR(DB11=\"X\",DC11=\"X\"),\"X\",\"\")","v":""},null,null,null,null,{"$f":"IF(OR(DG11=\"X\",DH11=\"X\"),\"X\",\"\")","v":""},null,null,null,null,{"$f":"IF(OR(DL11=\"X\",DM11=\"X\"),\"X\",\"\")","v":""},null,null,null,null,{"$f":"IF(OR(DQ11=\"X\",DR11=\"X\"),\"X\",\"\")","v":""},null,null,null,null,{"$f":"IF(OR(DV11=\"X\",DW11=\"X\"),\"X\",\"\")","v":""}]
["7.14.1","u)","Possui superfície para troca de roupas na posição deitada, de dimensões mínimas de 0,70 m de largura, 1,80 m de comprimento e altura de 0,46 m?",null,null,null,{"$f":"IF(OR(F11=\"X\",G11=\"X\"),\"X\",\"\")","v":"X"},null,null,null,null,{"$f":"IF(OR(K11=\"X\",L11=\"X\"),\"X\",\"\")","v":"X"},null,null,null,null,{"$f":"IF(OR(P11=\"X\",Q11=\"X\"),\"X\",\"\")","v":"X"},null,null,null,null,{"$f":"IF(OR(U11=\"X\",V11=\"X\"),\"X\",\"\")","v":"X"},null,null,null,null,{"$f":"IF(OR(Z11=\"X\",AA11=\"X\"),\"X\",\"\")","v":""},null,null,null,null,{"$f":"IF(OR(AE11=\"X\",AF11=\"X\"),\"X\",\"\")","v":""},null,null,null,null,{"$f":"IF(OR(AJ11=\"X\",AK11=\"X\"),\"X\",\"\")","v":""},null,null,null,null,{"$f":"IF(OR(AO11=\"X\",AP11=\"X\"),\"X\",\"\")","v":""},null,null,null,null,{"$f":"IF(OR(AT11=\"X\",AU11=\"X\"),\"X\",\"\")","v":""},null,null,null,null,{"$f":"IF(OR(AY11=\"X\",AZ11=\"X\"),\"X\",\"\")","v":""},null,null,null,null,{"$f":"IF(OR(BD11=\"X\",BE11=\"X\"),\"X\",\"\")","v":""},null,null,null,null,{"$f":"IF(OR(BI11=\"X\",BJ11=\"X\"),\"X\",\"\")","v":""},null,null,null,null,{"$f":"IF(OR(BN11=\"X\",BO11=\"X\"),\"X\",\"\")","v":""},null,null,null,null,{"$f":"IF(OR(BS11=\"X\",BT11=\"X\"),\"X\",\"\")","v":""},null,null,null,null,{"$f":"IF(OR(BX11=\"X\",BY11=\"X\"),\"X\",\"\")","v":""},null,null,null,null,{"$f":"IF(OR(CC11=\"X\",CD11=\"X\"),\"X\",\"\")","v":""},null,null,null,null,{"$f":"IF(OR(CH11=\"X\",CI11=\"X\"),\"X\",\"\")","v":""},null,null,null,null,{"$f":"IF(OR(CM11=\"X\",CN11=\"X\"),\"X\",\"\")","v":""},null,null,null,null,{"$f":"IF(OR(CR11=\"X\",CS11=\"X\"),\"X\",\"\")","v":""},null,null,null,null,{"$f":"IF(OR(CW11=\"X\",CX11=\"X\"),\"X\",\"\")","v":""},null,null,null,null,{"$f":"IF(OR(DB11=\"X\",DC11=\"X\"),\"X\",\"\")","v":""},null,null,null,null,{"$f":"IF(OR(DG11=\"X\",DH11=\"X\"),\"X\",\"\")","v":""},null,null,null,null,{"$f":"IF(OR(DL11=\"X\",DM11=\"X\"),\"X\",\"\")","v":""},null,null,null,null,{"$f":"IF(OR(DQ11=\"X\",DR11=\"X\"),\"X\",\"\")","v":""},null,null,null,null,{"$f":"IF(OR(DV11=\"X\",DW11=\"X\"),\"X\",\"\")","v":""}]
["7.14.1.1","v)","Há duas barras de apoio horizontais junto à superfície de troca de roupas, com comprimento mínimo de 0,80 m, ambas em altura de 0,75 m do piso acabado?",null,null,null,{"$f":"IF(OR(F11=\"X\",G11=\"X\"),\"X\",\"\")","v":"X"},null,null,null,null,{"$f":"IF(OR(K11=\"X\",L11=\"X\"),\"X\",\"\")","v":"X"},null,null,null,null,{"$f":"IF(OR(P11=\"X\",Q11=\"X\"),\"X\",\"\")","v":"X"},null,null,null,null,{"$f":"IF(OR(U11=\"X\",V11=\"X\"),\"X\",\"\")","v":"X"},null,null,null,null,{"$f":"IF(OR(Z11=\"X\",AA11=\"X\"),\"X\",\"\")","v":""},null,null,null,null,{"$f":"IF(OR(AE11=\"X\",AF11=\"X\"),\"X\",\"\")","v":""},null,null,null,null,{"$f":"IF(OR(AJ11=\"X\",AK11=\"X\"),\"X\",\"\")","v":""},null,null,null,null,{"$f":"IF(OR(AO11=\"X\",AP11=\"X\"),\"X\",\"\")","v":""},null,null,null,null,{"$f":"IF(OR(AT11=\"X\",AU11=\"X\"),\"X\",\"\")","v":""},null,null,null,null,{"$f":"IF(OR(AY11=\"X\",AZ11=\"X\"),\"X\",\"\")","v":""},null,null,null,null,{"$f":"IF(OR(BD11=\"X\",BE11=\"X\"),\"X\",\"\")","v":""},null,null,null,null,{"$f":"IF(OR(BI11=\"X\",BJ11=\"X\"),\"X\",\"\")","v":""},null,null,null,null,{"$f":"IF(OR(BN11=\"X\",BO11=\"X\"),\"X\",\"\")","v":""},null,null,null,null,{"$f":"IF(OR(BS11=\"X\",BT11=\"X\"),\"X\",\"\")","v":""},null,null,null,null,{"$f":"IF(OR(BX11=\"X\",BY11=\"X\"),\"X\",\"\")","v":""},null,null,null,null,{"$f":"IF(OR(CC11=\"X\",CD11=\"X\"),\"X\",\"\")","v":""},null,null,null,null,{"$f":"IF(OR(CH11=\"X\",CI11=\"X\"),\"X\",\"\")","v":""},null,null,null,null,{"$f":"IF(OR(CM11=\"X\",CN11=\"X\"),\"X\",\"\")","v":""},null,null,null,null,{"$f":"IF(OR(CR11=\"X\",CS11=\"X\"),\"X\",\"\")","v":""},null,null,null,null,{"$f":"IF(OR(CW11=\"X\",CX11=\"X\"),\"X\",\"\")","v":""},null,null,null,null,{"$f":"IF(OR(DB11=\"X\",DC11=\"X\"),\"X\",\"\")","v":""},null,null,null,null,{"$f":"IF(OR(DG11=\"X\",DH11=\"X\"),\"X\",\"\")","v":""},null,null,null,null,{"$f":"IF(OR(DL11=\"X\",DM11=\"X\"),\"X\",\"\")","v":""},null,null,null,null,{"$f":"IF(OR(DQ11=\"X\",DR11=\"X\"),\"X\",\"\")","v":""},null,null,null,null,{"$f":"IF(OR(DV11=\"X\",DW11=\"X\"),\"X\",\"\")","v":""}]
["7.14.1.1","w)","Estas barras são fixadas, uma na parede da cabeceira a 0,30 m de distância da parede lateral e outra na parede lateral a 0,50 m da parede da cabeceira?",null,null,null,{"$f":"IF(OR(F11=\"X\",G11=\"X\"),\"X\",\"\")","v":"X"},null,null,null,null,{"$f":"IF(OR(K11=\"X\",L11=\"X\"),\"X\",\"\")","v":"X"},null,null,null,null,{"$f":"IF(OR(P11=\"X\",Q11=\"X\"),\"X\",\"\")","v":"X"},null,null,null,null,{"$f":"IF(OR(U11=\"X\",V11=\"X\"),\"X\",\"\")","v":"X"},null,null,null,null,{"$f":"IF(OR(Z11=\"X\",AA11=\"X\"),\"X\",\"\")","v":""},null,null,null,null,{"$f":"IF(OR(AE11=\"X\",AF11=\"X\"),\"X\",\"\")","v":""},null,null,null,null,{"$f":"IF(OR(AJ11=\"X\",AK11=\"X\"),\"X\",\"\")","v":""},null,null,null,null,{"$f":"IF(OR(AO11=\"X\",AP11=\"X\"),\"X\",\"\")","v":""},null,null,null,null,{"$f":"IF(OR(AT11=\"X\",AU11=\"X\"),\"X\",\"\")","v":""},null,null,null,null,{"$f":"IF(OR(AY11=\"X\",AZ11=\"X\"),\"X\",\"\")","v":""},null,null,null,null,{"$f":"IF(OR(BD11=\"X\",BE11=\"X\"),\"X\",\"\")","v":""},null,null,null,null,{"$f":"IF(OR(BI11=\"X\",BJ11=\"X\"),\"X\",\"\")","v":""},null,null,null,null,{"$f":"IF(OR(BN11=\"X\",BO11=\"X\"),\"X\",\"\")","v":""},null,null,null,null,{"$f":"IF(OR(BS11=\"X\",BT11=\"X\"),\"X\",\"\")","v":""},null,null,null,null,{"$f":"IF(OR(BX11=\"X\",BY11=\"X\"),\"X\",\"\")","v":""},null,null,null,null,{"$f":"IF(OR(CC11=\"X\",CD11=\"X\"),\"X\",\"\")","v":""},null,null,null,null,{"$f":"IF(OR(CH11=\"X\",CI11=\"X\"),\"X\",\"\")","v":""},null,null,null,null,{"$f":"IF(OR(CM11=\"X\",CN11=\"X\"),\"X\",\"\")","v":""},null,null,null,null,{"$f":"IF(OR(CR11=\"X\",CS11=\"X\"),\"X\",\"\")","v":""},null,null,null,null,{"$f":"IF(OR(CW11=\"X\",CX11=\"X\"),\"X\",\"\")","v":""},null,null,null,null,{"$f":"IF(OR(DB11=\"X\",DC11=\"X\"),\"X\",\"\")","v":""},null,null,null,null,{"$f":"IF(OR(DG11=\"X\",DH11=\"X\"),\"X\",\"\")","v":""},null,null,null,null,{"$f":"IF(OR(DL11=\"X\",DM11=\"X\"),\"X\",\"\")","v":""},null,null,null,null,{"$f":"IF(OR(DQ11=\"X\",DR11=\"X\"),\"X\",\"\")","v":""},null,null,null,null,{"$f":"IF(OR(DV11=\"X\",DW11=\"X\"),\"X\",\"\")","v":""}]
["7.14.1.1","x)","Possui cabide instalado em altura entre 0,80 m e 1,20 m?",null,null,null,{"$f":"IF(OR(F11=\"X\",G11=\"X\"),\"X\",\"\")","v":"X"},null,null,null,null,{"$f":"IF(OR(K11=\"X\",L11=\"X\"),\"X\",\"\")","v":"X"},null,null,null,null,{"$f":"IF(OR(P11=\"X\",Q11=\"X\"),\"X\",\"\")","v":"X"},null,null,null,null,{"$f":"IF(OR(U11=\"X\",V11=\"X\"),\"X\",\"\")","v":"X"},null,null,null,null,{"$f":"IF(OR(Z11=\"X\",AA11=\"X\"),\"X\",\"\")","v":""},null,null,null,null,{"$f":"IF(OR(AE11=\"X\",AF11=\"X\"),\"X\",\"\")","v":""},null,null,null,null,{"$f":"IF(OR(AJ11=\"X\",AK11=\"X\"),\"X\",\"\")","v":""},null,null,null,null,{"$f":"IF(OR(AO11=\"X\",AP11=\"X\"),\"X\",\"\")","v":""},null,null,null,null,{"$f":"IF(OR(AT11=\"X\",AU11=\"X\"),\"X\",\"\")","v":""},null,null,null,null,{"$f":"IF(OR(AY11=\"X\",AZ11=\"X\"),\"X\",\"\")","v":""},null,null,null,null,{"$f":"IF(OR(BD11=\"X\",BE11=\"X\"),\"X\",\"\")","v":""},null,null,null,null,{"$f":"IF(OR(BI11=\"X\",BJ11=\"X\"),\"X\",\"\")","v":""},null,null,null,null,{"$f":"IF(OR(BN11=\"X\",BO11=\"X\"),\"X\",\"\")","v":""},null,null,null,null,{"$f":"IF(OR(BS11=\"X\",BT11=\"X\"),\"X\",\"\")","v":""},null,null,null,null,{"$f":"IF(OR(BX11=\"X\",BY11=\"X\"),\"X\",\"\")","v":""},null,null,null,null,{"$f":"IF(OR(CC11=\"X\",CD11=\"X\"),\"X\",\"\")","v":""},null,null,null,null,{"$f":"IF(OR(CH11=\"X\",CI11=\"X\"),\"X\",\"\")","v":""},null,null,null,null,{"$f":"IF(OR(CM11=\"X\",CN11=\"X\"),\"X\",\"\")","v":""},null,null,null,null,{"$f":"IF(OR(CR11=\"X\",CS11=\"X\"),\"X\",\"\")","v":""},null,null,null,null,{"$f":"IF(OR(CW11=\"X\",CX11=\"X\"),\"X\",\"\")","v":""},null,null,null,null,{"$f":"IF(OR(DB11=\"X\",DC11=\"X\"),\"X\",\"\")","v":""},null,null,null,null,{"$f":"IF(OR(DG11=\"X\",DH11=\"X\"),\"X\",\"\")","v":""},null,null,null,null,{"$f":"IF(OR(DL11=\"X\",DM11=\"X\"),\"X\",\"\")","v":""},null,null,null,null,{"$f":"IF(OR(DQ11=\"X\",DR11=\"X\"),\"X\",\"\")","v":""},null,null,null,null,{"$f":"IF(OR(DV11=\"X\",DW11=\"X\"),\"X\",\"\")","v":""}]
["7.14.1.1","y)","Possui espelho instalado a 0,30 m do piso e com a borda superior a no mínimo 1,80 m? ",null,null,null,{"$f":"IF(OR(F11=\"X\",G11=\"X\"),\"X\",\"\")","v":"X"},null,null,null,null,{"$f":"IF(OR(K11=\"X\",L11=\"X\"),\"X\",\"\")","v":"X"},null,null,null,null,{"$f":"IF(OR(P11=\"X\",Q11=\"X\"),\"X\",\"\")","v":"X"},null,null,null,null,{"$f":"IF(OR(U11=\"X\",V11=\"X\"),\"X\",\"\")","v":"X"},null,null,null,null,{"$f":"IF(OR(Z11=\"X\",AA11=\"X\"),\"X\",\"\")","v":""},null,null,null,null,{"$f":"IF(OR(AE11=\"X\",AF11=\"X\"),\"X\",\"\")","v":""},null,null,null,null,{"$f":"IF(OR(AJ11=\"X\",AK11=\"X\"),\"X\",\"\")","v":""},null,null,null,null,{"$f":"IF(OR(AO11=\"X\",AP11=\"X\"),\"X\",\"\")","v":""},null,null,null,null,{"$f":"IF(OR(AT11=\"X\",AU11=\"X\"),\"X\",\"\")","v":""},null,null,null,null,{"$f":"IF(OR(AY11=\"X\",AZ11=\"X\"),\"X\",\"\")","v":""},null,null,null,null,{"$f":"IF(OR(BD11=\"X\",BE11=\"X\"),\"X\",\"\")","v":""},null,null,null,null,{"$f":"IF(OR(BI11=\"X\",BJ11=\"X\"),\"X\",\"\")","v":""},null,null,null,null,{"$f":"IF(OR(BN11=\"X\",BO11=\"X\"),\"X\",\"\")","v":""},null,null,null,null,{"$f":"IF(OR(BS11=\"X\",BT11=\"X\"),\"X\",\"\")","v":""},null,null,null,null,{"$f":"IF(OR(BX11=\"X\",BY11=\"X\"),\"X\",\"\")","v":""},null,null,null,null,{"$f":"IF(OR(CC11=\"X\",CD11=\"X\"),\"X\",\"\")","v":""},null,null,null,null,{"$f":"IF(OR(CH11=\"X\",CI11=\"X\"),\"X\",\"\")","v":""},null,null,null,null,{"$f":"IF(OR(CM11=\"X\",CN11=\"X\"),\"X\",\"\")","v":""},null,null,null,null,{"$f":"IF(OR(CR11=\"X\",CS11=\"X\"),\"X\",\"\")","v":""},null,null,null,null,{"$f":"IF(OR(CW11=\"X\",CX11=\"X\"),\"X\",\"\")","v":""},null,null,null,null,{"$f":"IF(OR(DB11=\"X\",DC11=\"X\"),\"X\",\"\")","v":""},null,null,null,null,{"$f":"IF(OR(DG11=\"X\",DH11=\"X\"),\"X\",\"\")","v":""},null,null,null,null,{"$f":"IF(OR(DL11=\"X\",DM11=\"X\"),\"X\",\"\")","v":""},null,null,null,null,{"$f":"IF(OR(DQ11=\"X\",DR11=\"X\"),\"X\",\"\")","v":""},null,null,null,null,{"$f":"IF(OR(DV11=\"X\",DW11=\"X\"),\"X\",\"\")","v":""}]
[]
[null,null,null,null,"SIM","NÃO","JUSTIFICATIVA",null,null,"SIM","NÃO","JUSTIFICATIVA",null,null,"SIM","NÃO","JUSTIFICATIVA",null,null,"SIM","NÃO","JUSTIFICATIVA",null,null,"SIM","NÃO","JUSTIFICATIVA",null,null,"SIM","NÃO","JUSTIFICATIVA",null,null,"SIM","NÃO","JUSTIFICATIVA",null,null,"SIM","NÃO","JUSTIFICATIVA",null,null,"SIM","NÃO","JUSTIFICATIVA",null,null,"SIM","NÃO","JUSTIFICATIVA",null,null,"SIM","NÃO","JUSTIFICATIVA",null,null,"SIM","NÃO","JUSTIFICATIVA",null,null,"SIM","NÃO","JUSTIFICATIVA",null,null,"SIM","NÃO","JUSTIFICATIVA",null,null,"SIM","NÃO","JUSTIFICATIVA",null,null,"SIM","NÃO","JUSTIFICATIVA",null,null,"SIM","NÃO","JUSTIFICATIVA",null,null,"SIM","NÃO","JUSTIFICATIVA",null,null,"SIM","NÃO","JUSTIFICATIVA",null,null,"SIM","NÃO","JUSTIFICATIVA",null,null,"SIM","NÃO","JUSTIFICATIVA",null,null,"SIM","NÃO","JUSTIFICATIVA",null,null,"SIM","NÃO","JUSTIFICATIVA",null,null,"SIM","NÃO","JUSTIFICATIVA",null,null,"SIM","NÃO","JUSTIFICATIVA"]
[null,null,"NECESSITA PROJETO ?",null,null,"X",null,null,null,null,"X",null,null,null,null,"X",null,null,null,null,"X"]

{"sheet":"9_Bibliotecas","index":16,"n_rows":21,"n_cols":127,"rows_kept":21,"cut":false,"hidden":false,"merged":[[20,105,20,106],[20,110,20,111],[20,115,20,116],[20,120,20,121],[20,125,20,126],[20,80,20,81],[20,85,20,86],[20,90,20,91],[20,95,20,96],[20,100,20,101],[19,105,19,106],[19,110,19,111],[19,115,19,116],[19,120,19,121],[19,125,19,126],[19,80,19,81],[19,85,19,86],[19,90,19,91],[19,95,19,96],[19,100,19,101],[8,120,9,120],[8,121,9,121],[8,123,8,124],[8,125,9,125],[8,126,9,126],[8,111,9,111],[8,113,8,114],[8,115,9,115],[8,116,9,116],[8,118,8,119],[8,103,8,104],[8,105,9,105],[8,106,9,106],[8,108,8,109],[8,110,9,110],[8,95,9,95],[8,96,9,96],[8,98,8,99],[8,100,9,100],[8,101,9,101],[8,86,9,86],[8,88,8,89],[8,90,9,90],[8,91,9,91],[8,93,8,94],[8,78,8,79],[8,80,9,80],[8,81,9,81],[8,83,8,84],[8,85,9,85],[6,103,6,106],[6,108,6,111],[6,113,6,116],[6,118,6,121],[6,123,6,126],[6,78,6,81],[6,83,6,86],[6,88,6,91],[6,93,6,96],[6,98,6,101],[19,6,19,7],[20,6,20,7],[19,11,19,12],[20,11,20,12],[19,16,19,17],[20,16,20,17],[8,17,9,17],[8,12,9,12],[8,7,9,7],[8,0,9,0],[8,2,9,2],[8,4,8,5],[8,6,9,6],[8,9,8,10],[8,11,9,11],[8,14,8,15],[8,16,9,16],[0,0,0,2],[2,0,2,3],[6,4,6,7],[6,14,6,17],[6,9,6,12],[6,33,6,36],[6,38,6,41],[20,35,20,36],[20,40,20,41],[8,26,9,26],[8,28,8,29],[8,30,9,30],[8,31,9,31],[19,21,19,22],[19,25,19,26],[19,30,19,31],[19,35,19,36],[19,40,19,41],[8,41,9,41],[6,19,6,22],[6,24,6,26],[6,28,6,31],[8,19,8,20],[8,21,9,21],[8,22,9,22],[8,25,9,25],[8,48,8,49],[8,33,8,34],[8,35,9,35],[8,36,9,36],[8,38,8,39],[8,40,9,40],[20,21,20,22],[20,25,20,26],[20,30,20,31],[19,45,19,46],[19,50,19,51],[19,55,19,56],[20,45,20,46],[20,50,20,51],[20,55,20,56],[20,60,20,61],[6,63,6,66],[19,65,19,66],[8,61,9,61],[19,60,19,61],[6,58,6,61],[8,58,8,59],[8,60,9,60],[6,43,6,46],[6,48,6,51],[6,53,6,56],[8,50,9,50],[8,51,9,51],[8,53,8,54],[8,55,9,55],[8,56,9,56],[8,43,8,44],[8,45,9,45],[8,46,9,46],[19,70,19,71],[19,75,19,76],[20,65,20,66],[20,70,20,71],[20,75,20,76],[6,68,6,71],[6,73,6,76],[8,63,8,64],[8,65,9,65],[8,66,9,66],[8,68,8,69],[8,70,9,70],[8,71,9,71],[8,73,8,74],[8,75,9,75],[8,76,9,76]]}
[{"$f":"'1_Informações e outros'!C1","v":"Ministério da Mulher, da Família e dos Direitos Humanos\nSecretaria Nacional dos Direitos da Pessoa com Deficiência"}]
[]
["LAUDO / CHECK LIST DE ACESSIBILIDADE PARA AVALIAÇÃO DE CONFORMIDADE ÀS NORMAS DE ACESSIBILIDADE (CONFORME NBR 9050:2020) "]
[]
["UNIDADE / ÓRGÃO",null,{"$f":"'1_Informações e outros'!E5","v":"MINISTÉRIO DA MULHER, DA FAMÍLIA E DOS DIREITOS HUMANOS"}]
[]
[{"$f":"'1_Informações e outros'!M5","v":4},null,null,null,{"$f":"'4.1_Circul'!E7","v":"8º PAVTO"},null,null,null,null,{"$f":"'4.1_Circul'!J7","v":"9º PAVTO"},null,null,null,null,{"$f":"'4.1_Circul'!O7","v":"10º PAVTO"},null,null,null,null,{"$f":"'4.1_Circul'!T7","v":"TÉRREO"},null,null,null,null,null,null,null,null,{"$f":"'4.1_Circul'!AD7","v":"6º PAVTO"},null,null,null,null,{"$f":"'4.1_Circul'!AI7","v":"7º PAVTO"},null,null,null,null,{"$f":"'4.1_Circul'!AN7","v":"8º PAVTO"},null,null,null,null,{"$f":"'4.1_Circul'!AS7","v":"9º PAVTO"},null,null,null,null,{"$f":"'4.1_Circul'!AX7","v":"10º PAVTO"},null,null,null,null,{"$f":"'4.1_Circul'!BC7","v":"11º PAVTO"},null,null,null,null,{"$f":"'4.1_Circul'!BH7","v":"12º PAVTO"},null,null,null,null,{"$f":"'4.1_Circul'!BM7","v":"13º PAVTO"},null,null,null,null,{"$f":"'4.1_Circul'!BR7","v":"14º PAVTO"},null,null,null,null,{"$f":"'4.1_Circul'!BW7","v":"15º PAVTO"},null,null,null,null,{"$f":"'4.1_Circul'!CB7","v":"16º PAVTO"},null,null,null,null,{"$f":"'4.1_Circul'!CG7","v":"17º PAVTO"},null,null,null,null,{"$f":"'4.1_Circul'!CL7","v":"18º PAVTO"},null,null,null,null,{"$f":"'4.1_Circul'!CQ7","v":"19º PAVTO"},null,null,null,null,{"$f":"'4.1_Circul'!CV7","v":"20º PAVTO"},null,null,null,null,{"$f":"'4.1_Circul'!DA7","v":"21º PAVTO"},null,null,null,null,{"$f":"'4.1_Circul'!DF7","v":"22º PAVTO"},null,null,null,null,{"$f":"'4.1_Circul'!DK7","v":"23º PAVTO"},null,null,null,null,{"$f":"'4.1_Circul'!DP7","v":"24º PAVTO"},null,null,null,null,{"$f":"'4.1_Circul'!DU7","v":"25º PAVTO"}]
[]
["Item da NBR9050",null,"9. BIBLIOTECAS",null,"ATENDE NBR9050-2020",null,"NÃO SE APLICA","OBSERVAÇÕES",null,"ATENDE NBR9050-2020",null,"NÃO SE APLICA","OBSERVAÇÕES",null,"ATENDE NBR9050-2020",null,"NÃO SE APLICA","OBSERVAÇÕES",null,"ATENDE NBR9050-2020",null,"NÃO SE APLICA","OBSERVAÇÕES",null,null,"NÃO SE APLICA","OBSERVAÇÕES",null,"ATENDE NBR9050-2020",null,"NÃO SE APLICA","OBSERVAÇÕES",null,"ATENDE NBR9050-2020",null,"NÃO SE APLICA","OBSERVAÇÕES",null,"ATENDE NBR9050-2020",null,"NÃO SE APLICA","OBSERVAÇÕES",null,"ATENDE NBR9050-2020",null,"NÃO SE APLICA","OBSERVAÇÕES",null,"ATENDE NBR9050-2020",null,"NÃO SE APLICA","OBSERVAÇÕES",null,"ATENDE NBR9050-2020",null,"NÃO SE APLICA","OBSERVAÇÕES",null,"ATENDE NBR9050-2020",null,"NÃO SE APLICA","OBSERVAÇÕES",null,"ATENDE NBR9050-2020",null,"NÃO SE APLICA","OBSERVAÇÕES",null,"ATENDE NBR9050-2020",null,"NÃO SE APLICA","OBSERVAÇÕES",null,"ATENDE NBR9050-2020",null,"NÃO SE APLICA","OBSERVAÇÕES",null,"ATENDE NBR9050-2020",null,"NÃO SE APLICA","OBSERVAÇÕES",null,"ATENDE NBR9050-2020",null,"NÃO SE APLICA","OBSERVAÇÕES",null,"ATENDE NBR9050-2020",null,"NÃO SE APLICA","OBSERVAÇÕES",null,"ATENDE NBR9050-2020",null,"NÃO SE APLICA","OBSERVAÇÕES",null,"ATENDE NBR9050-2020",null,"NÃO SE APLICA","OBSERVAÇÕES",null,"ATENDE NBR9050-2020",null,"NÃO SE APLICA","OBSERVAÇÕES",null,"ATENDE NBR9050-2020",null,"NÃO SE APLICA","OBSERVAÇÕES",null,"ATENDE NBR9050-2020",null,"NÃO SE APLICA","OBSERVAÇÕES",null,"ATENDE NBR9050-2020",null,"NÃO SE APLICA","OBSERVAÇÕES",null,"ATENDE NBR9050-2020",null,"NÃO SE APLICA","OBSERVAÇÕES"]
[null,null,null,null,"SIM","NÃO",null,null,null,"SIM","NÃO",null,null,null,"SIM","NÃO",null,null,null,"SIM","NÃO",null,null,null,"NÃO",null,null,null,"SIM","NÃO",null,null,null,"SIM","NÃO",null,null,null,"SIM","NÃO",null,null,null,"SIM","NÃO",null,null,null,"SIM","NÃO",null,null,null,"SIM","NÃO",null,null,null,"SIM","NÃO",null,null,null,"SIM","NÃO",null,null,null,"SIM","NÃO",null,null,null,"SIM","NÃO",null,null,null,"SIM","NÃO",null,null,null,"SIM","NÃO",null,null,null,"SIM","NÃO",null,null,null,"SIM","NÃO",null,null,null,"SIM","NÃO",null,null,null,"SIM","NÃO",null,null,null,"SIM","NÃO",null,null,null,"SIM","NÃO",null,null,null,"SIM","NÃO",null,null,null,"SIM","NÃO"]
[null,"a)","Existe Biblioteca?",null,null,null,"X",null,null,null,null,"X",null,null,null,null,"X",null,null,null,null,"X"]
["10.16","b)","Os locais de pesquisa, salas de estudo e leitura, terminais de consulta são acessíveis?",null,null,null,{"$f":"IF(OR(F$11=\"X\",G$11=\"X\"),\"X\",\"\")","v":"X"},null,null,null,null,{"$f":"IF(OR(K$11=\"X\",L$11=\"X\"),\"X\",\"\")","v":"X"},null,null,null,null,{"$f":"IF(OR(P$11=\"X\",Q$11=\"X\"),\"X\",\"\")","v":"X"},null,null,null,null,{"$f":"IF(OR(U$11=\"X\",V$11=\"X\"),\"X\",\"\")","v":"X"},null,null,null,{"$f":"IF(OR(Y$11=\"X\",Z$11=\"X\"),\"X\",\"\")","v":""},null,null,null,null,{"$f":"IF(OR(AD$11=\"X\",AE$11=\"X\"),\"X\",\"\")","v":""},null,null,null,null,{"$f":"IF(OR(AI$11=\"X\",AJ$11=\"X\"),\"X\",\"\")","v":""},null,null,null,null,{"$f":"IF(OR(AN$11=\"X\",AO$11=\"X\"),\"X\",\"\")","v":""},null,null,null,null,{"$f":"IF(OR(AS$11=\"X\",AT$11=\"X\"),\"X\",\"\")","v":""},null,null,null,null,{"$f":"IF(OR(AX$11=\"X\",AY$11=\"X\"),\"X\",\"\")","v":""},null,null,null,null,{"$f":"IF(OR(BC$11=\"X\",BD$11=\"X\"),\"X\",\"\")","v":""},null,null,null,null,{"$f":"IF(OR(BH$11=\"X\",BI$11=\"X\"),\"X\",\"\")","v":""},null,null,null,null,{"$f":"IF(OR(BM$11=\"X\",BN$11=\"X\"),\"X\",\"\")","v":""},null,null,null,null,{"$f":"IF(OR(BR$11=\"X\",BS$11=\"X\"),\"X\",\"\")","v":""},null,null,null,null,{"$f":"IF(OR(BW$11=\"X\",BX$11=\"X\"),\"X\",\"\")","v":""},null,null,null,null,{"$f":"IF(OR(CB$11=\"X\",CC$11=\"X\"),\"X\",\"\")","v":""},null,null,null,null,{"$f":"IF(OR(CG$11=\"X\",CH$11=\"X\"),\"X\",\"\")","v":""},null,null,null,null,{"$f":"IF(OR(CL$11=\"X\",CM$11=\"X\"),\"X\",\"\")","v":""},null,null,null,null,{"$f":"IF(OR(CQ$11=\"X\",CR$11=\"X\"),\"X\",\"\")","v":""},null,null,null,null,{"$f":"IF(OR(CV$11=\"X\",CW$11=\"X\"),\"X\",\"\")","v":""},null,null,null,null,{"$f":"IF(OR(DA$11=\"X\",DB$11=\"X\"),\"X\",\"\")","v":""},null,null,null,null,{"$f":"IF(OR(DF$11=\"X\",DG$11=\"X\"),\"X\",\"\")","v":""},null,null,null,null,{"$f":"IF(OR(DK$11=\"X\",DL$11=\"X\"),\"X\",\"\")","v":""},null,null,null,null,{"$f":"IF(OR(DP$11=\"X\",DQ$11=\"X\"),\"X\",\"\")","v":""},null,null,null,null,{"$f":"IF(OR(DU$11=\"X\",DV$11=\"X\"),\"X\",\"\")","v":""}]
["4.3","c)","Possui largura mínima de circulação de 0,90 m?",null,null,null,{"$f":"IF(OR(F$11=\"X\",G$11=\"X\"),\"X\",\"\")","v":"X"},null,null,null,null,{"$f":"IF(OR(K$11=\"X\",L$11=\"X\"),\"X\",\"\")","v":"X"},null,null,null,null,{"$f":"IF(OR(P$11=\"X\",Q$11=\"X\"),\"X\",\"\")","v":"X"},null,null,null,null,{"$f":"IF(OR(U$11=\"X\",V$11=\"X\"),\"X\",\"\")","v":"X"},null,null,null,{"$f":"IF(OR(Y$11=\"X\",Z$11=\"X\"),\"X\",\"\")","v":""},null,null,null,null,{"$f":"IF(OR(AD$11=\"X\",AE$11=\"X\"),\"X\",\"\")","v":""},null,null,null,null,{"$f":"IF(OR(AI$11=\"X\",AJ$11=\"X\"),\"X\",\"\")","v":""},null,null,null,null,{"$f":"IF(OR(AN$11=\"X\",AO$11=\"X\"),\"X\",\"\")","v":""},null,null,null,null,{"$f":"IF(OR(AS$11=\"X\",AT$11=\"X\"),\"X\",\"\")","v":""},null,null,null,null,{"$f":"IF(OR(AX$11=\"X\",AY$11=\"X\"),\"X\",\"\")","v":""},null,null,null,null,{"$f":"IF(OR(BC$11=\"X\",BD$11=\"X\"),\"X\",\"\")","v":""},null,null,null,null,{"$f":"IF(OR(BH$11=\"X\",BI$11=\"X\"),\"X\",\"\")","v":""},null,null,null,null,{"$f":"IF(OR(BM$11=\"X\",BN$11=\"X\"),\"X\",\"\")","v":""},null,null,null,null,{"$f":"IF(OR(BR$11=\"X\",BS$11=\"X\"),\"X\",\"\")","v":""},null,null,null,null,{"$f":"IF(OR(BW$11=\"X\",BX$11=\"X\"),\"X\",\"\")","v":""},null,null,null,null,{"$f":"IF(OR(CB$11=\"X\",CC$11=\"X\"),\"X\",\"\")","v":""},null,null,null,null,{"$f":"IF(OR(CG$11=\"X\",CH$11=\"X\"),\"X\",\"\")","v":""},null,null,null,null,{"$f":"IF(OR(CL$11=\"X\",CM$11=\"X\"),\"X\",\"\")","v":""},null,null,null,null,{"$f":"IF(OR(CQ$11=\"X\",CR$11=\"X\"),\"X\",\"\")","v":""},null,null,null,null,{"$f":"IF(OR(CV$11=\"X\",CW$11=\"X\"),\"X\",\"\")","v":""},null,null,null,null,{"$f":"IF(OR(DA$11=\"X\",DB$11=\"X\"),\"X\",\"\")","v":""},null,null,null,null,{"$f":"IF(OR(DF$11=\"X\",DG$11=\"X\"),\"X\",\"\")","v":""},null,null,null,null,{"$f":"IF(OR(DK$11=\"X\",DL$11=\"X\"),\"X\",\"\")","v":""},null,null,null,null,{"$f":"IF(OR(DP$11=\"X\",DQ$11=\"X\"),\"X\",\"\")","v":""},null,null,null,null,{"$f":"IF(OR(DU$11=\"X\",DV$11=\"X\"),\"X\",\"\")","v":""}]
["10.16.2","d)","Possui 5% das mesas acessíveis, com no mínimo uma?",null,null,null,"X",null,null,null,null,"X",null,null,null,null,"X",null,null,null,null,"X",null,null,null,"",null,null,null,null,"",null,null,null,null,"",null,null,null,null,"",null,null,null,null,"",null,null,null,null,"",null,null,null,null,"",null,null,null,null,"",null,null,null,null,"",null,null,null,null,"",null,null,null,null,"",null,null,null,null,"",null,null,null,null,"",null,null,null,null,"",null,null,null,null,"",null,null,null,null,"",null,null,null,null,"",null,null,null,null,"",null,null,null,null,"",null,null,null,null,"",null,null,null,null,""]
["10.16.6","e)","Possui 5% dos terminais de consulta acessíveis?",null,null,null,"X",null,null,null,null,"X",null,null,null,null,"X",null,null,null,null,"X",null,null,null,"",null,null,null,null,"",null,null,null,null,"",null,null,null,null,"",null,null,null,null,"",null,null,null,null,"",null,null,null,null,"",null,null,null,null,"",null,null,null,null,"",null,null,null,null,"",null,null,null,null,"",null,null,null,null,"",null,null,null,null,"",null,null,null,null,"",null,null,null,null,"",null,null,null,null,"",null,null,null,null,"",null,null,null,null,"",null,null,null,null,"",null,null,null,null,"",null,null,null,null,""]
["10.16.3","f)","A distância entre as estantes possui, no mínimo, 0,90 m da largura?",null,null,null,"X",null,null,null,null,"X",null,null,null,null,"X",null,null,null,null,"X",null,null,null,"",null,null,null,null,"",null,null,null,null,"",null,null,null,null,"",null,null,null,null,"",null,null,null,null,"",null,null,null,null,"",null,null,null,null,"",null,null,null,null,"",null,null,null,null,"",null,null,null,null,"",null,null,null,null,"",null,null,null,null,"",null,null,null,null,"",null,null,null,null,"",null,null,null,null,"",null,null,null,null,"",null,null,null,null,"",null,null,null,null,"",null,null,null,null,"",null,null,null,null,""]
["10.16.3","g)","Nos corredores entre as estantes, existe, a cada 15 m, um local que permite giro de 360° (diâmetro de 1,50 m) para a cadeira de rodas?",null,null,null,"X",null,null,null,null,"X",null,null,null,null,"X",null,null,null,null,"X",null,null,null,"",null,null,null,null,"",null,null,null,null,"",null,null,null,null,"",null,null,null,null,"",null,null,null,null,"",null,null,null,null,"",null,null,null,null,"",null,null,null,null,"",null,null,null,null,"",null,null,null,null,"",null,null,null,null,"",null,null,null,null,"",null,null,null,null,"",null,null,null,null,"",null,null,null,null,"",null,null,null,null,"",null,null,null,null,"",null,null,null,null,"",null,null,null,null,"",null,null,null,null,""]
["10.16.4","h)","A altura de utilização das prateleiras está entre 0,40 m e 1,20 m do piso acabado?",null,null,null,"X",null,null,null,null,"X",null,null,null,null,"X",null,null,null,null,"X",null,null,null,"",null,null,null,null,"",null,null,null,null,"",null,null,null,null,"",null,null,null,null,"",null,null,null,null,"",null,null,null,null,"",null,null,null,null,"",null,null,null,null,"",null,null,null,null,"",null,null,null,null,"",null,null,null,null,"",null,null,null,null,"",null,null,null,null,"",null,null,null,null,"",null,null,null,null,"",null,null,null,null,"",null,null,null,null,"",null,null,null,null,"",null,null,null,null,"",null,null,null,null,""]
[]
[null,null,null,null,"SIM","NÃO","JUSTIFICATIVA",null,null,"SIM","NÃO","JUSTIFICATIVA",null,null,"SIM","NÃO","JUSTIFICATIVA",null,null,"SIM","NÃO","JUSTIFICATIVA",null,null,"NÃO","JUSTIFICATIVA",null,null,"SIM","NÃO","JUSTIFICATIVA",null,null,"SIM","NÃO","JUSTIFICATIVA",null,null,"SIM","NÃO","JUSTIFICATIVA",null,null,"SIM","NÃO","JUSTIFICATIVA",null,null,"SIM","NÃO","JUSTIFICATIVA",null,null,"SIM","NÃO","JUSTIFICATIVA",null,null,"SIM","NÃO","JUSTIFICATIVA",null,null,"SIM","NÃO","JUSTIFICATIVA",null,null,"SIM","NÃO","JUSTIFICATIVA",null,null,"SIM","NÃO","JUSTIFICATIVA",null,null,"SIM","NÃO","JUSTIFICATIVA",null,null,"SIM","NÃO","JUSTIFICATIVA",null,null,"SIM","NÃO","JUSTIFICATIVA",null,null,"SIM","NÃO","JUSTIFICATIVA",null,null,"SIM","NÃO","JUSTIFICATIVA",null,null,"SIM","NÃO","JUSTIFICATIVA",null,null,"SIM","NÃO","JUSTIFICATIVA",null,null,"SIM","NÃO","JUSTIFICATIVA",null,null,"SIM","NÃO","JUSTIFICATIVA",null,null,"SIM","NÃO","JUSTIFICATIVA"]
[null,null,"NECESSITA PROJETO ?",null,null,"X",null,null,null,null,"X",null,null,null,null,"X",null,null,null,null,"X"]

{"sheet":"10_Auditórios","index":17,"n_rows":33,"n_cols":128,"rows_kept":33,"cut":false,"hidden":false,"merged":[[32,106,32,107],[32,111,32,112],[32,116,32,117],[32,121,32,122],[32,126,32,127],[32,81,32,82],[32,86,32,87],[32,91,32,92],[32,96,32,97],[32,101,32,102],[31,106,31,107],[31,111,31,112],[31,116,31,117],[31,121,31,122],[31,126,31,127],[31,81,31,82],[31,86,31,87],[31,91,31,92],[31,96,31,97],[31,101,31,102],[8,121,9,121],[8,122,9,122],[8,124,8,125],[8,126,9,126],[8,127,9,127],[8,112,9,112],[8,114,8,115],[8,116,9,116],[8,117,9,117],[8,119,8,120],[8,104,8,105],[8,106,9,106],[8,107,9,107],[8,109,8,110],[8,111,9,111],[8,96,9,96],[8,97,9,97],[8,99,8,100],[8,101,9,101],[8,102,9,102],[8,87,9,87],[8,89,8,90],[8,91,9,91],[8,92,9,92],[8,94,8,95],[8,79,8,80],[8,81,9,81],[8,82,9,82],[8,84,8,85],[8,86,9,86],[6,104,6,107],[6,109,6,112],[6,114,6,117],[6,119,6,122],[6,124,6,127],[6,79,6,82],[6,84,6,87],[6,89,6,92],[6,94,6,97],[6,99,6,102],[6,9,6,12],[31,6,31,7],[31,11,31,12],[31,16,31,17],[32,6,32,7],[32,11,32,12],[32,16,32,17],[8,17,9,17],[8,12,9,12],[8,7,9,7],[0,0,0,2],[2,0,2,3],[6,14,6,17],[6,19,6,22],[6,24,6,27],[6,29,6,32],[8,19,8,20],[8,21,9,21],[8,22,9,22],[8,24,8,25],[8,26,9,26],[8,27,9,27],[8,29,8,30],[8,31,9,31],[8,32,9,32],[8,0,9,0],[8,2,9,2],[8,4,8,5],[8,6,9,6],[8,9,8,10],[8,11,9,11],[8,14,8,15],[8,16,9,16],[6,4,6,7],[31,21,31,22],[31,26,31,27],[31,31,31,32],[32,21,32,22],[32,26,32,27],[32,31,32,32],[6,34,6,37],[6,39,6,42],[6,44,6,47],[31,36,31,37],[31,41,31,42],[31,46,31,47],[6,49,6,52],[6,54,6,57],[6,59,6,62],[8,34,8,35],[8,36,9,36],[8,37,9,37],[8,39,8,40],[8,41,9,41],[8,42,9,42],[8,44,8,45],[8,46,9,46],[8,47,9,47],[8,49,8,50],[8,51,9,51],[8,52,9,52],[8,54,8,55],[8,56,9,56],[8,57,9,57],[8,59,8,60],[8,61,9,61],[8,62,9,62],[31,51,31,52],[31,56,31,57],[31,61,31,62],[31,66,31,67],[31,71,31,72],[31,76,31,77],[32,36,32,37],[32,41,32,42],[32,46,32,47],[32,51,32,52],[32,56,32,57],[32,66,32,67],[32,71,32,72],[32,76,32,77],[32,61,32,62],[6,64,6,67],[6,69,6,72],[6,74,6,77],[8,64,8,65],[8,66,9,66],[8,67,9,67],[8,69,8,70],[8,71,9,71],[8,72,9,72],[8,74,8,75],[8,76,9,76],[8,77,9,77]]}
[{"$f":"'1_Informações e outros'!C1","v":"Ministério da Mulher, da Família e dos Direitos Humanos\nSecretaria Nacional dos Direitos da Pessoa com Deficiência"}]
[]
["LAUDO / CHECK LIST DE ACESSIBILIDADE PARA AVALIAÇÃO DE CONFORMIDADE ÀS NORMAS DE ACESSIBILIDADE (CONFORME NBR 9050:2020) "]
[]
["UNIDADE / ÓRGÃO",null,{"$f":"'1_Informações e outros'!E5","v":"MINISTÉRIO DA MULHER, DA FAMÍLIA E DOS DIREITOS HUMANOS"}]
[]
[{"$f":"'1_Informações e outros'!M5","v":4},null,null,null,{"$f":"'4.1_Circul'!E7","v":"8º PAVTO"},null,null,null,null,{"$f":"'4.1_Circul'!J7","v":"9º PAVTO"},null,null,null,null,{"$f":"'4.1_Circul'!O7","v":"10º PAVTO"},null,null,null,null,{"$f":"'4.1_Circul'!T7","v":"TÉRREO"},null,null,null,null,{"$f":"'4.1_Circul'!Y7","v":"5º PAVTO"},null,null,null,null,{"$f":"'4.1_Circul'!AD7","v":"6º PAVTO"},null,null,null,null,{"$f":"'4.1_Circul'!AI7","v":"7º PAVTO"},null,null,null,null,{"$f":"'4.1_Circul'!AN7","v":"8º PAVTO"},null,null,null,null,{"$f":"'4.1_Circul'!AS7","v":"9º PAVTO"},null,null,null,null,{"$f":"'4.1_Circul'!AX7","v":"10º PAVTO"},null,null,null,null,{"$f":"'4.1_Circul'!BC7","v":"11º PAVTO"},null,null,null,null,{"$f":"'4.1_Circul'!BH7","v":"12º PAVTO"},null,null,null,null,{"$f":"'4.1_Circul'!BM7","v":"13º PAVTO"},null,null,null,null,{"$f":"'4.1_Circul'!BR7","v":"14º PAVTO"},null,null,null,null,{"$f":"'4.1_Circul'!BW7","v":"15º PAVTO"},null,null,null,null,{"$f":"'4.1_Circul'!CB7","v":"16º PAVTO"},null,null,null,null,{"$f":"'4.1_Circul'!CG7","v":"17º PAVTO"},null,null,null,null,{"$f":"'4.1_Circul'!CL7","v":"18º PAVTO"},null,null,null,null,{"$f":"'4.1_Circul'!CQ7","v":"19º PAVTO"},null,null,null,null,{"$f":"'4.1_Circul'!CV7","v":"20º PAVTO"},null,null,null,null,{"$f":"'4.1_Circul'!DA7","v":"21º PAVTO"},null,null,null,null,{"$f":"'4.1_Circul'!DF7","v":"22º PAVTO"},null,null,null,null,{"$f":"'4.1_Circul'!DK7","v":"23º PAVTO"},null,null,null,null,{"$f":"'4.1_Circul'!DP7","v":"24º PAVTO"},null,null,null,null,{"$f":"'4.1_Circul'!DU7","v":"25º PAVTO"}]
[]
["Item da NBR9050",null,"10. AUDITÓRIOS E SIMILARES",null,"ATENDE NBR9050-2020",null,"NÃO SE APLICA","OBSERVAÇÕES",null,"ATENDE NBR9050-2020",null,"NÃO SE APLICA","OBSERVAÇÕES",null,"ATENDE NBR9050-2020",null,"NÃO SE APLICA","OBSERVAÇÕES",null,"ATENDE NBR9050-2020",null,"NÃO SE APLICA","OBSERVAÇÕES",null,"ATENDE NBR9050-2020",null,"NÃO SE APLICA","OBSERVAÇÕES",null,"ATENDE NBR9050-2020",null,"NÃO SE APLICA","OBSERVAÇÕES",null,"ATENDE NBR9050-2020",null,"NÃO SE APLICA","OBSERVAÇÕES",null,"ATENDE NBR9050-2020",null,"NÃO SE APLICA","OBSERVAÇÕES",null,"ATENDE NBR9050-2020",null,"NÃO SE APLICA","OBSERVAÇÕES",null,"ATENDE NBR9050-2020",null,"NÃO SE APLICA","OBSERVAÇÕES",null,"ATENDE NBR9050-2020",null,"NÃO SE APLICA","OBSERVAÇÕES",null,"ATENDE NBR9050-2020",null,"NÃO SE APLICA","OBSERVAÇÕES",null,"ATENDE NBR9050-2020",null,"NÃO SE APLICA","OBSERVAÇÕES",null,"ATENDE NBR9050-2020",null,"NÃO SE APLICA","OBSERVAÇÕES",null,"ATENDE NBR9050-2020",null,"NÃO SE APLICA","OBSERVAÇÕES",null,"ATENDE NBR9050-2020",null,"NÃO SE APLICA","OBSERVAÇÕES",null,"ATENDE NBR9050-2020",null,"NÃO SE APLICA","OBSERVAÇÕES",null,"ATENDE NBR9050-2020",null,"NÃO SE APLICA","OBSERVAÇÕES",null,"ATENDE NBR9050-2020",null,"NÃO SE APLICA","OBSERVAÇÕES",null,"ATENDE NBR9050-2020",null,"NÃO SE APLICA","OBSERVAÇÕES",null,"ATENDE NBR9050-2020",null,"NÃO SE APLICA","OBSERVAÇÕES",null,"ATENDE NBR9050-2020",null,"NÃO SE APLICA","OBSERVAÇÕES",null,"ATENDE NBR9050-2020",null,"NÃO SE APLICA","OBSERVAÇÕES",null,"ATENDE NBR9050-2020",null,"NÃO SE APLICA","OBSERVAÇÕES",null,"ATENDE NBR9050-2020",null,"NÃO SE APLICA","OBSERVAÇÕES"]
[null,null,null,null,"SIM","NÃO",null,null,null,"SIM","NÃO",null,null,null,"SIM","NÃO",null,null,null,"SIM","NÃO",null,null,null,"SIM","NÃO",null,null,null,"SIM","NÃO",null,null,null,"SIM","NÃO",null,null,null,"SIM","NÃO",null,null,null,"SIM","NÃO",null,null,null,"SIM","NÃO",null,null,null,"SIM","NÃO",null,null,null,"SIM","NÃO",null,null,null,"SIM","NÃO",null,null,null,"SIM","NÃO",null,null,null,"SIM","NÃO",null,null,null,"SIM","NÃO",null,null,null,"SIM","NÃO",null,null,null,"SIM","NÃO",null,null,null,"SIM","NÃO",null,null,null,"SIM","NÃO",null,null,null,"SIM","NÃO",null,null,null,"SIM","NÃO",null,null,null,"SIM","NÃO",null,null,null,"SIM","NÃO",null,null,null,"SIM","NÃO"]
[null,"a)","Existe auditório?",null,"X",null,null,"Auditório Ana Paula Crosara de Resende - sala 843.",null,null,"X",null,null,null,"X",null,null,"Ambiente de educação corporativa - 1045.",null,null,null,"X"]
["10.3.1 e\nDecreto nº 5.296/04","b)","A quantidade de espaços reservados para pessoas em cadeira de rodas na área destinada ao público é de 2% ou 20 espaços mais 1% do que exceder mil lugares (a depender da capacidade de lotação conforme art. 23 do Decreto nº 5.296/04)?",null,null,"X",null,"Não existe espaços reservados ou identificados para pessoas em cadeira de rodas, deve possuir espaços reservados para pessoas com deficiência ou com mobilidade reduzida.",null,null,null,"X",null,null,null,"X",{"$f":"IF(OR(P$11=\"X\",Q$11=\"X\"),\"X\",\"\")","v":""},"Não existe espaços reservados ou identificados para pessoas em cadeira de rodas, deve possuir espaços reservados para pessoas com deficiência ou com mobilidade reduzida.",null,null,null,{"$f":"IF(OR(U$11=\"X\",V$11=\"X\"),\"X\",\"\")","v":"X"},null,null,null,null,{"$f":"IF(OR(Z$11=\"X\",AA$11=\"X\"),\"X\",\"\")","v":""},null,null,null,null,{"$f":"IF(OR(AE$11=\"X\",AF$11=\"X\"),\"X\",\"\")","v":""},null,null,null,null,{"$f":"IF(OR(AJ$11=\"X\",AK$11=\"X\"),\"X\",\"\")","v":""},null,null,null,null,{"$f":"IF(OR(AO$11=\"X\",AP$11=\"X\"),\"X\",\"\")","v":""},null,null,null,null,{"$f":"IF(OR(AT$11=\"X\",AU$11=\"X\"),\"X\",\"\")","v":""},null,null,null,null,{"$f":"IF(OR(AY$11=\"X\",AZ$11=\"X\"),\"X\",\"\")","v":""},null,null,null,null,{"$f":"IF(OR(BD$11=\"X\",BE$11=\"X\"),\"X\",\"\")","v":""},null,null,null,null,{"$f":"IF(OR(BI$11=\"X\",BJ$11=\"X\"),\"X\",\"\")","v":""},null,null,null,null,{"$f":"IF(OR(BN$11=\"X\",BO$11=\"X\"),\"X\",\"\")","v":""},null,null,null,null,{"$f":"IF(OR(BS$11=\"X\",BT$11=\"X\"),\"X\",\"\")","v":""},null,null,null,null,{"$f":"IF(OR(BX$11=\"X\",BY$11=\"X\"),\"X\",\"\")","v":""},null,null,null,null,{"$f":"IF(OR(CC$11=\"X\",CD$11=\"X\"),\"X\",\"\")","v":""},null,null,null,null,{"$f":"IF(OR(CH$11=\"X\",CI$11=\"X\"),\"X\",\"\")","v":""},null,null,null,null,{"$f":"IF(OR(CM$11=\"X\",CN$11=\"X\"),\"X\",\"\")","v":""},null,null,null,null,{"$f":"IF(OR(CR$11=\"X\",CS$11=\"X\"),\"X\",\"\")","v":""},null,null,null,null,{"$f":"IF(OR(CW$11=\"X\",CX$11=\"X\"),\"X\",\"\")","v":""},null,null,null,null,{"$f":"IF(OR(DB$11=\"X\",DC$11=\"X\"),\"X\",\"\")","v":""},null,null,null,null,{"$f":"IF(OR(DG$11=\"X\",DH$11=\"X\"),\"X\",\"\")","v":""},null,null,null,null,{"$f":"IF(OR(DL$11=\"X\",DM$11=\"X\"),\"X\",\"\")","v":""},null,null,null,null,{"$f":"IF(OR(DQ$11=\"X\",DR$11=\"X\"),\"X\",\"\")","v":""},null,null,null,null,{"$f":"IF(OR(DV$11=\"X\",DW$11=\"X\"),\"X\",\"\")","v":""}]
["10.3.4","c)","Os espaços para pessoas com cadeira de rodas possuem dimensões mínimas de 0,80 m x 1,20 m, acrescidos de uma faixa de no mínimo 0,30 m de afastamento das fileiras de trás e da frente e estão instalados em piso plano horizontal?",null,null,"X",null,"Não existe espaços reservados ou identificados para pessoas em cadeira de rodas.",null,null,null,"X",null,null,null,"X",{"$f":"IF(OR(P$11=\"X\",Q$11=\"X\"),\"X\",\"\")","v":""},"Não existe espaços reservados ou identificados para pessoas em cadeira de rodas.",null,null,null,{"$f":"IF(OR(U$11=\"X\",V$11=\"X\"),\"X\",\"\")","v":"X"},null,null,null,null,{"$f":"IF(OR(Z$11=\"X\",AA$11=\"X\"),\"X\",\"\")","v":""},null,null,null,null,{"$f":"IF(OR(AE$11=\"X\",AF$11=\"X\"),\"X\",\"\")","v":""},null,null,null,null,{"$f":"IF(OR(AJ$11=\"X\",AK$11=\"X\"),\"X\",\"\")","v":""},null,null,null,null,{"$f":"IF(OR(AO$11=\"X\",AP$11=\"X\"),\"X\",\"\")","v":""},null,null,null,null,{"$f":"IF(OR(AT$11=\"X\",AU$11=\"X\"),\"X\",\"\")","v":""},null,null,null,null,{"$f":"IF(OR(AY$11=\"X\",AZ$11=\"X\"),\"X\",\"\")","v":""},null,null,null,null,{"$f":"IF(OR(BD$11=\"X\",BE$11=\"X\"),\"X\",\"\")","v":""},null,null,null,null,{"$f":"IF(OR(BI$11=\"X\",BJ$11=\"X\"),\"X\",\"\")","v":""},null,null,null,null,{"$f":"IF(OR(BN$11=\"X\",BO$11=\"X\"),\"X\",\"\")","v":""},null,null,null,null,{"$f":"IF(OR(BS$11=\"X\",BT$11=\"X\"),\"X\",\"\")","v":""},null,null,null,null,{"$f":"IF(OR(BX$11=\"X\",BY$11=\"X\"),\"X\",\"\")","v":""},null,null,null,null,{"$f":"IF(OR(CC$11=\"X\",CD$11=\"X\"),\"X\",\"\")","v":""},null,null,null,null,{"$f":"IF(OR(CH$11=\"X\",CI$11=\"X\"),\"X\",\"\")","v":""},null,null,null,null,{"$f":"IF(OR(CM$11=\"X\",CN$11=\"X\"),\"X\",\"\")","v":""},null,null,null,null,{"$f":"IF(OR(CR$11=\"X\",CS$11=\"X\"),\"X\",\"\")","v":""},null,null,null,null,{"$f":"IF(OR(CW$11=\"X\",CX$11=\"X\"),\"X\",\"\")","v":""},null,null,null,null,{"$f":"IF(OR(DB$11=\"X\",DC$11=\"X\"),\"X\",\"\")","v":""},null,null,null,null,{"$f":"IF(OR(DG$11=\"X\",DH$11=\"X\"),\"X\",\"\")","v":""},null,null,null,null,{"$f":"IF(OR(DL$11=\"X\",DM$11=\"X\"),\"X\",\"\")","v":""},null,null,null,null,{"$f":"IF(OR(DQ$11=\"X\",DR$11=\"X\"),\"X\",\"\")","v":""},null,null,null,null,{"$f":"IF(OR(DV$11=\"X\",DW$11=\"X\"),\"X\",\"\")","v":""}]
["10.3.1 e\nDecreto nº 5.296/04","d)","A quantidade de assentos para pessoas com mobilidade reduzida na área destinada ao público atende é de 2% ou 20 assentos mais 1% do que exceder mil lugares (a depender da capacidade de lotação conforme art.23 do Decreto nº 5.296/04)?",null,null,"X",null,"Não existe assentos reservados ou identificados para pessoas com mobilidade reduzida.",null,null,null,"X",null,null,null,"X","","Não existe assentos reservados ou identificados para pessoas com mobilidade reduzida.",null,null,null,"X",null,null,null,null,"",null,null,null,null,"",null,null,null,null,"",null,null,null,null,"",null,null,null,null,"",null,null,null,null,"",null,null,null,null,"",null,null,null,null,"",null,null,null,null,"",null,null,null,null,"",null,null,null,null,"",null,null,null,null,"",null,null,null,null,"",null,null,null,null,"",null,null,null,null,"",null,null,null,null,"",null,null,null,null,"",null,null,null,null,"",null,null,null,null,"",null,null,null,null,"",null,null,null,null,""]
["10.3.4.2","e)","O assento para pessoa com mobilidade reduzida possui um espaço livre frontal de  no mínimo 0,60 m?",null,null,"X",null,"Não possui assentos destinados para pessoas com mobilidade reduzida e não tem demarcação do espaço livre, a configuração dos assentos não é fixos e permitem a fácil movimentação.",null,null,null,{"$f":"IF(OR(K$11=\"X\",L$11=\"X\"),\"X\",\"\")","v":"X"},null,null,null,"X","","Não existe assentos reservados ou identificados para pessoas com mobilidade reduzida.",null,null,null,"X",null,null,null,null,"",null,null,null,null,"",null,null,null,null,"",null,null,null,null,"",null,null,null,null,"",null,null,null,null,"",null,null,null,null,"",null,null,null,null,"",null,null,null,null,"",null,null,null,null,"",null,null,null,null,"",null,null,null,null,"",null,null,null,null,"",null,null,null,null,"",null,null,null,null,"",null,null,null,null,"",null,null,null,null,"",null,null,null,null,"",null,null,null,null,"",null,null,null,null,"",null,null,null,null,""]
["10.3.4.4\nDec. 5296/04","f)","Existem assentos para pessoa obesa (1% do total ou 10 assentos, a depender da capacidade de lotação conforme art. 23 do Decreto nº 5.296/04) com largura mínima de 0,75 m, profundidade entre 0,47 m e 0,51 m e altura do assento entre 0,41 m e 0,45 m?",null,null,"X",null,"Não existe assentos reservados ou identificados para pessoas obesas.",null,null,null,"X",null,null,null,"X","","Não existe assentos reservados ou identificados para pessoas obesas.",null,null,null,"X",null,null,null,null,"",null,null,null,null,"",null,null,null,null,"",null,null,null,null,"",null,null,null,null,"",null,null,null,null,"",null,null,null,null,"",null,null,null,null,"",null,null,null,null,"",null,null,null,null,"",null,null,null,null,"",null,null,null,null,"",null,null,null,null,"",null,null,null,null,"",null,null,null,null,"",null,null,null,null,"",null,null,null,null,"",null,null,null,null,"",null,null,null,null,"",null,null,null,null,"",null,null,null,null,""]
["10.3.4.4","g)","O assento para pessoa obesa possui um espaço livre frontal de no mínimo 0,60 m?",null,null,"X",null,"Não possui assentos destinados para pessoas obesa e não tem demarcação do espaço livre, a configuração dos assentos não são fixos e permitem a fácil movimentação.",null,null,null,"X",null,null,null,"X","","Não existe assentos reservados ou identificados para pessoas obesas.",null,null,null,"X",null,null,null,null,"",null,null,null,null,"",null,null,null,null,"",null,null,null,null,"",null,null,null,null,"",null,null,null,null,"",null,null,null,null,"",null,null,null,null,"",null,null,null,null,"",null,null,null,null,"",null,null,null,null,"",null,null,null,null,"",null,null,null,null,"",null,null,null,null,"",null,null,null,null,"",null,null,null,null,"",null,null,null,null,"",null,null,null,null,"",null,null,null,null,"",null,null,null,null,"",null,null,null,null,""]
["10.3.1","h)","Os locais destinados a pessoa com cadeira de rodas e os assentos para pessoa com mobilidade reduzida e pessoa obesa estão distribuídos pelo recinto?",null,null,"X",null,"Necessário fazer a distribuição dos assentos ou o agrupamento e a sinalização.",null,null,null,"X",null,null,null,"X","","Necessário fazer a distribuição dos assentos ou o agrupamento e a sinalização.",null,null,null,"X",null,null,null,null,"",null,null,null,null,"",null,null,null,null,"",null,null,null,null,"",null,null,null,null,"",null,null,null,null,"",null,null,null,null,"",null,null,null,null,"",null,null,null,null,"",null,null,null,null,"",null,null,null,null,"",null,null,null,null,"",null,null,null,null,"",null,null,null,null,"",null,null,null,null,"",null,null,null,null,"",null,null,null,null,"",null,null,null,null,"",null,null,null,null,"",null,null,null,null,"",null,null,null,null,""]
["10.3.5","i)","Existe espaço para cão-guia junto de um assento preferencial, com dimensões de 0,70 m de comprimento, 0,40 m de profundidade e 0,30 m de altura?",null,null,"X",null,"A NBR 9050 -2020: Deve ser previsto um espaço para cão-guia junto de um assento preferencial, com as dimensões de 0,70m de comprimento, 0,40m de profundidade e 0,30m de altura.",null,null,null,"X",null,null,null,"X","","A NBR 9050 -2020: Deve ser previsto um espaço para cão-guia junto de um assento preferencial, com as dimensões de 0,70m de comprimento, 0,40m de profundidade e 0,30m de altura.",null,null,null,"X",null,null,null,null,"",null,null,null,null,"",null,null,null,null,"",null,null,null,null,"",null,null,null,null,"",null,null,null,null,"",null,null,null,null,"",null,null,null,null,"",null,null,null,null,"",null,null,null,null,"",null,null,null,null,"",null,null,null,null,"",null,null,null,null,"",null,null,null,null,"",null,null,null,null,"",null,null,null,null,"",null,null,null,null,"",null,null,null,null,"",null,null,null,null,"",null,null,null,null,"",null,null,null,null,""]
["10.3.1","j)","Esses espaços estão localizados junto a assento para acompanhante?",null,null,"X",null,"Ao lado de cada espaço e assento deve se garantir no mínimo um assento companheiro.",null,null,null,"X",null,null,null,"X","","Ao lado de cada espaço e assento deve se garantir no mínimo um assento companheiro.",null,null,null,"X",null,null,null,null,"",null,null,null,null,"",null,null,null,null,"",null,null,null,null,"",null,null,null,null,"",null,null,null,null,"",null,null,null,null,"",null,null,null,null,"",null,null,null,null,"",null,null,null,null,"",null,null,null,null,"",null,null,null,null,"",null,null,null,null,"",null,null,null,null,"",null,null,null,null,"",null,null,null,null,"",null,null,null,null,"",null,null,null,null,"",null,null,null,null,"",null,null,null,null,"",null,null,null,null,""]
["10.3.1","k)","Esses locais estão indicados por sinalização?",null,null,"X",null,"Não possui sinalização, deve ser identificados.",null,null,null,"X",null,null,null,"X","","Não possui sinalização, deve ser identificados.",null,null,null,"X",null,null,null,null,"",null,null,null,null,"",null,null,null,null,"",null,null,null,null,"",null,null,null,null,"",null,null,null,null,"",null,null,null,null,"",null,null,null,null,"",null,null,null,null,"",null,null,null,null,"",null,null,null,null,"",null,null,null,null,"",null,null,null,null,"",null,null,null,null,"",null,null,null,null,"",null,null,null,null,"",null,null,null,null,"",null,null,null,null,"",null,null,null,null,"",null,null,null,null,"",null,null,null,null,""]
["10.3.2","l)","Esses locais garantem a visualização da atividade desenvolvida no palco, ou seja, atendendo a um ângulo visual de no máximo 30° a partir do limite superior da tela ou boca de cena até a linha do horizonte visual (altura de 1,15 m) do usuário?",null,"X",null,null,null,null,null,null,"X",null,null,"X",null,"",null,null,null,null,"X",null,null,null,null,"",null,null,null,null,"",null,null,null,null,"",null,null,null,null,"",null,null,null,null,"",null,null,null,null,"",null,null,null,null,"",null,null,null,null,"",null,null,null,null,"",null,null,null,null,"",null,null,null,null,"",null,null,null,null,"",null,null,null,null,"",null,null,null,null,"",null,null,null,null,"",null,null,null,null,"",null,null,null,null,"",null,null,null,null,"",null,null,null,null,"",null,null,null,null,"",null,null,null,null,""]
["10.3.1","m)","Estes locais estão localizados em uma rota acessível vinculada a uma rota de fuga?",null,"X",null,null,null,null,null,null,"X",null,null,"X",null,"",null,null,null,null,"X",null,null,null,null,"",null,null,null,null,"",null,null,null,null,"",null,null,null,null,"",null,null,null,null,"",null,null,null,null,"",null,null,null,null,"",null,null,null,null,"",null,null,null,null,"",null,null,null,null,"",null,null,null,null,"",null,null,null,null,"",null,null,null,null,"",null,null,null,null,"",null,null,null,null,"",null,null,null,null,"",null,null,null,null,"",null,null,null,null,"",null,null,null,null,"",null,null,null,null,"",null,null,null,null,""]
["5.5.1.2","n)","Há sinalização visual e sonora nas saídas de emergência?",null,"X",null,null,"Não existe sinalização sonora nas portas, há alarmes de incêndio na edificação que são os aviadores SONOROS em caso de emergência.",null,null,null,"X",null,null,null,"X","","Na sala 1045 - Ambiente de educação corporativa, possui sinalização de emergência divergente, direcionando a rota de fuga para uma porta que não existe saída, verificar as sinalizações de emergência, E não existe sinalização sonora nas portas, há alarmes de incêndio na edificação que são os aviadores SONOROS em caso de emergência.",null,null,null,"X",null,null,null,null,"",null,null,null,null,"",null,null,null,null,"",null,null,null,null,"",null,null,null,null,"",null,null,null,null,"",null,null,null,null,"",null,null,null,null,"",null,null,null,null,"",null,null,null,null,"",null,null,null,null,"",null,null,null,null,"",null,null,null,null,"",null,null,null,null,"",null,null,null,null,"",null,null,null,null,"",null,null,null,null,"",null,null,null,null,"",null,null,null,null,"",null,null,null,null,"",null,null,null,null,""]
["10.4.3 e\n10.4.4","o)","O palco possui acesso através de rampa ou equipamento eletromecânico para o usuário de cadeira de rodas?",null,"X",null,null,"A rampa de acesso não tem as medidas mínimas necessárias de 1,20m x 1,20m, que garante uma rotação de 90º, área de manobra da cadeiras de rodas.",null,null,null,"X",null,null,"X",null,"","A rampa de acesso não tem as medidas mínimas necessárias de 1,20m x 1,20m, que garante uma rotação de 90º, área de manobra de cadeiras de rodas.",null,null,null,"X",null,null,null,null,"",null,null,null,null,"",null,null,null,null,"",null,null,null,null,"",null,null,null,null,"",null,null,null,null,"",null,null,null,null,"",null,null,null,null,"",null,null,null,null,"",null,null,null,null,"",null,null,null,null,"",null,null,null,null,"",null,null,null,null,"",null,null,null,null,"",null,null,null,null,"",null,null,null,null,"",null,null,null,null,"",null,null,null,null,"",null,null,null,null,"",null,null,null,null,"",null,null,null,null,""]
["10.4.3","p)","A rampa para o palco possui largura mínima de 0,90 m, inclinação máxima de 16,66% para vencer uma altura máxima de 0,60 m ou inclinação máxima de 10% para vencer alturas superiores a 0,60 m?",null,"X",null,null,"Para o acesso a rampa deve ser garantido uma rotação de 90º o mínimo de área de manobra para cadeira de rodas.",null,null,null,"X",null,null,"X",null,"","Para o acesso a rampa deve ser garantido uma rotação de 90º o mínimo de área de manobra para cadeira de rodas.",null,null,null,"X",null,null,null,null,"",null,null,null,null,"",null,null,null,null,"",null,null,null,null,"",null,null,null,null,"",null,null,null,null,"",null,null,null,null,"",null,null,null,null,"",null,null,null,null,"",null,null,null,null,"",null,null,null,null,"",null,null,null,null,"",null,null,null,null,"",null,null,null,null,"",null,null,null,null,"",null,null,null,null,"",null,null,null,null,"",null,null,null,null,"",null,null,null,null,"",null,null,null,null,"",null,null,null,null,""]
["10.4.3","q)","A rampa possui guia de balizamento? (não é necessário guarda-corpo e corrimão)",null,"X",null,null,null,null,null,null,"X",null,null,"X",null,"",null,null,null,null,"X",null,null,null,null,"",null,null,null,null,"",null,null,null,null,"",null,null,null,null,"",null,null,null,null,"",null,null,null,null,"",null,null,null,null,"",null,null,null,null,"",null,null,null,null,"",null,null,null,null,"",null,null,null,null,"",null,null,null,null,"",null,null,null,null,"",null,null,null,null,"",null,null,null,null,"",null,null,null,null,"",null,null,null,null,"",null,null,null,null,"",null,null,null,null,"",null,null,null,null,"",null,null,null,null,""]
["5.4.6 e \nNBR 16537 (Seção 6) ","r)","O desnível entre o palco e a platéia está indicado com sinalização tátil de alerta no piso?",null,null,"X",null,"Não existe sinalização tátil de alerta no piso.",null,null,null,"X",null,null,null,"X","","Não existe sinalização tátil de alerta no piso.",null,null,null,"X",null,null,null,null,"",null,null,null,null,"",null,null,null,null,"",null,null,null,null,"",null,null,null,null,"",null,null,null,null,"",null,null,null,null,"",null,null,null,null,"",null,null,null,null,"",null,null,null,null,"",null,null,null,null,"",null,null,null,null,"",null,null,null,null,"",null,null,null,null,"",null,null,null,null,"",null,null,null,null,"",null,null,null,null,"",null,null,null,null,"",null,null,null,null,"",null,null,null,null,"",null,null,null,null,""]
["10.4.5 e\n5.2.8.1.6","s)","Há local, no palco, para posicionamento do intérprete de Libras identificado com o símbolo internacional de pessoas com deficiência auditiva (surdez)?",null,null,"X",null,"Não existe identificação correta para o intérprete de libras no palco, deve ser sinalizado com o símbolo internacional de pessoas com deficiência auditiva.",null,null,null,"X",null,null,null,"X","","Não existe identificação do local para o intérprete de libras no palco, deve ser sinalizado com o símbolo internacional de pessoas com deficiência auditiva.",null,null,null,"X",null,null,null,null,"",null,null,null,null,"",null,null,null,null,"",null,null,null,null,"",null,null,null,null,"",null,null,null,null,"",null,null,null,null,"",null,null,null,null,"",null,null,null,null,"",null,null,null,null,"",null,null,null,null,"",null,null,null,null,"",null,null,null,null,"",null,null,null,null,"",null,null,null,null,"",null,null,null,null,"",null,null,null,null,"",null,null,null,null,"",null,null,null,null,"",null,null,null,null,"",null,null,null,null,""]
["10.4.5 e\n5.2.8.1.6","t)","Há foco de luz posicionado de forma a iluminar o intérprete de Libras?",null,null,"X",null,"Não existe identificação do local para o intérprete de libras no palco, deve ser garantido um foco de luz posicionada de forma a iluminar o interprete de sinais, desde a cabeça até os joelhos.",null,null,null,"X",null,null,null,"X","","Não existe identificação do local para o intérprete de libras no palco, deve ser garantido um foco de luz posicionada de forma a iluminar o interprete de sinais, desde a cabeça até os joelhos.",null,null,null,"X",null,null,null,null,"",null,null,null,null,"",null,null,null,null,"",null,null,null,null,"",null,null,null,null,"",null,null,null,null,"",null,null,null,null,"",null,null,null,null,"",null,null,null,null,"",null,null,null,null,"",null,null,null,null,"",null,null,null,null,"",null,null,null,null,"",null,null,null,null,"",null,null,null,null,"",null,null,null,null,"",null,null,null,null,"",null,null,null,null,"",null,null,null,null,"",null,null,null,null,"",null,null,null,null,""]
[]
[null,null,null,null,"SIM","NÃO","JUSTIFICATIVA",null,null,"SIM","NÃO","JUSTIFICATIVA",null,null,"SIM","NÃO","JUSTIFICATIVA",null,null,"SIM","NÃO","JUSTIFICATIVA",null,null,"SIM","NÃO","JUSTIFICATIVA",null,null,"SIM","NÃO","JUSTIFICATIVA",null,null,"SIM","NÃO","JUSTIFICATIVA",null,null,"SIM","NÃO","JUSTIFICATIVA",null,null,"SIM","NÃO","JUSTIFICATIVA",null,null,"SIM","NÃO","JUSTIFICATIVA",null,null,"SIM","NÃO","JUSTIFICATIVA",null,null,"SIM","NÃO","JUSTIFICATIVA",null,null,"SIM","NÃO","JUSTIFICATIVA",null,null,"SIM","NÃO","JUSTIFICATIVA",null,null,"SIM","NÃO","JUSTIFICATIVA",null,null,"SIM","NÃO","JUSTIFICATIVA",null,null,"SIM","NÃO","JUSTIFICATIVA",null,null,"SIM","NÃO","JUSTIFICATIVA",null,null,"SIM","NÃO","JUSTIFICATIVA",null,null,"SIM","NÃO","JUSTIFICATIVA",null,null,"SIM","NÃO","JUSTIFICATIVA",null,null,"SIM","NÃO","JUSTIFICATIVA",null,null,"SIM","NÃO","JUSTIFICATIVA",null,null,"SIM","NÃO","JUSTIFICATIVA",null,null,"SIM","NÃO","JUSTIFICATIVA"]
[null,null,"NECESSITA PROJETO ?",null,null,"X","É necessário o planejamento para destruição dos assentos e espaços reservados, locais de eventos temporários devem possuir espaços reservados para pessoas em cadeira de rodas e pessoas com deficiência ou mobilidade reduzida. E deve estar identificado no palco a sinalização no piso, marcando o local para o interprete de libras e a utilização da sinalização com símbolo internacional de pessoas com deficiência auditiva. E deve garantir área 90º de rotação para acesso de pessoas em cadeira de rodas ao palco. Fazer todas as adequações indicadas em cada item.",null,null,null,"X",null,null,null,null,"X","É necessário o planejamento para destruição dos assentos e espaços reservados, locais de eventos temporários devem possuir espaços reservados para pessoas em cadeira de rodas e pessoas com deficiência ou mobilidade reduzida. E deve estar identificado no palco a sinalização no piso, marcando o local para o interprete de libras e a utilização da sinalização com símbolo internacional de pessoas com deficiência auditiva. E deve garantir área 90º de rotação para acesso de pessoas em cadeira de rodas ao palco. Fazer as correções de sinalização de emergência divergente, assim como todas as adequações indicadas em cada item.",null,null,null,"X"]

{"sheet":"11_Restaurantes e copas","index":18,"n_rows":26,"n_cols":128,"rows_kept":26,"cut":false,"hidden":false,"merged":[[25,106,25,107],[25,111,25,112],[25,116,25,117],[25,121,25,122],[25,126,25,127],[25,81,25,82],[25,86,25,87],[25,91,25,92],[25,96,25,97],[25,101,25,102],[24,106,24,107],[24,111,24,112],[24,116,24,117],[24,121,24,122],[24,126,24,127],[24,81,24,82],[24,86,24,87],[24,91,24,92],[24,96,24,97],[24,101,24,102],[8,121,9,121],[8,122,9,122],[8,124,8,125],[8,126,9,126],[8,127,9,127],[8,112,9,112],[8,114,8,115],[8,116,9,116],[8,117,9,117],[8,119,8,120],[8,104,8,105],[8,106,9,106],[8,107,9,107],[8,109,8,110],[8,111,9,111],[8,96,9,96],[8,97,9,97],[8,99,8,100],[8,101,9,101],[8,102,9,102],[8,87,9,87],[8,89,8,90],[8,91,9,91],[8,92,9,92],[8,94,8,95],[8,79,8,80],[8,81,9,81],[8,82,9,82],[8,84,8,85],[8,86,9,86],[6,104,6,107],[6,109,6,112],[6,114,6,117],[6,119,6,122],[6,124,6,127],[6,79,6,82],[6,84,6,87],[6,89,6,92],[6,94,6,97],[6,99,6,102],[24,6,24,7],[24,11,24,12],[24,16,24,17],[25,6,25,7],[25,11,25,12],[25,16,25,17],[8,11,9,11],[8,14,8,15],[8,16,9,16],[0,0,0,2],[2,0,2,3],[6,19,6,22],[6,24,6,27],[6,29,6,32],[8,19,8,20],[8,21,9,21],[8,22,9,22],[8,24,8,25],[8,26,9,26],[6,4,6,7],[6,9,6,12],[6,14,6,17],[8,17,9,17],[8,12,9,12],[8,7,9,7],[8,0,9,0],[8,2,9,2],[8,4,8,5],[8,6,9,6],[8,9,8,10],[6,34,6,37],[6,39,6,42],[25,36,25,37],[25,41,25,42],[8,27,9,27],[8,29,8,30],[8,31,9,31],[8,32,9,32],[24,21,24,22],[24,26,24,27],[24,31,24,32],[24,36,24,37],[24,41,24,42],[8,42,9,42],[8,49,8,50],[8,34,8,35],[8,36,9,36],[8,37,9,37],[8,39,8,40],[8,41,9,41],[25,21,25,22],[25,26,25,27],[25,31,25,32],[24,46,24,47],[24,51,24,52],[24,56,24,57],[25,46,25,47],[25,51,25,52],[25,56,25,57],[25,61,25,62],[6,64,6,67],[24,66,24,67],[8,62,9,62],[24,61,24,62],[6,59,6,62],[8,59,8,60],[8,61,9,61],[6,44,6,47],[6,49,6,52],[6,54,6,57],[8,51,9,51],[8,52,9,52],[8,54,8,55],[8,56,9,56],[8,57,9,57],[8,44,8,45],[8,46,9,46],[8,47,9,47],[24,71,24,72],[24,76,24,77],[25,66,25,67],[25,71,25,72],[25,76,25,77],[6,69,6,72],[6,74,6,77],[8,64,8,65],[8,66,9,66],[8,67,9,67],[8,69,8,70],[8,71,9,71],[8,72,9,72],[8,74,8,75],[8,76,9,76],[8,77,9,77]]}
[{"$f":"'1_Informações e outros'!C1","v":"Ministério da Mulher, da Família e dos Direitos Humanos\nSecretaria Nacional dos Direitos da Pessoa com Deficiência"}]
[]
["LAUDO / CHECK LIST DE ACESSIBILIDADE PARA AVALIAÇÃO DE CONFORMIDADE ÀS NORMAS DE ACESSIBILIDADE (CONFORME NBR 9050:2020) "]
[]
["UNIDADE / ÓRGÃO",null,{"$f":"'1_Informações e outros'!E5","v":"MINISTÉRIO DA MULHER, DA FAMÍLIA E DOS DIREITOS HUMANOS"}]
[]
[{"$f":"'1_Informações e outros'!M5","v":4},null,null,null,{"$f":"'4.1_Circul'!E7","v":"8º PAVTO"},null,null,null,null,{"$f":"'4.1_Circul'!J7","v":"9º PAVTO"},null,null,null,null,{"$f":"'4.1_Circul'!O7","v":"10º PAVTO"},null,null,null,null,{"$f":"'4.1_Circul'!T7","v":"TÉRREO"},null,null,null,null,{"$f":"'4.1_Circul'!Y7","v":"5º PAVTO"},null,null,null,null,{"$f":"'4.1_Circul'!AD7","v":"6º PAVTO"},null,null,null,null,{"$f":"'4.1_Circul'!AI7","v":"7º PAVTO"},null,null,null,null,{"$f":"'4.1_Circul'!AN7","v":"8º PAVTO"},null,null,null,null,{"$f":"'4.1_Circul'!AS7","v":"9º PAVTO"},null,null,null,null,{"$f":"'4.1_Circul'!AX7","v":"10º PAVTO"},null,null,null,null,{"$f":"'4.1_Circul'!BC7","v":"11º PAVTO"},null,null,null,null,{"$f":"'4.1_Circul'!BH7","v":"12º PAVTO"},null,null,null,null,{"$f":"'4.1_Circul'!BM7","v":"13º PAVTO"},null,null,null,null,{"$f":"'4.1_Circul'!BR7","v":"14º PAVTO"},null,null,null,null,{"$f":"'4.1_Circul'!BW7","v":"15º PAVTO"},null,null,null,null,{"$f":"'4.1_Circul'!CB7","v":"16º PAVTO"},null,null,null,null,{"$f":"'4.1_Circul'!CG7","v":"17º PAVTO"},null,null,null,null,{"$f":"'4.1_Circul'!CL7","v":"18º PAVTO"},null,null,null,null,{"$f":"'4.1_Circul'!CQ7","v":"19º PAVTO"},null,null,null,null,{"$f":"'4.1_Circul'!CV7","v":"20º PAVTO"},null,null,null,null,{"$f":"'4.1_Circul'!DA7","v":"21º PAVTO"},null,null,null,null,{"$f":"'4.1_Circul'!DF7","v":"22º PAVTO"},null,null,null,null,{"$f":"'4.1_Circul'!DK7","v":"23º PAVTO"},null,null,null,null,{"$f":"'4.1_Circul'!DP7","v":"24º PAVTO"},null,null,null,null,{"$f":"'4.1_Circul'!DU7","v":"25º PAVTO"}]
[]
["Item da NBR9050",null,"11. RESTAURANTES, COPAS E SIMILARES",null,"ATENDE NBR9050-2020",null,"NÃO SE APLICA","OBSERVAÇÕES",null,"ATENDE NBR9050-2020",null,"NÃO SE APLICA","OBSERVAÇÕES",null,"ATENDE NBR9050-2020",null,"NÃO SE APLICA","OBSERVAÇÕES",null,"ATENDE NBR9050-2020",null,"NÃO SE APLICA","OBSERVAÇÕES",null,"ATENDE NBR9050-2020",null,"NÃO SE APLICA","OBSERVAÇÕES",null,"ATENDE NBR9050-2020",null,"NÃO SE APLICA","OBSERVAÇÕES",null,"ATENDE NBR9050-2020",null,"NÃO SE APLICA","OBSERVAÇÕES",null,"ATENDE NBR9050-2020",null,"NÃO SE APLICA","OBSERVAÇÕES",null,"ATENDE NBR9050-2020",null,"NÃO SE APLICA","OBSERVAÇÕES",null,"ATENDE NBR9050-2020",null,"NÃO SE APLICA","OBSERVAÇÕES",null,"ATENDE NBR9050-2020",null,"NÃO SE APLICA","OBSERVAÇÕES",null,"ATENDE NBR9050-2020",null,"NÃO SE APLICA","OBSERVAÇÕES",null,"ATENDE NBR9050-2020",null,"NÃO SE APLICA","OBSERVAÇÕES",null,"ATENDE NBR9050-2020",null,"NÃO SE APLICA","OBSERVAÇÕES",null,"ATENDE NBR9050-2020",null,"NÃO SE APLICA","OBSERVAÇÕES",null,"ATENDE NBR9050-2020",null,"NÃO SE APLICA","OBSERVAÇÕES",null,"ATENDE NBR9050-2020",null,"NÃO SE APLICA","OBSERVAÇÕES",null,"ATENDE NBR9050-2020",null,"NÃO SE APLICA","OBSERVAÇÕES",null,"ATENDE NBR9050-2020",null,"NÃO SE APLICA","OBSERVAÇÕES",null,"ATENDE NBR9050-2020",null,"NÃO SE APLICA","OBSERVAÇÕES",null,"ATENDE NBR9050-2020",null,"NÃO SE APLICA","OBSERVAÇÕES",null,"ATENDE NBR9050-2020",null,"NÃO SE APLICA","OBSERVAÇÕES",null,"ATENDE NBR9050-2020",null,"NÃO SE APLICA","OBSERVAÇÕES",null,"ATENDE NBR9050-2020",null,"NÃO SE APLICA","OBSERVAÇÕES",null,"ATENDE NBR9050-2020",null,"NÃO SE APLICA","OBSERVAÇÕES"]
[null,null,null,null,"SIM","NÃO",null,null,null,"SIM","NÃO",null,null,null,"SIM","NÃO",null,null,null,"SIM","NÃO",null,null,null,"SIM","NÃO",null,null,null,"SIM","NÃO",null,null,null,"SIM","NÃO",null,null,null,"SIM","NÃO",null,null,null,"SIM","NÃO",null,null,null,"SIM","NÃO",null,null,null,"SIM","NÃO",null,null,null,"SIM","NÃO",null,null,null,"SIM","NÃO",null,null,null,"SIM","NÃO",null,null,null,"SIM","NÃO",null,null,null,"SIM","NÃO",null,null,null,"SIM","NÃO",null,null,null,"SIM","NÃO",null,null,null,"SIM","NÃO",null,null,null,"SIM","NÃO",null,null,null,"SIM","NÃO",null,null,null,"SIM","NÃO",null,null,null,"SIM","NÃO",null,null,null,"SIM","NÃO",null,null,null,"SIM","NÃO"]
["9.3.3.1","a)","Nas superfícies de apoio para bandejas ou similares, as bandejas, talheres, pratos, copos, temperos, alimentos e bebidas estão dispostos dentro da faixa de alcance manual?",null,null,null,"X",null,null,null,null,"X",null,null,null,null,"X",null,null,null,null,"X"]
["9.3.3.2","b)","Os alimentos e bebidas estão dispostos de forma a permitir o alcance visual?",null,null,null,"X",null,null,null,null,"X",null,null,null,null,"X",null,null,null,null,"X"]
["9.3.3.3","c)","As superfícies de apoio para bandejas ou similares possuem altura entre 0,75 m e 0,85 m do piso acabado?",null,null,null,"X",null,null,null,null,"X",null,null,null,null,"X",null,null,null,null,"X"]
["9.3.3.3","d)","É garantida a dimensão de no mínimo 0,90 m de circulação no entorno do balcão de autosserviço?",null,null,null,"X",null,null,null,null,"X",null,null,null,null,"X",null,null,null,null,"X"]
["10.8.1","e)","Possui pelo menos 5% (com no mínimo uma do total) de mesas acessíveis para usuários de cadeira de rodas, sinalizadas com o SIA?",null,null,null,"X",null,null,null,null,"X",null,null,null,null,"X",null,null,null,null,"X"]
["4.3","f)","É garantida uma faixa de circulação de 0,90 m entre as mesas e área de manobra para acesso?",null,null,"X",null,"NÃO existe área para manobra. Deve ser previsto que o mobiliário móvel não atrapalhe a circulação e passagem, garantir uma faixa de circulação de 0,90m entre as mesas e área de manobra para acesso.  É necessário também atender as medidas mínimas quando as portas abrirem no sentido oposto do deslocamento do usuário, garantindo o espaço livre de 0,60 m contíguo à maçaneta, com profundidade de 1,50m. E alguns dos carrinhos de utilização da copa estão deixados nas circulações próximos as saídas de emergência, evitar que o mobiliário móvel ocupe esse espaço nas circulações. ",null,null,"X",null,"NÃO existe área para manobra. Deve ser previsto que o mobiliário móvel não atrapalhe a circulação e passagem, garantir uma faixa de circulação de 0,90m entre as mesas e área de manobra para acesso.  É necessário também atender as medidas mínimas quando as portas abrirem no sentido oposto do deslocamento do usuário, garantindo o espaço livre de 0,60 m contíguo à maçaneta, com profundidade de 1,50m. E alguns dos carrinhos de utilização da copa estão deixados nas circulações próximos as saídas de emergência, evitar que o mobiliário móvel ocupe esse espaço nas circulações. ",null,null,"X",null,"NÃO existe área para manobra. Deve ser previsto que o mobiliário móvel não atrapalhe a circulação e passagem, garantir uma faixa de circulação de 0,90m entre as mesas e área de manobra para acesso.  É necessário também atender as medidas mínimas quando as portas abrirem no sentido oposto do deslocamento do usuário, garantindo o espaço livre de 0,60 m contíguo à maçaneta, com profundidade de 1,50m. E alguns dos carrinhos de utilização da copa estão deixados nas circulações próximos as saídas de emergência, evitar que o mobiliário móvel ocupe esse espaço nas circulações. ",null,null,null,"X"]
["9.3.2.3","g)","As mesas possuem altura de tampo entre 0,75 m e 0,85 m do piso acabado?",null,null,null,"X",null,null,null,null,"X",null,null,"X",null,null,null,null,null,null,"X"]
["9.3.2.4","h)","As mesas permitem aproximação frontal da cadeira de rodas, com uma altura livre mínima de 0,73 m embaixo da superfície, garantindo largura mínima de 0,80 m e profundidade mínima de 0,50 m?",null,null,null,"X",null,null,null,null,"X",null,null,"X",null,null,null,null,null,null,"X"]
["9.2.2.1","i)","Caixas de pagamento são facilmente identificados e localizados em rotas acessíveis?",null,null,null,"X",null,null,null,null,"X",null,null,null,null,"X",null,null,null,null,"X"]
["9.2.2.2","j)","A altura do balcão do caixa está entre 0,80 m e 0,90 m do piso acabado?",null,null,null,"X",null,null,null,null,"X",null,null,null,null,"X",null,null,null,null,"X"]
["9.2.2.2","k)","O caixa possui espaço para aproximação frontal ou lateral? \n(para aproximação frontal, deve haver recuo de 0,30 m de profundidade por, no mínimo, 0,73 m de altura e circulação que permita giro de 180°; para aproximação lateral, deve haver passagem livre de 0,90 m)",null,null,null,"X",null,null,null,null,"X",null,null,null,null,"X",null,null,null,null,"X"]
["10.9.7","l)","Nas copas estão asseguradas condições de circulação, aproximação e alcance dos utensílios?",null,null,"X",null,"A copa não possibilita a livre circulação de pessoas em cadeira de rodas, e as pias não possuem a altura livre inferior de no mínimo 0.73m.",null,null,"X",null,"A copa não possibilita a livre circulação de pessoas em cadeira de rodas, e as pias não possuem a altura livre inferior de no mínimo 0.73m.",null,null,"X",null,"A copa não possibilita a livre circulação de pessoas em cadeira de rodas, e as pias não possuem a altura livre inferior de no mínimo 0.73m.",null,null,null,"X"]
["10.9.7","m)","As pias das copas possuem altura de no máximo 0,85 m, com altura livre inferior de no mínimo 0,73 m?",null,"X",null,null,null,null,"X",null,null,null,null,"X",null,null,null,null,null,null,"X"]
[]
[null,null,null,null,"SIM","NÃO","JUSTIFICATIVA",null,null,"SIM","NÃO","JUSTIFICATIVA",null,null,"SIM","NÃO","JUSTIFICATIVA",null,null,"SIM","NÃO","JUSTIFICATIVA",null,null,"SIM","NÃO","JUSTIFICATIVA",null,null,"SIM","NÃO","JUSTIFICATIVA",null,null,"SIM","NÃO","JUSTIFICATIVA",null,null,"SIM","NÃO","JUSTIFICATIVA",null,null,"SIM","NÃO","JUSTIFICATIVA",null,null,"SIM","NÃO","JUSTIFICATIVA",null,null,"SIM","NÃO","JUSTIFICATIVA",null,null,"SIM","NÃO","JUSTIFICATIVA",null,null,"SIM","NÃO","JUSTIFICATIVA",null,null,"SIM","NÃO","JUSTIFICATIVA",null,null,"SIM","NÃO","JUSTIFICATIVA",null,null,"SIM","NÃO","JUSTIFICATIVA",null,null,"SIM","NÃO","JUSTIFICATIVA",null,null,"SIM","NÃO","JUSTIFICATIVA",null,null,"SIM","NÃO","JUSTIFICATIVA",null,null,"SIM","NÃO","JUSTIFICATIVA",null,null,"SIM","NÃO","JUSTIFICATIVA",null,null,"SIM","NÃO","JUSTIFICATIVA",null,null,"SIM","NÃO","JUSTIFICATIVA",null,null,"SIM","NÃO","JUSTIFICATIVA",null,null,"SIM","NÃO","JUSTIFICATIVA"]
[null,null,"NECESSITA PROJETO ?",null,null,"X","Adaptar a copa para as medidas mínimas de espaço livre na altura inferior a pia de o.73m, onde possibilite a aproximação de uma pessoa em cadeira de rodas, e deve garantir os espaços mínimos de circulação e manobras de pessoas em cadeira de rodas.",null,null,null,"X","Adaptar a copa para as medidas mínimas de espaço livre na altura inferior a pia de o.73m, onde possibilite a aproximação de uma pessoa em cadeira de rodas, e deve garantir os espaços mínimos de circulação e manobras de pessoas em cadeira de rodas.",null,null,null,"X","Adaptar a copa para as medidas mínimas de espaço livre na altura inferior a pia de o.73m, onde possibilite a aproximação de uma pessoa em cadeira de rodas, e deve garantir os espaços mínimos de circulação e manobras de pessoas em cadeira de rodas.",null,null,null,"X"]

{"sheet":"12a14_ilum. e Sinaliz.","index":19,"n_rows":38,"n_cols":128,"rows_kept":38,"cut":false,"hidden":false,"merged":[[37,91,37,92],[37,96,37,97],[37,101,37,102],[37,106,37,107],[37,111,37,112],[37,116,37,117],[37,121,37,122],[37,126,37,127],[36,96,36,97],[36,101,36,102],[36,106,36,107],[36,111,36,112],[36,116,36,117],[36,121,36,122],[36,126,36,127],[37,6,37,7],[37,11,37,12],[37,16,37,17],[37,21,37,22],[37,26,37,27],[37,31,37,32],[37,36,37,37],[37,41,37,42],[37,46,37,47],[37,51,37,52],[37,56,37,57],[37,61,37,62],[37,66,37,67],[37,71,37,72],[37,76,37,77],[37,81,37,82],[37,86,37,87],[30,119,30,120],[30,106,31,106],[30,107,31,107],[30,109,30,110],[30,111,31,111],[30,112,31,112],[30,114,30,115],[30,116,31,116],[30,117,31,117],[30,89,30,90],[30,91,31,91],[30,92,31,92],[30,94,30,95],[30,96,31,96],[30,97,31,97],[30,99,30,100],[30,121,31,121],[30,122,31,122],[30,124,30,125],[30,126,31,126],[30,127,31,127],[36,6,36,7],[36,11,36,12],[36,16,36,17],[36,21,36,22],[36,26,36,27],[36,31,36,32],[36,36,36,37],[36,41,36,42],[36,46,36,47],[36,51,36,52],[36,56,36,57],[36,61,36,62],[36,66,36,67],[36,71,36,72],[36,76,36,77],[36,81,36,82],[36,86,36,87],[36,91,36,92],[30,104,30,105],[30,101,31,101],[30,102,31,102],[30,74,30,75],[30,76,31,76],[30,77,31,77],[30,79,30,80],[30,81,31,81],[30,82,31,82],[30,84,30,85],[30,86,31,86],[30,87,31,87],[30,59,30,60],[30,61,31,61],[30,62,31,62],[30,64,30,65],[30,66,31,66],[30,67,31,67],[30,69,30,70],[30,71,31,71],[30,72,31,72],[30,44,30,45],[30,46,31,46],[30,47,31,47],[30,49,30,50],[30,51,31,51],[30,52,31,52],[30,54,30,55],[30,56,31,56],[30,57,31,57],[30,29,30,30],[30,31,31,31],[30,32,31,32],[30,34,30,35],[30,36,31,36],[30,37,31,37],[30,39,30,40],[30,41,31,41],[30,42,31,42],[27,96,27,97],[27,101,27,102],[27,106,27,107],[27,111,27,112],[27,116,27,117],[27,121,27,122],[27,126,27,127],[30,0,31,0],[30,2,31,2],[30,4,30,5],[30,6,31,6],[30,7,31,7],[30,9,30,10],[30,11,31,11],[30,12,31,12],[30,14,30,15],[30,16,31,16],[30,17,31,17],[30,19,30,20],[30,21,31,21],[30,22,31,22],[30,24,30,25],[30,26,31,26],[30,27,31,27],[26,101,26,102],[26,106,26,107],[26,111,26,112],[26,116,26,117],[26,121,26,122],[26,126,26,127],[27,6,27,7],[27,11,27,12],[27,16,27,17],[27,21,27,22],[27,26,27,27],[27,31,27,32],[27,36,27,37],[27,41,27,42],[27,46,27,47],[27,51,27,52],[27,56,27,57],[27,61,27,62],[27,66,27,67],[27,71,27,72],[27,76,27,77],[27,81,27,82],[27,86,27,87],[27,91,27,92],[18,121,19,121],[18,122,19,122],[18,124,18,125],[18,126,19,126],[18,127,19,127],[26,6,26,7],[26,11,26,12],[26,16,26,17],[26,21,26,22],[26,26,26,27],[26,31,26,32],[26,36,26,37],[26,41,26,42],[26,46,26,47],[26,51,26,52],[26,56,26,57],[26,61,26,62],[26,66,26,67],[26,71,26,72],[26,76,26,77],[26,81,26,82],[26,86,26,87],[26,91,26,92],[26,96,26,97],[18,106,19,106],[18,107,19,107],[18,109,18,110],[18,111,19,111],[18,112,19,112],[18,114,18,115],[18,116,19,116],[18,117,19,117],[18,119,18,120],[18,91,19,91],[18,92,19,92],[18,94,18,95],[18,96,19,96],[18,97,19,97],[18,99,18,100],[18,101,19,101],[18,102,19,102],[18,104,18,105],[18,76,19,76],[18,77,19,77],[18,79,18,80],[18,81,19,81],[18,82,19,82],[18,84,18,85],[18,86,19,86],[18,87,19,87],[18,89,18,90],[18,61,19,61],[18,62,19,62],[18,64,18,65],[18,66,19,66],[18,67,19,67],[18,69,18,70],[18,71,19,71],[18,72,19,72],[18,74,18,75],[18,46,19,46],[18,47,19,47],[18,49,18,50],[18,51,19,51],[18,52,19,52],[18,54,18,55],[18,56,19,56],[18,57,19,57],[18,59,18,60],[18,31,19,31],[18,32,19,32],[18,34,18,35],[18,36,19,36],[18,37,19,37],[18,39,18,40],[18,41,19,41],[18,42,19,42],[18,44,18,45],[18,16,19,16],[18,17,19,17],[18,19,18,20],[18,21,19,21],[18,22,19,22],[18,24,18,25],[18,26,19,26],[18,27,19,27],[18,29,18,30],[18,0,19,0],[18,2,19,2],[18,4,18,5],[18,6,19,6],[18,7,19,7],[18,9,18,10],[18,11,19,11],[18,12,19,12],[18,14,18,15],[15,106,15,107],[15,111,15,112],[15,116,15,117],[15,121,15,122],[15,126,15,127],[15,81,15,82],[15,86,15,87],[15,91,15,92],[15,96,15,97],[15,101,15,102],[14,106,14,107],[14,111,14,112],[14,116,14,117],[14,121,14,122],[14,126,14,127],[14,81,14,82],[14,86,14,87],[14,91,14,92],[14,96,14,97],[14,101,14,102],[8,121,9,121],[8,122,9,122],[8,124,8,125],[8,126,9,126],[8,127,9,127],[8,112,9,112],[8,114,8,115],[8,116,9,116],[8,117,9,117],[8,119,8,120],[8,104,8,105],[8,106,9,106],[8,107,9,107],[8,109,8,110],[8,111,9,111],[8,96,9,96],[8,97,9,97],[8,99,8,100],[8,101,9,101],[8,102,9,102],[8,87,9,87],[8,89,8,90],[8,91,9,91],[8,92,9,92],[8,94,8,95],[8,79,8,80],[8,81,9,81],[8,82,9,82],[8,84,8,85],[8,86,9,86],[6,104,6,107],[6,109,6,112],[6,114,6,117],[6,119,6,122],[6,124,6,127],[6,79,6,82],[6,84,6,87],[6,89,6,92],[6,94,6,97],[6,99,6,102],[14,6,14,7],[14,11,14,12],[14,16,14,17],[15,6,15,7],[15,11,15,12],[15,16,15,17],[8,14,8,15],[8,16,9,16],[0,0,0,2],[2,0,2,3],[8,0,9,0],[8,2,9,2],[6,4,6,7],[6,9,6,12],[6,14,6,17],[8,17,9,17],[8,12,9,12],[8,7,9,7],[8,4,8,5],[8,6,9,6],[8,9,8,10],[8,11,9,11],[14,21,14,22],[14,26,14,27],[14,31,14,32],[15,21,15,22],[15,26,15,27],[15,31,15,32],[6,34,6,37],[6,39,6,42],[6,44,6,47],[14,36,14,37],[14,41,14,42],[14,46,14,47],[6,19,6,22],[6,24,6,27],[6,29,6,32],[8,19,8,20],[8,21,9,21],[8,22,9,22],[8,24,8,25],[8,26,9,26],[8,27,9,27],[8,29,8,30],[8,31,9,31],[8,32,9,32],[6,49,6,52],[6,54,6,57],[6,59,6,62],[8,34,8,35],[8,36,9,36],[8,37,9,37],[8,39,8,40],[8,41,9,41],[8,42,9,42],[8,44,8,45],[8,46,9,46],[8,47,9,47],[8,49,8,50],[8,51,9,51],[8,52,9,52],[8,54,8,55],[8,56,9,56],[8,57,9,57],[8,59,8,60],[8,61,9,61],[8,62,9,62],[14,51,14,52],[14,56,14,57],[14,61,14,62],[14,66,14,67],[14,71,14,72],[14,76,14,77],[15,36,15,37],[15,41,15,42],[15,46,15,47],[15,51,15,52],[15,56,15,57],[15,66,15,67],[15,71,15,72],[15,76,15,77],[15,61,15,62],[6,64,6,67],[6,69,6,72],[6,74,6,77],[8,64,8,65],[8,66,9,66],[8,67,9,67],[8,69,8,70],[8,71,9,71],[8,72,9,72],[8,74,8,75],[8,76,9,76],[8,77,9,77]]}
[{"$f":"'1_Informações e outros'!C1","v":"Ministério da Mulher, da Família e dos Direitos Humanos\nSecretaria Nacional dos Direitos da Pessoa com Deficiência"}]
[]
["LAUDO / CHECK LIST DE ACESSIBILIDADE PARA AVALIAÇÃO DE CONFORMIDADE ÀS NORMAS DE ACESSIBILIDADE (CONFORME NBR 9050:2020) "]
[]
["UNIDADE / ÓRGÃO",null,{"$f":"'1_Informações e outros'!E5","v":"MINISTÉRIO DA MULHER, DA FAMÍLIA E DOS DIREITOS HUMANOS"}]
[]
[{"$f":"'1_Informações e outros'!M5","v":4},null,null,null,{"$f":"'4.1_Circul'!E7","v":"8º PAVTO"},null,null,null,null,{"$f":"'4.1_Circul'!J7","v":"9º PAVTO"},null,null,null,null,{"$f":"'4.1_Circul'!O7","v":"10º PAVTO"},null,null,null,null,{"$f":"'4.1_Circul'!T7","v":"TÉRREO"},null,null,null,null,{"$f":"'4.1_Circul'!Y7","v":"5º PAVTO"},null,null,null,null,{"$f":"'4.1_Circul'!AD7","v":"6º PAVTO"},null,null,null,null,{"$f":"'4.1_Circul'!AI7","v":"7º PAVTO"},null,null,null,null,{"$f":"'4.1_Circul'!AN7","v":"8º PAVTO"},null,null,null,null,{"$f":"'4.1_Circul'!AS7","v":"9º PAVTO"},null,null,null,null,{"$f":"'4.1_Circul'!AX7","v":"10º PAVTO"},null,null,null,null,{"$f":"'4.1_Circul'!BC7","v":"11º PAVTO"},null,null,null,null,{"$f":"'4.1_Circul'!BH7","v":"12º PAVTO"},null,null,null,null,{"$f":"'4.1_Circul'!BM7","v":"13º PAVTO"},null,null,null,null,{"$f":"'4.1_Circul'!BR7","v":"14º PAVTO"},null,null,null,null,{"$f":"'4.1_Circul'!BW7","v":"15º PAVTO"},null,null,null,null,{"$f":"'4.1_Circul'!CB7","v":"16º PAVTO"},null,null,null,null,{"$f":"'4.1_Circul'!CG7","v":"17º PAVTO"},null,null,null,null,{"$f":"'4.1_Circul'!CL7","v":"18º PAVTO"},null,null,null,null,{"$f":"'4.1_Circul'!CQ7","v":"19º PAVTO"},null,null,null,null,{"$f":"'4.1_Circul'!CV7","v":"20º PAVTO"},null,null,null,null,{"$f":"'4.1_Circul'!DA7","v":"21º PAVTO"},null,null,null,null,{"$f":"'4.1_Circul'!DF7","v":"22º PAVTO"},null,null,null,null,{"$f":"'4.1_Circul'!DK7","v":"23º PAVTO"},null,null,null,null,{"$f":"'4.1_Circul'!DP7","v":"24º PAVTO"},null,null,null,null,{"$f":"'4.1_Circul'!DU7","v":"25º PAVTO"}]
[]
["Item da NBR9050",null,"12.ILUMINAÇÃO",null,"ATENDE NBR9050-2020",null,"NÃO SE APLICA","OBSERVAÇÕES",null,"ATENDE NBR9050-2020",null,"NÃO SE APLICA","OBSERVAÇÕES",null,"ATENDE NBR9050-2020",null,"NÃO SE APLICA","OBSERVAÇÕES",null,"ATENDE NBR9050-2020",null,"NÃO SE APLICA","OBSERVAÇÕES",null,"ATENDE NBR9050-2020",null,"NÃO SE APLICA","OBSERVAÇÕES",null,"ATENDE NBR9050-2020",null,"NÃO SE APLICA","OBSERVAÇÕES",null,"ATENDE NBR9050-2020",null,"NÃO SE APLICA","OBSERVAÇÕES",null,"ATENDE NBR9050-2020",null,"NÃO SE APLICA","OBSERVAÇÕES",null,"ATENDE NBR9050-2020",null,"NÃO SE APLICA","OBSERVAÇÕES",null,"ATENDE NBR9050-2020",null,"NÃO SE APLICA","OBSERVAÇÕES",null,"ATENDE NBR9050-2020",null,"NÃO SE APLICA","OBSERVAÇÕES",null,"ATENDE NBR9050-2020",null,"NÃO SE APLICA","OBSERVAÇÕES",null,"ATENDE NBR9050-2020",null,"NÃO SE APLICA","OBSERVAÇÕES",null,"ATENDE NBR9050-2020",null,"NÃO SE APLICA","OBSERVAÇÕES",null,"ATENDE NBR9050-2020",null,"NÃO SE APLICA","OBSERVAÇÕES",null,"ATENDE NBR9050-2020",null,"NÃO SE APLICA","OBSERVAÇÕES",null,"ATENDE NBR9050-2020",null,"NÃO SE APLICA","OBSERVAÇÕES",null,"ATENDE NBR9050-2020",null,"NÃO SE APLICA","OBSERVAÇÕES",null,"ATENDE NBR9050-2020",null,"NÃO SE APLICA","OBSERVAÇÕES",null,"ATENDE NBR9050-2020",null,"NÃO SE APLICA","OBSERVAÇÕES",null,"ATENDE NBR9050-2020",null,"NÃO SE APLICA","OBSERVAÇÕES",null,"ATENDE NBR9050-2020",null,"NÃO SE APLICA","OBSERVAÇÕES",null,"ATENDE NBR9050-2020",null,"NÃO SE APLICA","OBSERVAÇÕES",null,"ATENDE NBR9050-2020",null,"NÃO SE APLICA","OBSERVAÇÕES",null,"ATENDE NBR9050-2020",null,"NÃO SE APLICA","OBSERVAÇÕES"]
[null,null,null,null,"SIM","NÃO",null,null,null,"SIM","NÃO",null,null,null,"SIM","NÃO",null,null,null,"SIM","NÃO",null,null,null,"SIM","NÃO",null,null,null,"SIM","NÃO",null,null,null,"SIM","NÃO",null,null,null,"SIM","NÃO",null,null,null,"SIM","NÃO",null,null,null,"SIM","NÃO",null,null,null,"SIM","NÃO",null,null,null,"SIM","NÃO",null,null,null,"SIM","NÃO",null,null,null,"SIM","NÃO",null,null,null,"SIM","NÃO",null,null,null,"SIM","NÃO",null,null,null,"SIM","NÃO",null,null,null,"SIM","NÃO",null,null,null,"SIM","NÃO",null,null,null,"SIM","NÃO",null,null,null,"SIM","NÃO",null,null,null,"SIM","NÃO",null,null,null,"SIM","NÃO",null,null,null,"SIM","NÃO",null,null,null,"SIM","NÃO"]
["6.1.2","a)","A rota acessível possui iluminação natural ou artificial com nível mínimo de iluminância de 150 lux medido a 1,00 m do chão?",null,null,"X",null,"No hall dos elevadores, corredores laterais para escadas de emergência e sanitários, e no corredor principal da SECRETARIA NACIONAL DOS DIREITOS DA PESSOA COM DEFICIÊNCIA que dos acessos as salas de 800 a 836 não está em conformidade com o nível mínimo de iluminação de 150 lux.  ",null,null,"X",null,"No hall dos elevadores, corredores laterais para escadas de emergência e sanitários, não está em conformidade com o nível mínimo de iluminação de 150 lux.",null,null,"X",null,"No hall dos elevadores, corredores laterais para escadas de emergência e sanitários, não está em conformidade com o nível mínimo de iluminação de 150 lux.",null,"X"]
["6.11.2.13","b)","Portas e paredes envidraçadas em áreas de circulação possuem bom nível de iluminação de ambos os lados?",null,"X",null,null,null,null,"X",null,null,null,null,"X",null,null,null,null,"X"]
["9.2.1.3","c)","No balcão de atendimento a face do atendente é uniformemente iluminada?",null,null,"X",null,"Iluminância de 60 a 82 no local do balcão.",null,null,"X",null,"Iluminância de 60 a 82 no local do balcão.",null,null,"X",null,"Iluminância de 60 a 82 no local do balcão.",null,"X"]
[]
[null,null,null,null,"SIM","NÃO","JUSTIFICATIVA",null,null,"SIM","NÃO","JUSTIFICATIVA",null,null,"SIM","NÃO","JUSTIFICATIVA",null,null,"SIM","NÃO","JUSTIFICATIVA",null,null,"SIM","NÃO","JUSTIFICATIVA",null,null,"SIM","NÃO","JUSTIFICATIVA",null,null,"SIM","NÃO","JUSTIFICATIVA",null,null,"SIM","NÃO","JUSTIFICATIVA",null,null,"SIM","NÃO","JUSTIFICATIVA",null,null,"SIM","NÃO","JUSTIFICATIVA",null,null,"SIM","NÃO","JUSTIFICATIVA",null,null,"SIM","NÃO","JUSTIFICATIVA",null,null,"SIM","NÃO","JUSTIFICATIVA",null,null,"SIM","NÃO","JUSTIFICATIVA",null,null,"SIM","NÃO","JUSTIFICATIVA",null,null,"SIM","NÃO","JUSTIFICATIVA",null,null,"SIM","NÃO","JUSTIFICATIVA",null,null,"SIM","NÃO","JUSTIFICATIVA",null,null,"SIM","NÃO","JUSTIFICATIVA",null,null,"SIM","NÃO","JUSTIFICATIVA",null,null,"SIM","NÃO","JUSTIFICATIVA",null,null,"SIM","NÃO","JUSTIFICATIVA",null,null,"SIM","NÃO","JUSTIFICATIVA",null,null,"SIM","NÃO","JUSTIFICATIVA",null,null,"SIM","NÃO","JUSTIFICATIVA"]
[null,null,"NECESSITA PROJETO ?",null,null,"X","Deve atender o mínimo de lux de 150, torocar a Iluminação onde foi apontado.",null,null,null,"X","Deve atender o mínimo de lux de 150, torocar a Iluminação onde foi apontado.",null,null,null,"X","Deve atender o mínimo de lux de 150, torocar a Iluminação onde foi apontado.",null,null,null,"X"]
[]
[]
["Item da NBR9050",null,"13. SINALIZAÇÃO DE EMERGÊNCIA",null,"ATENDE NBR9050-2020",null,"NÃO SE APLICA","OBSERVAÇÕES",null,"ATENDE NBR9050-2020",null,"NÃO SE APLICA","OBSERVAÇÕES",null,"ATENDE NBR9050-2020",null,"NÃO SE APLICA","OBSERVAÇÕES",null,"ATENDE NBR9050-2020",null,"NÃO SE APLICA","OBSERVAÇÕES",null,"ATENDE NBR9050-2020",null,"NÃO SE APLICA","OBSERVAÇÕES",null,"ATENDE NBR9050-2020",null,"NÃO SE APLICA","OBSERVAÇÕES",null,"ATENDE NBR9050-2020",null,"NÃO SE APLICA","OBSERVAÇÕES",null,"ATENDE NBR9050-2020",null,"NÃO SE APLICA","OBSERVAÇÕES",null,"ATENDE NBR9050-2020",null,"NÃO SE APLICA","OBSERVAÇÕES",null,"ATENDE NBR9050-2020",null,"NÃO SE APLICA","OBSERVAÇÕES",null,"ATENDE NBR9050-2020",null,"NÃO SE APLICA","OBSERVAÇÕES",null,"ATENDE NBR9050-2020",null,"NÃO SE APLICA","OBSERVAÇÕES",null,"ATENDE NBR9050-2020",null,"NÃO SE APLICA","OBSERVAÇÕES",null,"ATENDE NBR9050-2020",null,"NÃO SE APLICA","OBSERVAÇÕES",null,"ATENDE NBR9050-2020",null,"NÃO SE APLICA","OBSERVAÇÕES",null,"ATENDE NBR9050-2020",null,"NÃO SE APLICA","OBSERVAÇÕES",null,"ATENDE NBR9050-2020",null,"NÃO SE APLICA","OBSERVAÇÕES",null,"ATENDE NBR9050-2020",null,"NÃO SE APLICA","OBSERVAÇÕES",null,"ATENDE NBR9050-2020",null,"NÃO SE APLICA","OBSERVAÇÕES",null,"ATENDE NBR9050-2020",null,"NÃO SE APLICA","OBSERVAÇÕES",null,"ATENDE NBR9050-2020",null,"NÃO SE APLICA","OBSERVAÇÕES",null,"ATENDE NBR9050-2020",null,"NÃO SE APLICA","OBSERVAÇÕES",null,"ATENDE NBR9050-2020",null,"NÃO SE APLICA","OBSERVAÇÕES",null,"ATENDE NBR9050-2020",null,"NÃO SE APLICA","OBSERVAÇÕES",null,"ATENDE NBR9050-2020",null,"NÃO SE APLICA","OBSERVAÇÕES"]
[null,null,null,null,"SIM","NÃO",null,null,null,"SIM","NÃO",null,null,null,"SIM","NÃO",null,null,null,"SIM","NÃO",null,null,null,"SIM","NÃO",null,null,null,"SIM","NÃO",null,null,null,"SIM","NÃO",null,null,null,"SIM","NÃO",null,null,null,"SIM","NÃO",null,null,null,"SIM","NÃO",null,null,null,"SIM","NÃO",null,null,null,"SIM","NÃO",null,null,null,"SIM","NÃO",null,null,null,"SIM","NÃO",null,null,null,"SIM","NÃO",null,null,null,"SIM","NÃO",null,null,null,"SIM","NÃO",null,null,null,"SIM","NÃO",null,null,null,"SIM","NÃO",null,null,null,"SIM","NÃO",null,null,null,"SIM","NÃO",null,null,null,"SIM","NÃO",null,null,null,"SIM","NÃO",null,null,null,"SIM","NÃO",null,null,null,"SIM","NÃO"]
["5.5.1.1","a)","Existem elementos de sinalização de emergência direcionando o usuário para as saídas de emergência ou rotas de fuga?",null,"X",null,null,null,null,"X",null,null,null,null,"X",null,null,"Na sala 1045 - Ambiente de educação corporativa, possui sinalização de emergência divergente, direcionando a rota de fuga para uma porta que não existe saída, verificar as sinalizações de emergência.",null,"X"]
["5.5.1.2","b)","As rotas de fuga e as saídas de emergência são sinalizadas, para localização, advertência e instruções, com informações visuais, sonoras e táteis?",null,null,"X",null,"Possui a sinalização visual, a sinalização sonora através de alarme de incêndio, porém NÃO há sinalização tátil.",null,null,"X",null,"Possui a sinalização visual, a sinalização sonora através de alarme de incêndio, porém NÃO há sinalização tátil.",null,null,"X",null,"Possui a sinalização visual, a sinalização sonora através de alarme de incêndio, porém NÃO há sinalização tátil.",null,"X",null,null,"Possui a sinalização visual e tátil, e a sinalização sonora é através de alarme de incêndio. "]
["5.5.1.3","c)","Nas escadas interligando vários pavimentos há, junto às portas corta-fogo, sinalização tátil, visual e/ou sonora, informando o número do pavimento?",null,null,"X",null,"Possui sinalização visual, NÃO há sinalização tátil.",null,null,"X",null,"Possui sinalização visual, NÃO há sinalização tátil.",null,null,"X",null,"Possui sinalização visual, NÃO há sinalização tátil.",null,null,"X",null,"Possui sinalização visual, NÃO há sinalização tátil."]
["5.5.2.1","d)","O acesso às áreas de resgate está identificado conforme o disposto na ABNT NBR 16820? ",null,null,"X",null,"Não possui área de resgate e não exite a sinalização de modulo de referência.",null,null,"X",null,"Não possui área de resgate e não exite a sinalização de modulo de referência.",null,null,"X",null,"Não possui área de resgate e não exite a sinalização de modulo de referência.",null,null,null,"X"]
["5.5.2.2","e)","Em área de resgate há sinalização de piso do espaço para pessoa em cadeira de rodas?",null,null,"X",null,"Não exite a sinalização de modulo de referência.",null,null,"X",null,"Não exite a sinalização de modulo de referência.",null,null,"X",null,"Não exite a sinalização de modulo de referência.",null,null,null,"X"]
[]
[null,null,null,null,"SIM","NÃO","JUSTIFICATIVA",null,null,"SIM","NÃO","JUSTIFICATIVA",null,null,"SIM","NÃO","JUSTIFICATIVA",null,null,"SIM","NÃO","JUSTIFICATIVA",null,null,"SIM","NÃO","JUSTIFICATIVA",null,null,"SIM","NÃO","JUSTIFICATIVA",null,null,"SIM","NÃO","JUSTIFICATIVA",null,null,"SIM","NÃO","JUSTIFICATIVA",null,null,"SIM","NÃO","JUSTIFICATIVA",null,null,"SIM","NÃO","JUSTIFICATIVA",null,null,"SIM","NÃO","JUSTIFICATIVA",null,null,"SIM","NÃO","JUSTIFICATIVA",null,null,"SIM","NÃO","JUSTIFICATIVA",null,null,"SIM","NÃO","JUSTIFICATIVA",null,null,"SIM","NÃO","JUSTIFICATIVA",null,null,"SIM","NÃO","JUSTIFICATIVA",null,null,"SIM","NÃO","JUSTIFICATIVA",null,null,"SIM","NÃO","JUSTIFICATIVA",null,null,"SIM","NÃO","JUSTIFICATIVA",null,null,"SIM","NÃO","JUSTIFICATIVA",null,null,"SIM","NÃO","JUSTIFICATIVA",null,null,"SIM","NÃO","JUSTIFICATIVA",null,null,"SIM","NÃO","JUSTIFICATIVA",null,null,"SIM","NÃO","JUSTIFICATIVA",null,null,"SIM","NÃO","JUSTIFICATIVA"]
[null,null,"NECESSITA PROJETO ?",null,null,"X","Aplicar a sinalização tátil nos lugares indicados  e a sinalização do modulo de referência.",null,null,null,"X","Aplicar a sinalização tátil nos lugares indicados  e a sinalização do modulo de referência.",null,null,null,"X","Aplicar a sinalização tátil nos lugares indicados  e a sinalização do modulo de referência.",null,null,null,"X","Aplicar a sinalização tátil nos lugares indicados ."]
[]
[]
["Item da NBR9050",null,"14. SINALIZAÇÃO",null,"ATENDE NBR9050-2020",null,"NÃO SE APLICA","OBSERVAÇÕES",null,"ATENDE NBR9050-2020",null,"NÃO SE APLICA","OBSERVAÇÕES",null,"ATENDE NBR9050-2020",null,"NÃO SE APLICA","OBSERVAÇÕES",null,"ATENDE NBR9050-2020",null,"NÃO SE APLICA","OBSERVAÇÕES",null,"ATENDE NBR9050-2020",null,"NÃO SE APLICA","OBSERVAÇÕES",null,"ATENDE NBR9050-2020",null,"NÃO SE APLICA","OBSERVAÇÕES",null,"ATENDE NBR9050-2020",null,"NÃO SE APLICA","OBSERVAÇÕES",null,"ATENDE NBR9050-2020",null,"NÃO SE APLICA","OBSERVAÇÕES",null,"ATENDE NBR9050-2020",null,"NÃO SE APLICA","OBSERVAÇÕES",null,"ATENDE NBR9050-2020",null,"NÃO SE APLICA","OBSERVAÇÕES",null,"ATENDE NBR9050-2020",null,"NÃO SE APLICA","OBSERVAÇÕES",null,"ATENDE NBR9050-2020",null,"NÃO SE APLICA","OBSERVAÇÕES",null,"ATENDE NBR9050-2020",null,"NÃO SE APLICA","OBSERVAÇÕES",null,"ATENDE NBR9050-2020",null,"NÃO SE APLICA","OBSERVAÇÕES",null,"ATENDE NBR9050-2020",null,"NÃO SE APLICA","OBSERVAÇÕES",null,"ATENDE NBR9050-2020",null,"NÃO SE APLICA","OBSERVAÇÕES",null,"ATENDE NBR9050-2020",null,"NÃO SE APLICA","OBSERVAÇÕES",null,"ATENDE NBR9050-2020",null,"NÃO SE APLICA","OBSERVAÇÕES",null,"ATENDE NBR9050-2020",null,"NÃO SE APLICA","OBSERVAÇÕES",null,"ATENDE NBR9050-2020",null,"NÃO SE APLICA","OBSERVAÇÕES",null,"ATENDE NBR9050-2020",null,"NÃO SE APLICA","OBSERVAÇÕES",null,"ATENDE NBR9050-2020",null,"NÃO SE APLICA","OBSERVAÇÕES",null,"ATENDE NBR9050-2020",null,"NÃO SE APLICA","OBSERVAÇÕES",null,"ATENDE NBR9050-2020",null,"NÃO SE APLICA","OBSERVAÇÕES",null,"ATENDE NBR9050-2020",null,"NÃO SE APLICA","OBSERVAÇÕES"]
[null,null,null,null,"SIM","NÃO",null,null,null,"SIM","NÃO",null,null,null,"SIM","NÃO",null,null,null,"SIM","NÃO",null,null,null,"SIM","NÃO",null,null,null,"SIM","NÃO",null,null,null,"SIM","NÃO",null,null,null,"SIM","NÃO",null,null,null,"SIM","NÃO",null,null,null,"SIM","NÃO",null,null,null,"SIM","NÃO",null,null,null,"SIM","NÃO",null,null,null,"SIM","NÃO",null,null,null,"SIM","NÃO",null,null,null,"SIM","NÃO",null,null,null,"SIM","NÃO",null,null,null,"SIM","NÃO",null,null,null,"SIM","NÃO",null,null,null,"SIM","NÃO",null,null,null,"SIM","NÃO",null,null,null,"SIM","NÃO",null,null,null,"SIM","NÃO",null,null,null,"SIM","NÃO",null,null,null,"SIM","NÃO",null,null,null,"SIM","NÃO"]
["5.2.8.1.2","a)","Existem placas de sinalização informando sobre os sanitários, acessos verticais e horizontais e números de pavimentos?",null,"X",null,null,null,null,"X",null,null,null,null,"X",null,null,null,null,"X"]
["5.2.8.1.4","b)","A sinalização está disposta em locais acessíveis para pessoa em cadeira de rodas, com deficiência visual, entre outros usuários, de tal forma que possa ser compreendida por todos?",null,"X",null,null,null,null,"X",null,null,"No hall dos elevadores possui algumas sinalizações divergentes, há mais de uma sinalização em algumas portas. É necessário fazer a retirada das placas que não condizem com as indicações e número das salas.",null,"X",null,null,null,null,"X"]
["5.3.5.1","c)","Há placas indicando os atendimentos preferenciais disponíveis (Símbolo Internacional de Acesso e Figuras 38 a 42)?",null,null,null,"X","Não existe atendimento ao público, penas agendamento.",null,null,null,"X","Não existe atendimento ao público, penas agendamento.",null,null,null,"X","Não existe atendimento ao público, penas agendamento.",null,null,"X",null,"Em local de atendimento ao público deve ter sinalização indicando o atendimento preferencial, com os símbolos internacionais que indica os beneficiários."]
[]
[null,null,null,null,"SIM","NÃO","JUSTIFICATIVA",null,null,"SIM","NÃO","JUSTIFICATIVA",null,null,"SIM","NÃO","JUSTIFICATIVA",null,null,"SIM","NÃO","JUSTIFICATIVA",null,null,"SIM","NÃO","JUSTIFICATIVA",null,null,"SIM","NÃO","JUSTIFICATIVA",null,null,"SIM","NÃO","JUSTIFICATIVA",null,null,"SIM","NÃO","JUSTIFICATIVA",null,null,"SIM","NÃO","JUSTIFICATIVA",null,null,"SIM","NÃO","JUSTIFICATIVA",null,null,"SIM","NÃO","JUSTIFICATIVA",null,null,"SIM","NÃO","JUSTIFICATIVA",null,null,"SIM","NÃO","JUSTIFICATIVA",null,null,"SIM","NÃO","JUSTIFICATIVA",null,null,"SIM","NÃO","JUSTIFICATIVA",null,null,"SIM","NÃO","JUSTIFICATIVA",null,null,"SIM","NÃO","JUSTIFICATIVA",null,null,"SIM","NÃO","JUSTIFICATIVA",null,null,"SIM","NÃO","JUSTIFICATIVA",null,null,"SIM","NÃO","JUSTIFICATIVA",null,null,"SIM","NÃO","JUSTIFICATIVA",null,null,"SIM","NÃO","JUSTIFICATIVA",null,null,"SIM","NÃO","JUSTIFICATIVA",null,null,"SIM","NÃO","JUSTIFICATIVA",null,null,"SIM","NÃO","JUSTIFICATIVA"]
[null,null,"NECESSITA PROJETO ?",null,null,"X",null,null,null,null,"X"," É necessário fazer a retirada das placas que não condizem com as indicações e número das salas.",null,null,null,"X",null,null,null,null,"X","Deve aplicar as placas de identificação de atendimento preferencial."]

{"sheet":"Conclusão e Resumo","index":20,"n_rows":48,"n_cols":11,"rows_kept":48,"cut":false,"hidden":false,"merged":[[46,1,50,9],[24,1,24,9],[44,1,44,9],[26,1,42,1],[38,8,38,9],[40,8,40,9],[26,3,26,6],[26,8,26,9],[28,8,28,9],[30,8,30,9],[32,8,32,9],[34,8,34,9],[34,3,34,6],[30,3,30,6],[0,1,0,9],[6,3,6,4],[6,8,6,9],[8,3,8,4],[10,3,10,4],[16,6,18,7],[42,8,42,9],[2,1,2,9],[12,6,14,6],[4,3,4,7],[12,7,14,9],[22,3,22,7],[40,3,40,6],[36,3,36,6],[32,3,32,6],[28,3,28,6],[42,3,42,6],[38,3,38,6],[36,8,36,9],[12,1,14,1],[16,1,20,1]]}
[null,"Ministério da Mulher, da Família e dos Direitos Humanos\nSecretaria Nacional dos Direitos da Pessoa com Deficiência"]
[]
[null,"LAUDO / CHECK LIST DE ACESSIBILIDADE PARA AVALIAÇÃO DE CONFORMIDADE ÀS NORMAS DE ACESSIBILIDADE (CONFORME NBR 9050:2020) "]
[]
[null,"UNIDADE / ÓRGÃO",null,{"$f":"'1_Informações e outros'!E5","v":"MINISTÉRIO DA MULHER, DA FAMÍLIA E DOS DIREITOS HUMANOS"},null,null,null,null,"TOTAL DE PAVTOS",{"$f":"'1_Informações e outros'!M5","v":4}]
[]
[null,"CIDADE",null,{"$f":"'1_Informações e outros'!E7","v":"BRASÍLIA"},null,null,"ESTADO",{"$f":"'1_Informações e outros'!L7","v":"DISTRITO FEDERAL"}]
[]
[null,"RUA / AV",null,{"$f":"'1_Informações e outros'!E9","v":"SCS Quadra 9 · Lote C"},null,null,"Nº",{"$f":"'1_Informações e outros'!L9","v":"C"},"ÁREA TOTAL",{"$f":"'1_Informações e outros'!N9","v":9380}]
[]
[null,"BAIRRO",null,{"$f":"'1_Informações e outros'!E11","v":"ASA SUL"},null,null,"ANO DE CONSTRUÇÃO",{"$f":"'1_Informações e outros'!L11","v":2011},"DATA DO LAUDO",{"$f":"'1_Informações e outros'!L15","v":"30 DE SETEMBRO DE 2022"}]
[]
[null,"ATENDE PÚBLICO",null,"SIM",null,null,"DATA HABITE-SE",{"$f":"'1_Informações e outros'!L13","v":"10 DE NOVEMBRO DE 2011"}]
[]
[null,null,null,"NÃO",{"$f":"'1_Informações e outros'!I15","v":"X"}]
[]
[null,"SITUAÇÃO DO IMÓVEL",null,"PRÓPRIO",null,null,"PRÉDIO TOMBADO OU HISTÓRICO",null,"SIM"]
[]
[null,null,null,"LOCADO",{"$f":"'1_Informações e outros'!I19","v":"X"},null,null,null,"NÃO",{"$f":"'1_Informações e outros'!M19","v":"X"}]
[]
[null,null,null,"CEDIDO"]
[]
[null,"RESPONSÁVEL PELA ELABORAÇÃO DO LAUDO\n(NOME, FORMAÇÃO (Arq. ou Eng.), CREA / CAU",null,{"$f":"'1_Informações e outros'!E23","v":"BRUNO CAETANO DE SOUZA    CAU: A925675"},null,null,null,null,"Nº DA ART OU RRT / DATA DE EMISSÃO",{"$f":"'1_Informações e outros'!N23","v":"SI12434391I00CT001 30/09/2022"}]
[]
[null,"RESUMO"]
[]
[null,"PROJETOS NECESSÁRIOS",null,"ESPECIALIDADES",null,null,null,null,"JUSTIFICATIVA"]
[]
[null,null,null,"LEVANTAMENTO CADASTRAL"]
[]
[null,null,null,"ARQUITETÔNICO",null,null,null,null," "]
[null,null,null,null,null,null,null,null,null,null,{"$f":"LOWER(I32)","v":""}]
[null,null,null,"SINALIZAÇÃO INTERNA / EXTERNA",null,null,null,"X","Não existem sinalização tátil direcional e de alerta nos pisos. Deve ser implantado a rota com piso tátil direcional e de alerta onde necessário, contornando o limite do lote não edificado onde exista descontinuidade da referência edificada. Desníveis, travessias e em mudanças de direção ou opção de percursos nas calçadas, devem ter sinalização tátil."]
[null,null,null,null,null,null,null,null,null,null,""]
[null,null,null,"HIDROSSANITÁRIO"]
[null,null,null,null,null,null,null,null,null,null,""]
[null,null,null,"ELÉTRICO / LÓGICO"]
[null,null,null,null,null,null,null,null,null,null,""]
[null,null,null,"CFTV / ALARME",null,null,null,null,null,null,""]
[null,null,null,null,null,null,null,null,null,null,""]
[null,null,null,"FUNDAÇÕES / ESTRUTURA",null,null,null,null,null,null,""]
[null,null,null,null,null,null,null,null,null,null,""]
[null,null,null,"REFORÇO ESTRUTURAL",null,null,null,null,null,null,""]
[null,null,null,null,null,null,null,null,null,null,""]
[null,"OBSERVAÇÕES E CONCLUSÕES",null,null,null,null,null,null,null,null,""]
[null,null,null,null,null,null,null,null,null,null,""]
[null,"A edificação possui em seu espaço do pavimento térreo a acessibilidade satisfatória, exceto pela falta do mapa acessível nas entradas, balcão de atendimento que não está totalmente de acordo com as exigências da norma de vigente. O telefone possui altura acima do permitido de 1.20m em relação ao piso acabado que deve deixar altura livre inferior de até 0,73m, e estar devidamente sinalizado com o símbolo de acesso por pessoas em cadeira de rodas e o símbolo internacional de pessoas com deficiência auditiva.\nOs elevadores não possuem sinalizações táteis de alerta em todas as portas dos elevadores sendo necessário as adequações, e deve ter a sinalização visual com o símbolo internacional de acesso – SIA, as botoeiras devem possuir o relevo em braile. As escadas de emergências não possuem as sinalizações táteis de alerta no início e no final de cada trecho, deve ser feita as adaptações, também a sinalização visual nos pisos e espelhos da escada, e sinalização tátil junto às portas corta-fogo. \nNos acessos externos não existe rota com sinalização tátil no piso, conduzindo os pedestres para os acessos da edificação e alerte o trajeto nas calçadas para desníveis, travessias, mudanças de direção ou opção de percursos nas calçadas. Deve ser implantado a rota com piso tátil direcional e de alerta onde necessário, contornando o limite do lote não edificado onde exista descontinuidade da referência edificada. \nNo 8º, 9º e 10º andar, nestes andares, o layout das estações de trabalho, armários, objetos de decoração e por vezes bancos de espera, nas áreas internas das salas, comprometem a livre passagem mínima estabelecida pela NBR 9050:2020. Foram encontradas algumas inconformidades com as exigências da norma, em diversas salas as portas possuem o vão livre menores que 0,80m exigidos em norma. A sinalização tátil no hall dos elevadores nos pavimentos está de forma errada, pois não leva a pessoa com deficiência visual do elevador até o local de informações, o piso tátil está finalizado antes de chegar ao balcão.\nDeve ser aplicada instalação de sinalização tátil direcional de alerta nas áreas externas e internas apontadas neste laudo, a elaboração de projeto que adapte o layout das salas de trabalho de forma a obedecer às medidas mínimas, que não prejudiquem a circulação interna e mantenha as passagens de 0,90m mínimos de passagem prescritas pela norma e a substituição das portas existentes por portas com o vão livre mínimo de 0,80m. Ser feitas as adequações nas instalações dos sanitários pois nos banheiros acessíveis de todos os pavimentos incluindo o térreo está com a altura do acionamento da descarga superior a 1,00m, o piso não é antiderrapante, não existe barra vertical próxima ao vaso sanitário, o espelho é posicionado acima de 0,90m do piso acabado, a papeleira de sobrepor está posicionada abaixo de 1,00m do piso acabado, não existem mictórios acessíveis e o lavatório não possui 0,30m livres após a borda frontal de modo a permitir aproximação sobre a sua projeção. \nCom todos os itens descritos e analisados no laudo padrão, é recomendado a necessidade de todas as adequações expostas neste documento.\n\n",null,null,null,null,null,null,null,null,""]
[null,null,null,null,null,null,null,null,null,null,""]

{"sheet":"Anexo Fotográfico","index":21,"n_rows":310,"n_cols":3,"rows_kept":310,"cut":false,"hidden":false,"merged":[[1,0,1,2]]}
["Nº da Foto","Pavimento","Discriminação"]
["Numeração conforme laudo B, anexo a este documento"]
[1,"Área externa ","Apresenta a calçada externa de acesso principal a edificação."]
[2,"Área externa ","Apresenta a largura de 2.90m da calçada pública externa."]
[3,"Área externa ","Piso utilizado e local de travessia do pedestre, apresentando a falta do piso tátil."]
[4,"Área externa ","Piso utilizado e local de travessia do pedestre, apresentando a falta do piso tátil."]
[5,"Área externa ","Piso utilizado e local de travessia do pedestre, apresentando a falta do piso tátil."]
[6,"Área externa ","Travessia do pedestre, apresentando a falta do piso tátil."]
[7,"Área externa ","Travessia do pedestre e rota de acesso para entrada ao edifício, apresentando a falta do piso tátil."]
[8,"Área externa ","Travessia do pedestre e rota de acesso para entrada ao edifício, apresentando a falta do piso tátil."]
[9,"Área externa "," Guia rebaixada em faixas de pedestres, o\nrebaixamento está em desconformidade com a norma, não possui piso tátil de alerta, o rebaixamento não segue o fluxo da travessia do pedestre e as abas laterais do rebaixamento não possuem inclinação coreta."]
[10,"Área externa "," Guia rebaixada, não possui piso tátil de alerta e e as abas laterais do rebaixamento não possuem inclinação coreta."]
[11,"Área externa ","Sinalização visual nos acessos às garagens, apresenta a falta de sinalização sonora de alerta."]
[12,"Área externa ","Sinalização visual nos acessos às garagens, apresenta a falta de sinalização sonora de alerta."]
[13,"Área externa ","Sinalização visual nos acessos às garagens, apresenta a falta de sinalização sonora de alerta."]
[14,"Garagem A2"," Sinalização visual nas vagas do estacionamento A2, não existe a sinalização vertical para vaga de pessoas idosas."]
[15,"Garagem A2"," Sinalização visual nas vagas do estacionamento A2, não existe a sinalização vertical para vaga de pessoas idosas."]
[16,"Térreo ","Acesso à edificação, no acesso principa não possui o símbolo internacional SAI e o mapa acessível,  instalado nas entradas"]
[17,"Térreo ","Acesso à edificação, no acesso principa não possui o símbolo internacional SAI e o mapa acessível,  instalado nas entradas"]
[18,"8º pavimento","Hall dos elevadores dos pavimentos, iluminação abaixo de 150lux, piso tátil errado e a falta do piso nas aberturas dos elevadores."]
[19,"9º pavimento","Hall dos elevadores dos pavimentos, iluminação abaixo de 150lux, piso tátil errado e a falta do piso nas aberturas dos elevadores."]
[20,"10º pavimento","Hall dos elevadores dos pavimentos, iluminação abaixo de 150lux, piso tátil errado e a falta do piso nas aberturas dos elevadores."]
[21,"8º pavimento","Corredor secretaria nacional dos direitos da pessoa com\ndeficiência, com iluminação abaixo de 150lux."]
[22,"8º pavimento","Corredor secretaria nacional dos direitos da pessoa com\ndeficiência, com iluminação abaixo de 150lux."]
[23,"8º pavimento","Sala 818 e o piso da sala 836 - Coord-geral das pessoas com doenças raras -CGPDRE Cood-geral das comissões interministerial de avaliação – CGCIA, o piso não está nivelado, pois as superfícies não podem ter enrugamento."]
[24,"8º pavimento.","Planta baixa do pavimento, localização dos ambientes em cor vermelha com baixa iluminação."]
[25,"9º pavimento.","Planta baixa do pavimento, localização dos ambientes em cor vermelha com baixa iluminação."]
[26,"10º pavimento","Planta baixa do pavimento, localização dos ambientes em cor vermelha com baixa iluminação."]
[27,"8º pavimento","Escada de emergência, não há sinalização tátil de alerta, fotoluminescente ou retroiluminada nos pisos e espelhos das escadas em suas bordas laterais."]
[28,"9º pavimento","Escada de emergência, não há sinalização tátil de alerta, fotoluminescente ou retroiluminada nos pisos e espelhos das escadas em suas bordas laterais."]
[29,"10º pavimento","Escada de emergência, não há sinalização tátil de alerta, fotoluminescente ou retroiluminada nos pisos e espelhos das escadas em suas bordas laterais."]
[30,"8º pavimento.","Portas corta-fogo não há a sinalização tátil de alerta junto às portas."]
[31,"9º pavimento.","Portas corta-fogo não há a sinalização tátil de alerta junto às portas."]
[32,"10º pavimento.","Portas corta-fogo não há a sinalização tátil de alerta junto às portas."]
[33,"Térreo ","Escada de emergência, não há sinalização tátil de alerta, fotoluminescente ou retroiluminada nos pisos e espelhos das escadas em suas bordas laterais."]
[34,"Térreo ","Portas corta-fogo não há a sinalização tátil de alerta junto às portas."]
[35,"Térreo ","Portas corta-fogo não há a sinalização tátil de alerta junto às portas."]
[36,"8º pavimento","Portas dos elevadores não possui a\nsinalização tátil de alerta aplicada na largura do vão, nas portas."]
[37,"9º pavimento","Portas dos elevadores não possui a\nsinalização tátil de alerta aplicada na largura do vão, nas portas."]
[38,"10º pavimento","O piso tátil está finalizado antes de chegar ao balcão de\ninformações."]
[39,"Térreo "," Botoeiras externas não possuem relevo em braile e não possui a sinalização sonora para identificação da letra que o elevador estará disponível."]
[40,"8º, 9º e 10º pavimento"," Botoeiras externas não possuem relevo em braile e não possui a sinalização sonora para identificação da letra que o elevador estará disponível."]
[41,"Elevador preferêncial "," Botoeiras não possuem relevo em braile e não tem a sinalização visual com o símbolo internacional de acesso – SAI."]
[42,"Térreo ","Portas dos elevadores, a falta de piso de alerta no vão das portas dos elevadores e a sinalização tátil direcional não encontrara sinalização\ntátil de alerta do elevador, no lado onde se encontra a botoeira."]
[43,"Térreo ","Portas dos elevadores, a falta de piso de alerta no vão das portas dos elevadores e a sinalização tátil direcional não encontrara sinalização\ntátil de alerta do elevador, no lado onde se encontra a botoeira."]
[44,"Térreo ","Identificação do piso tátil direcional para os elevadores."]
[45,"Cabine dos elevadores ","Corrimão dos elevadores de A à F, não possui as extremidades fechadas e pussui cantos vivos."]
[46,"Cabine dos elevadores ","Corrimão dos elevadores de A à F, não possui as extremidades fechadas e pussui cantos vivos."]
[47,"8º pavimento","Sala 801 - Não atendem o espaço livre de 0,30 m contíguo à maçaneta, com profundidade de 1,20 m para o deslocamento frontal do usuário."]
[48,"8º pavimento","Sala 801A - Não atendem o espaço livre de 0,30 m contíguo à maçaneta, com profundidade de 1,20 m para o deslocamento frontal do usuário."]
[49,"8º pavimento","Sala 803C1 - Não atendem o espaço livre de 0,30 m contíguo à maçaneta, com profundidade de 1,20 m para o deslocamento frontal do usuário."]
[50,"8º pavimento","Sala 803B - Não atendem o espaço livre de 0,30 m contíguo à maçaneta, com profundidade de 1,20 m para o deslocamento frontal do usuário."]
[51,"8º pavimento","Sala 812A - Não atendem o espaço livre de 0,30 m contíguo à maçaneta, com profundidade de 1,20 m para o deslocamento frontal do usuário."]
[52,"8º pavimento","Sala 813A - Não atendem o espaço livre de 0,30 m contíguo à maçaneta, com profundidade de 1,20 m para o deslocamento frontal do usuário."]
[53,"8º pavimento","Espaço com 1,05m de largura para entrada nas salas 826A, a\n826D - Não atendem a profundidade de 1,20 m para o deslocamento frontal do usuário."]
[54,"8º pavimento","Sala 826B - Não atendem o espaço livre de 0,30 m contíguo à maçaneta, com profundidade de 1,20 m para o deslocamento frontal do usuário."]
[55,"8º pavimento","Sala 826C - Não atendem o espaço livre de 0,30 m contíguo à maçaneta, com profundidade de 1,20 m para o deslocamento frontal do usuário."]
[56,"8º pavimento","Entrada para a sala 836B."]
[57,"8º pavimento","Sala 836B - Não atendem o espaço livre de 0,30 m contíguo à maçaneta, com profundidade de 1,20 m para o deslocamento frontal do usuário."]
[58,"9º pavimento","Sala 932 - Não atendem o espaço livre de 0,30 m contíguo à maçaneta, com profundidade de 1,20 m para o deslocamento frontal do usuário."]
[59,"9º pavimento","Acesso a sala 922A - Não atendem o espaço livre de 1,20 m para o deslocamento frontal do usuário."]
[60,"9º pavimento","Sala 939 - Não atendem o espaço livre de 0,30 m contíguo à maçaneta, com profundidade de 1,20 m para o deslocamento frontal do usuário."]
[61,"9º pavimento","Sala 939E - Não atendem o espaço livre de 0,30 m contíguo à maçaneta, com profundidade de 1,20 m para o deslocamento frontal do usuário."]
[62,"9º pavimento","Sala 901A - Não atendem o espaço livre de 0,30 m contíguo à maçaneta, com profundidade de 1,20 m para o deslocamento frontal do usuário."]
[63,"9º pavimento","Acesso a sala 900C1 e 900C2 - Não atendem o espaço livre de 0,30 m contíguo à maçaneta, com profundidade de 1,20 m para o deslocamento frontal do usuário."]
[64,"9º pavimento","Sala 900A - Não atendem o espaço livre de 0,30 m contíguo à maçaneta, com profundidade de 1,20 m para o deslocamento frontal do usuário."]
[65,"9º pavimento","Sala sem identificação ao lado da 900A - Não atendem o espaço livre de 0,30 m contíguo à maçaneta, com profundidade de 1,20 m para o deslocamento frontal do usuário."]
[66,"9º pavimento","Sala 926E - Não atendem o espaço livre de 0,30 m contíguo à maçaneta, com profundidade de 1,20 m para o deslocamento frontal do usuário."]
[67,"9º pavimento","Sala 926F - Não atendem o espaço livre de 0,30 m contíguo à maçaneta, com profundidade de 1,20 m para o deslocamento frontal do usuário."]
[68,"9º pavimento","Sala 9231B - Não atendem o espaço livre de 0,30 m contíguo à maçaneta, com profundidade de 1,20 m para o deslocamento frontal do usuário."]
[69,"9º pavimento","Sala sem identificação ao lado da 931B - Não atendem o espaço livre de 0,30 m contíguo à maçaneta, com profundidade de 1,20 m para o deslocamento frontal do usuário."]
[70,"10º pavimento","Sala 1000A - Não atendem o espaço livre de 0,30 m contíguo à maçaneta, com profundidade de 1,20 m para o deslocamento frontal do usuário."]
[71,"10º pavimento","Sala 1001A - Não atendem o espaço livre de 0,30 m contíguo à maçaneta, com profundidade de 1,20 m para o deslocamento frontal do usuário."]
[72,"10º pavimento","Sala 1036A - Não atendem o espaço livre de 0,30 m contíguo à maçaneta, com profundidade de 1,20 m para o deslocamento frontal do usuário."]
[73,"10º pavimento","Sala 1016A - Não atendem o espaço livre de 0,30 m contíguo à maçaneta, com profundidade de 1,20 m para o deslocamento frontal do usuário."]
[74,"10º pavimento","Sala 1020A - Não atendem o espaço livre de 0,30 m contíguo à maçaneta, com profundidade de 1,20 m para o deslocamento frontal do usuário."]
[75,"10º pavimento","Sala 1025A - Não atendem o espaço livre de 0,30 m contíguo à maçaneta, com profundidade de 1,20 m para o deslocamento frontal do usuário."]
[76,"10º pavimento","Sala 1036 - Não atendem o espaço livre de 0,30 m contíguo à maçaneta, com profundidade de 1,20 m para o deslocamento frontal do usuário."]
[77,"10º pavimento","Sala 1029 - Não atendem o espaço livre de 0,30 m contíguo à maçaneta, com profundidade de 1,20 m para o deslocamento frontal do usuário."]
[78,"10º pavimento","Entrada para a sala sem identificação localizada dentro da sala 1003C - Não atendem o espaço livre de 0,30 m contíguo à maçaneta, com profundidade de 1,20 m para o deslocamento frontal do usuário."]
[79,"8º pavimento","Planta baixa do pavimento, localização das salas em cor vermelha, que não atende as exigências das esquadrias quanto ao deslocamento frontal do usuário."]
[80,"9º pavimento","Planta baixa do pavimento, localização das salas em cor vermelha, que não atende as exigências das esquadrias quanto ao deslocamento frontal do usuário."]
[81,"10º pavimento","Planta baixa do pavimento, localização das salas em cor vermelha, que não atende as exigências das esquadrias quanto ao deslocamento frontal do usuário."]
[82,"8º pavimento","Sala 832A - Não atendem o espaço livre de 0,60 m contíguo à maçaneta, com profundidade de 1,50 m para o deslocamento frontal do usuário."]
[83,"8º pavimento","Sala 832B - Não atendem o espaço livre de 0,60 m contíguo à maçaneta, com profundidade de 1,50 m para o deslocamento frontal do usuário."]
[84,"8º pavimento","Sala 814 - Não atendem o espaço livre de 0,60 m contíguo à maçaneta, com profundidade de 1,50 m para o deslocamento frontal do usuário."]
[85,"8º pavimento","Sala 813 - Não atendem o espaço livre de 0,60 m contíguo à maçaneta, com profundidade de 1,50 m para o deslocamento frontal do usuário."]
[86,"8º pavimento","Sala 803C1 - Não atendem o espaço livre de 0,60 m contíguo à maçaneta, com profundidade de 1,50 m para o deslocamento frontal do usuário."]
[87,"8º pavimento","Sala 803 - Não atendem o espaço livre de 0,60 m contíguo à maçaneta, com profundidade de 1,50 m para o deslocamento frontal do usuário."]
[88,"8º pavimento","Sala 813A - Não atendem o espaço livre de 0,60 m contíguo à maçaneta, com profundidade de 1,50 m para o deslocamento frontal do usuário."]
[89,"8º pavimento","Sala 801 - Não atendem o espaço livre de 0,60 m contíguo à maçaneta, com profundidade de 1,50 m para o deslocamento frontal do usuário."]
[90,"8º pavimento","Sala 804A copa - Não atendem o espaço livre de 0,60 m contíguo à maçaneta, com profundidade de 1,50 m para o deslocamento frontal do usuário."]
[91,"8º pavimento","Sala 803c2 - Não atendem o espaço livre de 0,60 m contíguo à maçaneta, com profundidade de 1,50 m para o deslocamento frontal do usuário."]
[92,"8º pavimento","Sala 812B  - Não atendem o espaço livre de 0,60 m contíguo à maçaneta, com profundidade de 1,50 m para o deslocamento frontal do usuário."]
[93,"8º pavimento","Espaço do trocador dentro da sala 812B  - Não atendem o espaço livre de 0,60 m contíguo à maçaneta, com profundidade de 1,50 m para o deslocamento frontal do usuário."]
[94,"8º pavimento","Sala 823A1 - Não atendem o espaço livre de 0,60 m contíguo à maçaneta, com profundidade de 1,50 m para o deslocamento frontal do usuário."]
[95,"8º pavimento","Sala 823A2 - Não atendem o espaço livre de 0,60 m contíguo à maçaneta, com profundidade de 1,50 m para o deslocamento frontal do usuário."]
[96,"9º pavimento","Sala 932 - Não atendem o espaço livre de 0,60 m contíguo à maçaneta, com profundidade de 1,50 m para o deslocamento frontal do usuário."]
[97,"9º pavimento","Sala 926 - Não atendem o espaço livre de 0,60 m contíguo à maçaneta, com profundidade de 1,50 m para o deslocamento frontal do usuário."]
[98,"9º pavimento","Sala 926A - Não atendem o espaço livre de 0,60 m contíguo à maçaneta, com profundidade de 1,50 m para o deslocamento frontal do usuário."]
[99,"9º pavimento","Sala 926B - Não atendem o espaço livre de 0,60 m contíguo à maçaneta, com profundidade de 1,50 m para o deslocamento frontal do usuário."]
[100,"9º pavimento","Sala 926C - Não atendem o espaço livre de 0,60 m contíguo à maçaneta, com profundidade de 1,50 m para o deslocamento frontal do usuário."]
[101,"9º pavimento","Sala 926D - Não atendem o espaço livre de 0,60 m contíguo à maçaneta, com profundidade de 1,50 m para o deslocamento frontal do usuário."]
[102,"9º pavimento","Sala 926E - Não atendem o espaço livre de 0,60 m contíguo à maçaneta, com profundidade de 1,50 m para o deslocamento frontal do usuário."]
[103,"9º pavimento","Sala 926F - Não atendem o espaço livre de 0,60 m contíguo à maçaneta, com profundidade de 1,50 m para o deslocamento frontal do usuário."]
[104,"9º pavimento","Sala 916 - Não atendem o espaço livre de 0,60 m contíguo à maçaneta, com profundidade de 1,50 m para o deslocamento frontal do usuário."]
[105,"9º pavimento","Sala 900CE - Não atendem o espaço livre de 0,60 m contíguo à maçaneta, com profundidade de 1,50 m para o deslocamento frontal do usuário."]
[106,"9º pavimento","Sala 939B - Não atendem o espaço livre de 0,60 m contíguo à maçaneta, com profundidade de 1,50 m para o deslocamento frontal do usuário."]
[107,"9º pavimento","Sala 939C - Não atendem o espaço livre de 0,60 m contíguo à maçaneta, com profundidade de 1,50 m para o deslocamento frontal do usuário."]
[108,"9º pavimento","Sala 939D - Não atendem o espaço livre de 0,60 m contíguo à maçaneta, com profundidade de 1,50 m para o deslocamento frontal do usuário."]
[109,"9º pavimento","Sala 939E - Não atendem o espaço livre de 0,60 m contíguo à maçaneta, com profundidade de 1,50 m para o deslocamento frontal do usuário."]
[110,"9º pavimento","Sala 923 - Não atendem o espaço livre de 0,60 m contíguo à maçaneta, com profundidade de 1,50 m para o deslocamento frontal do usuário."]
[111,"9º pavimento","Sala 931B - Não atendem o espaço livre de 0,60 m contíguo à maçaneta, com profundidade de 1,50 m para o deslocamento frontal do usuário."]
[112,"9º pavimento","Sala sem identificação localizada na sala 923 - Não atendem o espaço livre de 0,60 m contíguo à maçaneta, com profundidade de 1,50 m para o deslocamento frontal do usuário."]
[113,"9º pavimento","Sala sem identificação localizada na sala 923 - Não atendem o espaço livre de 0,60 m contíguo à maçaneta, com profundidade de 1,50 m para o deslocamento frontal do usuário."]
[114,"9º pavimento","Sala 927 - Não atendem o espaço livre de 0,60 m contíguo à maçaneta, com profundidade de 1,50 m para o deslocamento frontal do usuário."]
[115,"9º pavimento","Sala sem identificação de acesso principal as salas 939, 927 e 923 - Não atendem o espaço livre de 0,60 m contíguo à maçaneta, com profundidade de 1,50 m para o deslocamento frontal do usuário."]
[116,"9º pavimento","Sala 922 - Não atendem o espaço livre de 0,60 m contíguo à maçaneta, com profundidade de 1,50 m para o deslocamento frontal do usuário."]
[117,"9º pavimento","Sala 904 copa - Não atendem o espaço livre de 0,60 m contíguo à maçaneta, com profundidade de 1,50 m para o deslocamento frontal do usuário."]
[118,"10º pavimento","Sala 1020A - Não atendem o espaço livre de 0,60 m contíguo à maçaneta, com profundidade de 1,50 m para o deslocamento frontal do usuário."]
[119,"10º pavimento","Sala 1036 - Não atendem o espaço livre de 0,60 m contíguo à maçaneta, com profundidade de 1,50 m para o deslocamento frontal do usuário."]
[120,"10º pavimento","Sala 1032A - Não atendem o espaço livre de 0,60 m contíguo à maçaneta, com profundidade de 1,50 m para o deslocamento frontal do usuário."]
[121,"10º pavimento","Sala 1026 - Não atendem o espaço livre de 0,60 m contíguo à maçaneta, com profundidade de 1,50 m para o deslocamento frontal do usuário."]
[122,"10º pavimento","Sala 1000C1 - Não atendem o espaço livre de 0,60 m contíguo à maçaneta, com profundidade de 1,50 m para o deslocamento frontal do usuário."]
[123,"10º pavimento","Sala 1000C2 - Não atendem o espaço livre de 0,60 m contíguo à maçaneta, com profundidade de 1,50 m para o deslocamento frontal do usuário."]
[124,"10º pavimento","Sala 1018 - Não atendem o espaço livre de 0,60 m contíguo à maçaneta, com profundidade de 1,50 m para o deslocamento frontal do usuário."]
[125,"10º pavimento","Sala 1018A - Não atendem o espaço livre de 0,60 m contíguo à maçaneta, com profundidade de 1,50 m para o deslocamento frontal do usuário."]
[126,"10º pavimento","Sala 1016 - Não atendem o espaço livre de 0,60 m contíguo à maçaneta, com profundidade de 1,50 m para o deslocamento frontal do usuário."]
[127,"10º pavimento","Sala 1029 - Não atendem o espaço livre de 0,60 m contíguo à maçaneta, com profundidade de 1,50 m para o deslocamento frontal do usuário."]
[128,"10º pavimento","Sala 1029A - Não atendem o espaço livre de 0,60 m contíguo à maçaneta, com profundidade de 1,50 m para o deslocamento frontal do usuário."]
[129,"10º pavimento","Sala 1029B - Não atendem o espaço livre de 0,60 m contíguo à maçaneta, com profundidade de 1,50 m para o deslocamento frontal do usuário."]
[130,"10º pavimento","Sala 1025 - Não atendem o espaço livre de 0,60 m contíguo à maçaneta, com profundidade de 1,50 m para o deslocamento frontal do usuário."]
[131,"10º pavimento","Sala 1025A - Não atendem o espaço livre de 0,60 m contíguo à maçaneta, com profundidade de 1,50 m para o deslocamento frontal do usuário."]
[132,"10º pavimento","Copa - Não atendem o espaço livre de 0,60 m contíguo à maçaneta, com profundidade de 1,50 m para o deslocamento frontal do usuário."]
[133,"8º pavimento ","Planta baixa do pavimento, localização das salas em cor vermelha, que não atende as exigências das portas que abrem no sentido oposto ao deslocamento do usuário"]
[134,"9º pavimento ","Planta baixa do pavimento, localização das salas em cor vermelha, que não atende as exigências das portas que abrem no sentido oposto ao deslocamento do usuário"]
[135,"10º pavimento ","Planta baixa do pavimento, localização das salas em cor vermelha, que não atende as exigências das portas que abrem no sentido oposto ao deslocamento do usuário"]
[136,"8º pavimento ","Porta de acesso principal a secretaria nacional dos direitos\nda pessoa com deficiência, não esta atendendo as sinalização visuais e táteis para orientação e localização, no centro da aporta e na parede ao lado da maçaneta."]
[137,"8º pavimento ","Sala 836B, não esta atendendo as sinalização visuais e táteis para orientação e localização, no centro da aporta e na parede ao lado da maçaneta."]
[138,"8º pavimento ","Sala 818B, não esta atendendo as sinalização visuais e táteis para orientação e localização, no centro da aporta e na parede ao lado da maçaneta."]
[139,"8º pavimento ","Sala 818A, não esta atendendo as sinalização visuais e táteis para orientação e localização, no centro da aporta e na parede ao lado da maçaneta."]
[140,"8º pavimento ","Sala 803c1, não esta atendendo as sinalização visuais e táteis para orientação e localização, no centro da aporta e na parede ao lado da maçaneta."]
[141,"8º pavimento ","Porta de acesso principal as salas 843 e 841, não esta atendendo as sinalização visuais e táteis para orientação e localização, no centro da aporta e na parede ao lado da maçaneta."]
[142,"8º pavimento ","Sala 812, não esta atendendo as sinalização visuais e táteis para orientação e localização, no centro da aporta e na parede ao lado da maçaneta."]
[143,"8º pavimento ","Sala de publicações, não esta atendendo as sinalização visuais e táteis para orientação e localização, no centro da aporta e na parede ao lado da maçaneta."]
[144,"9º pavimento ","Porta de acesso principal as salas 900, 922, 932 e 936, não esta atendendo as sinalização visuais e táteis para orientação e localização, no centro da aporta e na parede ao lado da maçaneta."]
[145,"9º pavimento ","Porta de acesso principal as salas 923, 927, 939, não esta atendendo as sinalização visuais e táteis para orientação e localização, no centro da aporta e na parede ao lado da maçaneta."]
[146,"9º pavimento ","Sala 916A, não esta atendendo as sinalização visuais e táteis para orientação e localização, no centro da aporta e na parede ao lado da maçaneta."]
[147,"9º pavimento ","Sala 926E, não esta atendendo as sinalização visuais e táteis para orientação e localização, no centro da aporta e na parede ao lado da maçaneta."]
[148,"9º pavimento ","Sala 900A, não esta atendendo as sinalização visuais e táteis para orientação e localização, no centro da aporta e na parede ao lado da maçaneta."]
[149,"9º pavimento ","Sala ao lado da 900A, não esta atendendo as sinalização visuais e táteis para orientação e localização, no centro da aporta e na parede ao lado da maçaneta."]
[150,"9º pavimento ","Sala 923a, não esta atendendo as sinalização visuais e táteis para orientação e localização, no centro da aporta e na parede ao lado da maçaneta."]
[151,"9º pavimento ","Sala 923b, não esta atendendo as sinalização visuais e táteis para orientação e localização, no centro da aporta e na parede ao lado da maçaneta."]
[152,"9º pavimento ","Sala 923F, não esta atendendo as sinalização visuais e táteis para orientação e localização, no centro da aporta e na parede ao lado da maçaneta."]
[153,"9º pavimento ","Sala 923D, não esta atendendo as sinalização visuais e táteis para orientação e localização, no centro da aporta e na parede ao lado da maçaneta."]
[154,"9º pavimento ","Sala 923e, não esta atendendo as sinalização visuais e táteis para orientação e localização, no centro da aporta e na parede ao lado da maçaneta."]
[155,"9º pavimento ","Sala 939, não esta atendendo as sinalização visuais e táteis para orientação e localização, no centro da aporta e na parede ao lado da maçaneta."]
[156,"9º pavimento ","Sala 939A, não esta atendendo as sinalização visuais e táteis para orientação e localização, no centro da aporta e na parede ao lado da maçaneta."]
[157,"9º pavimento ","Sala dentro da sala 939A, não esta atendendo as sinalização visuais e táteis para orientação e localização, no centro da aporta e na parede ao lado da maçaneta."]
[158,"9º pavimento ","Sala dentro da sala 939, não esta atendendo as sinalização visuais e táteis para orientação e localização, no centro da aporta e na parede ao lado da maçaneta."]
[159,"9º pavimento ","Sala dentro da sala 939, não esta atendendo as sinalização visuais e táteis para orientação e localização, no centro da aporta e na parede ao lado da maçaneta."]
[160,"9º pavimento ","Sala 901D, não esta atendendo as sinalização visuais e táteis para orientação e localização, no centro da aporta e na parede ao lado da maçaneta."]
[161,"9º pavimento ","Sala dentro da sala 901, não esta atendendo as sinalização visuais e táteis para orientação e localização, no centro da aporta e na parede ao lado da maçaneta."]
[162,"9º pavimento ","Sala 901C, pussui sinalizações mas não permite o acesso para a sala."]
[163,"9º pavimento ","Sala técnica - quadro de distribuição, com sinalização divergente."]
[164,"9º pavimento ","Sala de acesso restrito, com sinalização divergente."]
[165,"9º pavimento ","Sala 923 - CGTI, há duas salas com numeração na sinalização igual."]
[166,"9º pavimento ","Sala 923 - DEPEDH , há duas salas com numeração na sinalização igual."]
[167,"9º pavimento ","Sala sem identificação no interior da sala 923 - Depart. de promoção dos direitos de lésbicas, gays, bissexuais, travestis e transexuais - DELGBT. Não esta atendendo as sinalização visuais e táteis para orientação e localização, no centro da aporta e na parede ao lado da maçaneta."]
[168,"9º pavimento ","Sala sem identificação no interior da sala 923 - Depart. de promoção dos direitos de lésbicas, gays, bissexuais, travestis e transexuais - DELGBT. Não esta atendendo as sinalização visuais e táteis para orientação e localização, no centro da aporta e na parede ao lado da maçaneta."]
[169,"9º pavimento ","Sala sem identificação no interior da sala 923 - Depart. de promoção dos direitos de lésbicas, gays, bissexuais, travestis e transexuais - DELGBT. Não esta atendendo as sinalização visuais e táteis para orientação e localização, no centro da aporta e na parede ao lado da maçaneta."]
[170,"9º pavimento ","Sala sem identificação dentro da sala 923 - Departamento de promoção e educação em direitos humanos – DEPEDH. Não esta atendendo as sinalização visuais e táteis para orientação e localização, no centro da aporta e na parede ao lado da maçaneta."]
[171,"9º pavimento ","Sala 936A, não esta atendendo as sinalização visuais e táteis para orientação e localização, no centro da aporta e na parede ao lado da maçaneta."]
[172,"9º pavimento ","Sala 932, não esta atendendo as sinalização visuais e táteis para orientação e localização, no centro da aporta e na parede ao lado da maçaneta."]
[173,"10º pavimento ","Porta de acesso principal as salas de 1016 a 1036, não esta atendendo as sinalização visuais e táteis para orientação e localização, no centro da aporta e na parede ao lado da maçaneta."]
[174,"10º pavimento ","Porta de acesso as salas 1029, 1041 e 1045, não esta atendendo as sinalização visuais e táteis para orientação e localização, no centro da aporta e na parede ao lado da maçaneta."]
[175,"10º pavimento ","Sala sem identificação dentro da sala 1003c, não esta atendendo as sinalização visuais e táteis para orientação e localização, no centro da aporta e na parede ao lado da maçaneta."]
[176,"10º pavimento ","Sala sem identificação dentro da sala 1003c, não esta atendendo as sinalização visuais e táteis para orientação e localização, no centro da aporta e na parede ao lado da maçaneta."]
[177,"10º pavimento ","Sala sem identificação dentro da sala 1003c, não esta atendendo as sinalização visuais e táteis para orientação e localização, no centro da aporta e na parede ao lado da maçaneta."]
[178,"10º pavimento ","Sala sem identificação dentro da sala 1003c, não esta atendendo as sinalização visuais e táteis para orientação e localização, no centro da aporta e na parede ao lado da maçaneta."]
[179,"10º pavimento ","Sala sem identificação dentro da sala 1003c, não esta atendendo as sinalização visuais e táteis para orientação e localização, no centro da aporta e na parede ao lado da maçaneta."]
[180,"10º pavimento ","Sala sem identificação dentro da sala 1003c, não esta atendendo as sinalização visuais e táteis para orientação e localização, no centro da aporta e na parede ao lado da maçaneta."]
[181,"10º pavimento ","Portas dos sanitários masculino e feminino, não esta atendendo as sinalização visuais e táteis para orientação e localização, no centro da aporta e na parede ao lado da maçaneta."]
[182,"10º pavimento ","Portas dos sanitários masculino e feminino, não esta atendendo as sinalização visuais e táteis para orientação e localização, no centro da aporta e na parede ao lado da maçaneta."]
[183,"8º pavimento ","planta baixa do pavimento, localização das salas em cor vermelha, que não atende as exigências das sinalizações nas portas."]
[184,"9º pavimento ","planta baixa do pavimento, localização das salas em cor vermelha, que não atende as exigências das sinalizações nas portas."]
[185,"10º pavimento ","planta baixa do pavimento, localização das salas em cor vermelha, que não atende as exigências das sinalizações nas portas."]
[186,"Térreo, 8º, 9º e 10º pavimento ","Sanitários, não possui maçaneta e puxador horizontal, apenas o puxador vertical."]
[187,"Térreo, 8º, 9º e 10º pavimento ","Sanitários, não possui maçaneta e puxador horizontal, apenas o puxador vertical."]
[188,"Térreo, 8º, 9º e 10º pavimento ","Sanitários, ausência de acionamento de sinalização de emergência"]
[189,"Térreo, 8º, 9º e 10º pavimento ","Sanitários, imagens visualização do sanitário."]
[190,"Térreo, 8º, 9º e 10º pavimento ","Sanitários, entrada para os boxs do sanitário coletívo e acessivel."]
[191,"Térreo, 8º, 9º e 10º pavimento ","Sanitários, o piso não é antiderrapante."]
[192,"Térreo","Sanitários, abertura frontal na bacia sanitária e ausência de barra vertical."]
[193,"Térreo","Sanitários, altura do acionamento da válvula de descarga esta com 1,10m."]
[194,"8º, 9º e 10º pavimento ","Sanitários, abertura frontal na bacia sanitária, ausência de barra vertical e altura do acionamento da válvula de descarga esta com 1,10m."]
[195,"8º, 9º e 10º pavimento ","Sanitários, lavatório não permitir aproximação de mínimo 0,30 m além da borda frontal."]
[196,"Térreo","Sanitários, não pussui lavatório no box acessível. "]
[197,"Térreo","Sanitários, conjunto de lavatório instalado em bancada não possui a altura livre inferior de 0,73m."]
[198,"8º, 9º e 10º pavimento ","Sanitários, papeleira de sobrepor está com altura de 0,85m do piso acabado."]
[199,"8º, 9º e 10º pavimento ","Sanitários, espelho em todos os pavimentos estão com altura da borda inferior de 1,08m do piso. "]
[200,"Térreo","Sanitários, papeleira localizada na parede de fundo da bacia sanitária."]
[201,"Térreo","Sanitário coletivo, abertura das portas dos boxs e o piso não é antiderrapante."]
[202,"Térreo","Sanitário coletivo, abertura das portas dos boxs e o piso não é antiderrapante."]
[203,"8º, 9º e 10º pavimento ","Sanitário coletivo, conjunto de lavatórios em bancada o vão livre inferior é 0,69m e não possui nenhuma barra de apoio."]
[204,"Térreo","Sanitário coletivo, conjunto de lavatórios em bancada o vão livre inferior é 0,69m e não possui nenhuma barra de apoio."]
[205,"Térreo, 8º, 9º e 10º pavimento ","Sanitário coletivo, mictório não existe área de aproximação frontal para pessoa com mobilidade reduzida."]
[206,"Térreo, 8º, 9º e 10º pavimento ","Sanitário coletivo, mictório altura para modelos suspensos é de 0,60 m a 0,65, altura existente encontra-se superior."]
[207,"Térreo","Sanitário coletivo, acessório altura do espelho."]
[208,"Térreo","Sanitário coletivo, a borda inferior do espelho está em uma altura de 1,05m do piso, deve estar em uma altura máxima de 0,90m do piso."]
[209,"8º pavimento ","Bebedouro, não permite a aproximação lateral de uma pessoa com cadeira de rodas."]
[210,"9º pavimento ","Bebedouro, não permite a aproximação lateral de uma pessoa com cadeira de rodas."]
[211,"10º pavimento ","Bebedouro, não permite a aproximação lateral de uma pessoa com cadeira de rodas."]
[212,"Térreo","O balcão de atendimento no térreo não possui altura livre sob o a profundidade livre mínima de 0,30 m, e não possui as sinalizações com o símbolo internacional de acesso - SIA e símbolo internacional de pessoas com deficiência auditiva. "]
[213,"8º, 9º e 10º pavimento ","Balcão, não possui parte rebaixada e o nível de iluminação não está em conformidade com o nível mínimo de 150 lux, e não possui as sinalizações com o símbolo internacional de acesso - SIA e símbolo internacional de pessoas com deficiência auditiva"]
[214,"8º, 9º e 10º pavimento ","Balcão, não possui parte rebaixada e o nível de iluminação não está em conformidade com o nível mínimo de 150 lux, e não possui as sinalizações com o símbolo internacional de acesso - SIA e símbolo internacional de pessoas com deficiência auditiva"]
[215,"Térreo","Telefone público no térreo com altura de 1,30m do piso, superior ao máximo permitido pela norma."]
[216,"Térreo","Telefone público no térreo, não possui o símbolo de acesso por pessoas em cadeira de rodas e o símbolo internacional de pessoas com deficiência auditiva."]
[217,"8º pavimento ","Sala 836, a circulação entre os móveis e passagens internas impossibilita a livre circulação deixando a passagem abaixo do mínimo necessário de 0,90m."]
[218,"8º pavimento ","Sala 836, a circulação entre os móveis e passagens internas impossibilita a livre circulação deixando a passagem abaixo do mínimo necessário de 0,90m."]
[219,"8º pavimento ","Sala 836A, a circulação entre os móveis e passagens internas impossibilita a livre circulação deixando a passagem abaixo do mínimo necessário de 0,90m."]
[220,"8º pavimento ","Sala 836B, a circulação entre os móveis e passagens internas impossibilita a livre circulação deixando a passagem abaixo do mínimo necessário de 0,90m."]
[221,"8º pavimento ","Sala 832A, a circulação entre os móveis e passagens internas impossibilita a livre circulação deixando a passagem abaixo do mínimo necessário de 0,90m."]
[222,"8º pavimento ","Sala 832B, a circulação entre os móveis e passagens internas impossibilita a livre circulação deixando a passagem abaixo do mínimo necessário de 0,90m."]
[223,"8º pavimento ","Sala 826A, a circulação entre os móveis e passagens internas impossibilita a livre circulação deixando a passagem abaixo do mínimo necessário de 0,90m."]
[224,"8º pavimento ","Sala 800, a circulação entre os móveis e passagens internas impossibilita a livre circulação deixando a passagem abaixo do mínimo necessário de 0,90m."]
[225,"8º pavimento ","Sala 816, a circulação entre os móveis e passagens internas impossibilita a livre circulação deixando a passagem abaixo do mínimo necessário de 0,90m."]
[226,"8º pavimento ","Sala 818C, a circulação entre os móveis e passagens internas impossibilita a livre circulação deixando a passagem abaixo do mínimo necessário de 0,90m."]
[227,"8º pavimento ","Sala 812B, a circulação entre os móveis e passagens internas impossibilita a livre circulação deixando a passagem abaixo do mínimo necessário de 0,90m."]
[228,"8º pavimento ","Sala 823, a circulação entre os móveis e passagens internas impossibilita a livre circulação deixando a passagem abaixo do mínimo necessário de 0,90m."]
[229,"8º pavimento ","Sala 823, a circulação entre os móveis e passagens internas impossibilita a livre circulação deixando a passagem abaixo do mínimo necessário de 0,90m."]
[230,"8º pavimento ","Sala 823, a circulação entre os móveis e passagens internas impossibilita a livre circulação deixando a passagem abaixo do mínimo necessário de 0,90m."]
[231,"8º pavimento ","Sala 823A, a circulação entre os móveis e passagens internas impossibilita a livre circulação deixando a passagem abaixo do mínimo necessário de 0,90m."]
[232,"8º pavimento ","Sala 823A, a circulação entre os móveis e passagens internas impossibilita a livre circulação deixando a passagem abaixo do mínimo necessário de 0,90m."]
[233,"8º pavimento ","Sala 823A, a circulação entre os móveis e passagens internas impossibilita a livre circulação deixando a passagem abaixo do mínimo necessário de 0,90m."]
[234,"8º pavimento ","Sala 823A1, a circulação entre os móveis e passagens internas impossibilita a livre circulação deixando a passagem abaixo do mínimo necessário de 0,90m."]
[235,"8º pavimento ","Sala 823A1, a circulação entre os móveis e passagens internas impossibilita a livre circulação deixando a passagem abaixo do mínimo necessário de 0,90m."]
[236,"8º pavimento ","Sala 823B, a circulação entre os móveis e passagens internas impossibilita a livre circulação deixando a passagem abaixo do mínimo necessário de 0,90m."]
[237,"8º pavimento ","Sala 823D, a circulação entre os móveis e passagens internas impossibilita a livre circulação deixando a passagem abaixo do mínimo necessário de 0,90m."]
[238,"8º pavimento ","Sala 823E, a circulação entre os móveis e passagens internas impossibilita a livre circulação deixando a passagem abaixo do mínimo necessário de 0,90m."]
[239,"8º pavimento ","Sala 823F, a circulação entre os móveis e passagens internas impossibilita a livre circulação deixando a passagem abaixo do mínimo necessário de 0,90m."]
[240,"8º pavimento ","Sala 813, a circulação entre os móveis e passagens internas impossibilita a livre circulação deixando a passagem abaixo do mínimo necessário de 0,90m."]
[241,"8º pavimento ","Sala 813, a circulação entre os móveis e passagens internas impossibilita a livre circulação deixando a passagem abaixo do mínimo necessário de 0,90m."]
[242,"8º pavimento ","Sala 803, a circulação entre os móveis e passagens internas impossibilita a livre circulação deixando a passagem abaixo do mínimo necessário de 0,90m."]
[243,"8º pavimento ","Sala 803, a circulação entre os móveis e passagens internas impossibilita a livre circulação deixando a passagem abaixo do mínimo necessário de 0,90m."]
[244,"8º pavimento ","Sala 803C, a circulação entre os móveis e passagens internas impossibilita a livre circulação deixando a passagem abaixo do mínimo necessário de 0,90m."]
[245,"8º pavimento ","Sala 803c1, a circulação entre os móveis e passagens internas impossibilita a livre circulação deixando a passagem abaixo do mínimo necessário de 0,90m."]
[246,"8º pavimento ","Sala 803c2, a circulação entre os móveis e passagens internas impossibilita a livre circulação deixando a passagem abaixo do mínimo necessário de 0,90m."]
[247,"9º pavimento ","Sala 901C, a circulação entre os móveis e passagens internas impossibilita a livre circulação deixando a passagem abaixo do mínimo necessário de 0,90m."]
[248,"9º pavimento ","Sala 926A, a circulação entre os móveis e passagens internas impossibilita a livre circulação deixando a passagem abaixo do mínimo necessário de 0,90m."]
[249,"9º pavimento ","Sala 926B, a circulação entre os móveis e passagens internas impossibilita a livre circulação deixando a passagem abaixo do mínimo necessário de 0,90m."]
[250,"9º pavimento ","Sala 926C, a circulação entre os móveis e passagens internas impossibilita a livre circulação deixando a passagem abaixo do mínimo necessário de 0,90m."]
[251,"9º pavimento ","Sala 926D, a circulação entre os móveis e passagens internas impossibilita a livre circulação deixando a passagem abaixo do mínimo necessário de 0,90m."]
[252,"9º pavimento ","Sala 926E, a circulação entre os móveis e passagens internas impossibilita a livre circulação deixando a passagem abaixo do mínimo necessário de 0,90m."]
[253,"9º pavimento ","Sala 926F, a circulação entre os móveis e passagens internas impossibilita a livre circulação deixando a passagem abaixo do mínimo necessário de 0,90m."]
[254,"9º pavimento ","Sala 923 - DEPEDH, a circulação entre os móveis e passagens internas impossibilita a livre circulação deixando a passagem abaixo do mínimo necessário de 0,90m."]
[255,"9º pavimento ","Sala 923 - DEPEDH, a circulação entre os móveis e passagens internas impossibilita a livre circulação deixando a passagem abaixo do mínimo necessário de 0,90m."]
[256,"9º pavimento ","Sala sem identificação na sala 923 - DELGBT, a circulação entre os móveis e passagens internas impossibilita a livre circulação deixando a passagem abaixo do mínimo necessário de 0,90m."]
[257,"9º pavimento ","Sala sem identificação na sala 923 - DELGBT, a circulação entre os móveis e passagens internas impossibilita a livre circulação deixando a passagem abaixo do mínimo necessário de 0,90m."]
[258,"9º pavimento ","Sala sem identificação na sala 923 - DELGBT, a circulação entre os móveis e passagens internas impossibilita a livre circulação deixando a passagem abaixo do mínimo necessário de 0,90m."]
[259,"9º pavimento ","Sala 900C, a circulação entre os móveis e passagens internas impossibilita a livre circulação deixando a passagem abaixo do mínimo necessário de 0,90m."]
[260,"9º pavimento ","Sala 939E, a circulação entre os móveis e passagens internas impossibilita a livre circulação deixando a passagem abaixo do mínimo necessário de 0,90m."]
[261,"9º pavimento ","Sala 939B, a circulação entre os móveis e passagens internas impossibilita a livre circulação deixando a passagem abaixo do mínimo necessário de 0,90m."]
[262,"9º pavimento ","Sala 939C, a circulação entre os móveis e passagens internas impossibilita a livre circulação deixando a passagem abaixo do mínimo necessário de 0,90m."]
[263,"9º pavimento ","Sala 939D, a circulação entre os móveis e passagens internas impossibilita a livre circulação deixando a passagem abaixo do mínimo necessário de 0,90m."]
[264,"10º pavimento ","Sala1029A, a circulação entre os móveis e passagens internas impossibilita a livre circulação deixando a passagem abaixo do mínimo necessário de 0,90m."]
[265,"10º pavimento ","Sala1029C, a circulação entre os móveis e passagens internas impossibilita a livre circulação deixando a passagem abaixo do mínimo necessário de 0,90m."]
[266,"10º pavimento ","Sala1036, a circulação entre os móveis e passagens internas impossibilita a livre circulação deixando a passagem abaixo do mínimo necessário de 0,90m."]
[267,"10º pavimento ","Sala1026, a circulação entre os móveis e passagens internas impossibilita a livre circulação deixando a passagem abaixo do mínimo necessário de 0,90m."]
[268,"10º pavimento ","Sala1003C, a circulação entre os móveis e passagens internas impossibilita a livre circulação deixando a passagem abaixo do mínimo necessário de 0,90m."]
[269,"10º pavimento ","Sala sem identificação na sala 1003C, a circulação entre os móveis e passagens internas impossibilita a livre circulação deixando a passagem abaixo do mínimo necessário de 0,90m."]
[270,"10º pavimento ","Sala sem identificação na sala 1003C, a circulação entre os móveis e passagens internas impossibilita a livre circulação deixando a passagem abaixo do mínimo necessário de 0,90m."]
[271,"10º pavimento ","Sala 1000D, a circulação entre os móveis e passagens internas impossibilita a livre circulação deixando a passagem abaixo do mínimo necessário de 0,90m."]
[272,"10º pavimento ","Sala 1000D, a circulação entre os móveis e passagens internas impossibilita a livre circulação deixando a passagem abaixo do mínimo necessário de 0,90m."]
[273,"10º pavimento ","Sala 1032, a circulação entre os móveis e passagens internas impossibilita a livre circulação deixando a passagem abaixo do mínimo necessário de 0,90m."]
[274,"10º pavimento ","Sala 1016, a circulação entre os móveis e passagens internas impossibilita a livre circulação deixando a passagem abaixo do mínimo necessário de 0,90m."]
[275,"10º pavimento ","Copa, a circulação entre os móveis e passagens internas impossibilita a livre circulação deixando a passagem abaixo do mínimo necessário de 0,90m."]
[276,"8º pavimento ","Planta baixa do pavimento, localização das salas em cor vermelha, quanto a circulação entre os móveis e passagens internas abaixo do mínimo de 0,90m. "]
[277,"9º pavimento ","Planta baixa do pavimento, localização das salas em cor vermelha, quanto a circulação entre os móveis e passagens internas abaixo do mínimo de 0,90m. "]
[278,"10º pavimento ","Planta baixa do pavimento, localização das salas em cor vermelha, quanto a circulação entre os móveis e passagens internas abaixo do mínimo de 0,90m. "]
[279,"8º pavimento ","Auditório Ana Paula Crosara de Resende - sala 843, não existe espaços reservados ou identificados para pessoas em cadeira de rodas e para pessoas com mobilidade reduzida, para pessoas obesas. A configuração dos assentos não é fixo e permite a fácil movimentação. "]
[280,"8º pavimento ","Auditório Ana Paula Crosara de Resende - sala 843, não existe espaços reservados ou identificados para pessoas em cadeira de rodas e para pessoas com mobilidade reduzida, para pessoas obesas. A configuração dos assentos não é fixo e permite a fácil movimentação. "]
[281,"8º e 10º pavimento ","Não existe identificação do local para o intérprete de libras no palco marcando com o símbolo internacional de pessoas com deficiência auditiva."]
[282,"8º pavimento ","Auditório Ana Paula Crosara de Resende - sala 843, não tem as medidas mínimas necessárias de 1,20m x 1,20m, que garante uma rotação de 90º, área de manobra de cadeiras de rodas."]
[283,"10º pavimento ","Ambiente de educação corporativa – 1045, não tem as medidas mínimas necessárias de 1,20m x 1,20m, que garante uma rotação de 90º, área de manobra de cadeiras de rodas."]
[284,"10º pavimento ","Ambiente de educação corporativa – 1045, não tem as medidas mínimas necessárias de 1,20m x 1,20m, que garante uma rotação de 90º, área de manobra de cadeiras de rodas."]
[285,"10º pavimento ","Ambiente de educação corporativa – 1045, não tem as medidas mínimas necessárias de 1,20m x 1,20m, que garante uma rotação de 90º, área de manobra de cadeiras de rodas."]
[286,"10º pavimento ","Ambiente de educação corporativa – 1045, não existe espaços reservados ou identificados para pessoas em cadeira de rodas e para pessoas com mobilidade reduzida, para pessoas obesas."]
[287,"10º pavimento ","Ambiente de educação corporativa – 1045, não existe espaços reservados ou identificados para pessoas em cadeira de rodas e para pessoas com mobilidade reduzida, para pessoas obesas. "]
[288,"8º pavimento ","Copa, não há espaço para manobra de cadeira de rodas e não possibilita a livre circulação de pessoas em cadeira de rodas, as pias não possuem a altura livre inferior de no mínimo 0.73m "]
[289,"8º pavimento ","Copa, não há espaço para manobra de cadeira de rodas e não possibilita a livre circulação de pessoas em cadeira de rodas, as pias não possuem a altura livre inferior de no mínimo 0.73m "]
[290,"8º pavimento ","Espaço de circulação utilizado com carrinhos de copa. "]
[291,"9º pavimento ","Copa, não há espaço para manobra de cadeira de rodas e não possibilita a livre circulação de pessoas em cadeira de rodas, as pias não possuem a altura livre inferior de no mínimo 0.73m "]
[292,"9º pavimento ","Copa, não há espaço para manobra de cadeira de rodas e não possibilita a livre circulação de pessoas em cadeira de rodas, as pias não possuem a altura livre inferior de no mínimo 0.73m "]
[293,"9º pavimento ","Espaço de circulação utilizado com carrinhos de copa. "]
[294,"10º pavimento ","Copa, não há espaço para manobra de cadeira de rodas e não possibilita a livre circulação de pessoas em cadeira de rodas, as pias não possuem a altura livre inferior de no mínimo 0.73m "]
[295,"10º pavimento ","Copa, não há espaço para manobra de cadeira de rodas e não possibilita a livre circulação de pessoas em cadeira de rodas, as pias não possuem a altura livre inferior de no mínimo 0.73m "]
[296,"10º pavimento ","Copa, não há espaço para manobra de cadeira de rodas e não possibilita a livre circulação de pessoas em cadeira de rodas, as pias não possuem a altura livre inferior de no mínimo 0.73m "]
[297,"10º pavimento ","Copa, não há espaço para manobra de cadeira de rodas e não possibilita a livre circulação de pessoas em cadeira de rodas, as pias não possuem a altura livre inferior de no mínimo 0.73m "]
[298,"10º pavimento ","Copa, não há espaço para manobra de cadeira de rodas e não possibilita a livre circulação de pessoas em cadeira de rodas, as pias não possuem a altura livre inferior de no mínimo 0.73m "]
[299,"10º pavimento ","Copa, não há espaço para manobra de cadeira de rodas e não possibilita a livre circulação de pessoas em cadeira de rodas, as pias não possuem a altura livre inferior de no mínimo 0.73m "]
[300,"8º pavimento","Iluminação no hall dos helevadores, não está em conformidade com o nível mínimo de iluminação de 150 lux "]
[301,"10º pavimento","Iluminação no hall dos helevadores, não está em conformidade com o nível mínimo de iluminação de 150 lux "]
[302,"9º pavimento","Iluminação no corredor lateral não está em conformidade com o nível mínimo de iluminação de 150 lux "]
[303,"Escada de emergência ","Não há sinalização tátil nas escadas interligando os vários pavimentos."]
[304,"Escada de emergência ","Não há sinalização tátil junto às portas corta-fogo."]
[305,"Escada de emergência ","Não há sinalização tátil nas escadas interligando os vários pavimentos."]
[306,"Sinalização de emergência ","8º pavimento - Sinalização de emergência em funcionamento, a mesma entra em funcionamento quando há falta ou falha da iluminação normal instalada."]
[307,"Sinalização de emergência ","Na sala 1045 - Ambiente de educação corporativa no 10º pavimento, possui sinalização de emergência divergente, direcionando a rota de fuga para uma porta que não existe saída."]
[308,"Sinalização de emergência ","8º pavimento - Sinalização de emergência em funcionamento, a mesma entra em funcionamento quando há falta ou falha da iluminação normal instalada."]