{"text_format":"1","workbook":"xlsx","n_sheets":7,"sheets":["BP","DFC","DR","DRA","DVA","DMPL","--"],"not_rendered":{"charts":0,"images":0,"macros":1,"external_links":0,"defined_names":2,"comments":0,"pivot_tables":0},"unopened":[],"bounds":{"document_bytes":16777216,"sheet_cells":100000,"rows_first":2000,"rows_last":500,"rows_between":2000,"halvings":0,"cell_chars":16384,"cell_head_chars":4096},"cells_cut":0,"cells_raw":0,"read":"whole","date_system":"1900"}

{"sheet":"BP","index":0,"n_rows":56,"n_cols":8,"rows_kept":56,"cut":false,"hidden":false,"merged":[[0,1,0,7],[3,1,3,4],[1,6,1,7],[29,6,29,7]]}
[null,"EBSERH - EMPRESA BRASILEIRA DE SERVIÇOS HOSPITALARES"]
[null,"Balanço Patrimonial Consolidado ",null,null,null,null,"31 de dezembro de 2022"]
[null,"Em reais"]
[null,"ATIVO ",null,null,null,"NOTA","31.12.2022","31.12.2021"]
[null,"CIRCULANTE",null,null,null,"1.1",1690017716.3299999,1347106009.1400001]
[null,null,"Caixa e Equivalentes de Caixa",null,null,"1.1.1",1147824718.5,885657238.94000006]
[null,null,"Valores a Curto Prazo - SUS",null,null,"1.1.2",8965001.6699999999,4759346.75]
[null,null,"Subvenção de Custeio SUS a Receber",null,null,null,0,0]
[null,null,"Adiantamentos e Créditos a Receber",null,null,"1.1.3",144727860.81999996,41885310.209999993]
[null,null,"Estoques",null,null,"1.1.4",388500135.33999997,414804113.24000001]
[null,"NÃO CIRCULANTE",null,null,null,"1.2",848677488.51999986,703760365.91991401]
[null,null,"Valores a Longo Prazo - SUS",null,null,"1.2.1",9147438.9900000002,9148070.5899999999]
[null,null,"Depósitos Judiciais",null,null,"1.2.2",29822559.25,20014167.16]
[null,null,"Outras Despesas Antecipadas",null,null,"1.2.2","Fora do Siafi","Fora do Siafi"]
[null,null,"Imobilizado",null,null,"1.2.3",748290924.18999982,537676315.82000005]
[null,null,null,"Bens Móveis",null,"1.2.3.1",786521764.0999999,599223984.51000011]
[null,null,null,null,"Depreciação Bens Móveis","1.2.3.3",-177100098.25,-130063016.56]
[null,null,null,null,"Redução a Valor Recup. De Imobilizado","1.2.4",-7241668.4900000002,-6060015.7199999997]
[null,null,null,"Bens Imóveis",null,"1.2.3.2",146220362.15000001,74954251.829999998]
[null,null,null,null,"Depreciação Bens Imóveis","1.2.3.3",-109435.32,-378888.24]
{"$rows_left_out":37}
{"sheet":"DFC","index":1,"n_rows":56,"n_cols":12,"rows_kept":56,"cut":false,"hidden":false,"merged":[[0,0,0,6],[1,9,1,10],[0,8,0,10]]}
["Organizador de DFC",null,null,null,null,null,null,null,"EBSERH - EMPRESA BRASILEIRA DE SERVIÇOS HOSPITALARES"]
["Grupo","Conta Contábil","Valor Fechamento","Valor anterior","Análise","Regra","Δ Variação",null,"Demonstração do Fluxo de Caixa - Método Indireto","31 de dezembro de 2022"]
[null,null,null,null,null,null,null,null,"Em reais"]
["Passivo-C","Resultado do Exercício",{"$f":"IFERROR(IFERROR(IFERROR(INDEX(BP!B:H,MATCH(B4,BP!C:C,0),6),INDEX(BP!B:H,MATCH(B4,BP!D:D,0),6)),INDEX(BP!B:H,MATCH(B4,BP!E:E,0),6)),\"\")","v":-454588910.49999619},{"$f":"IFERROR(IFERROR(IFERROR(INDEX(BP!B:H,MATCH(B4,BP!C:C,0),7),INDEX(BP!B:H,MATCH(B4,BP!D:D,0),7)),INDEX(BP!B:H,MATCH(B4,BP!E:E,0),7)),\"\")","v":-218107289.10000134},{"$f":"IF(A4=\"\",\"\",IF(C4>D4,\"Aumento em\",\"Redução em\"))","v":"Redução em"},{"$f":"IF(A4=\"\",\"\",IF(AND(LEFT(A4,5)=\"Ativo\",C4>D4),\"(-)\",IF(AND(LEFT(A4,5)=\"Ativo\",C4<D4),\"(+)\",IF(AND(LEFT(A4,7)=\"Passivo\",C4>D4),\"(+)\",IF(AND(LEFT(A4,7)=\"Passivo\",C4<D4),\"(-)\",\"-\")))))","v":"(-)"},{"$f":"IFERROR(IF(C4-D4>=0,C4-D4,(C4-D4)*-1),\"\")","v":236481621.39999485},null,"DESCRIÇÃO"," 01.01.2022                          a                        31.12.2022"," 01.01.2021                          a                        31.12.2021"]
[{"$f":"IF(LEFT(#REF!,7)=\"Despesa\",\"\",IF(LEFT(#REF!,7)=\"Receita\",\"\",#REF!))","v":{"$error":"#REF!"}},{"$f":"IF(LEFT(A5,7)=\"Despesa\",\"\",IF(LEFT(A5,7)=\"Receita\",\"\",IF(A5=\"\",\"\",#REF!)))","v":{"$error":"#REF!"}},{"$f":"IFERROR(IFERROR(IFERROR(INDEX(BP!B:H,MATCH(B5,BP!C:C,0),6),INDEX(BP!B:H,MATCH(B5,BP!D:D,0),6)),INDEX(BP!B:H,MATCH(B5,BP!E:E,0),6)),\"\")","v":""},{"$f":"IFERROR(IFERROR(IFERROR(INDEX(BP!B:H,MATCH(B5,BP!C:C,0),7),INDEX(BP!B:H,MATCH(B5,BP!D:D,0),7)),INDEX(BP!B:H,MATCH(B5,BP!E:E,0),7)),\"\")","v":""},{"$f":"IF(A5=\"\",\"\",IF(C5>D5,\"Aumento em\",\"Redução em\"))","v":{"$error":"#REF!"}},{"$error":"#REF!"},{"$f":"IFERROR(IF(C5-D5>=0,C5-D5,(C5-D5)*-1),\"\")","v":""},null,"FLUXO DE CAIXA DAS ATIVIDADES OPERACIONAIS",null,"(Reapresentado, vide Nota c)"]
[{"$f":"IF(LEFT(#REF!,7)=\"Despesa\",\"\",IF(LEFT(#REF!,7)=\"Receita\",\"\",#REF!))","v":{"$error":"#REF!"}},{"$f":"IF(LEFT(A6,7)=\"Despesa\",\"\",IF(LEFT(A6,7)=\"Receita\",\"\",IF(A6=\"\",\"\",#REF!)))","v":{"$error":"#REF!"}},{"$f":"IFERROR(IFERROR(IFERROR(INDEX(BP!B:H,MATCH(B6,BP!C:C,0),6),INDEX(BP!B:H,MATCH(B6,BP!D:D,0),6)),INDEX(BP!B:H,MATCH(B6,BP!E:E,0),6)),\"\")","v":""},{"$f":"IFERROR(IFERROR(IFERROR(INDEX(BP!B:H,MATCH(B6,BP!C:C,0),7),INDEX(BP!B:H,MATCH(B6,BP!D:D,0),7)),INDEX(BP!B:H,MATCH(B6,BP!E:E,0),7)),\"\")","v":""},{"$f":"IF(A6=\"\",\"\",IF(C6>D6,\"Aumento em\",\"Redução em\"))","v":{"$error":"#REF!"}},{"$error":"#REF!"},{"$f":"IF(F6=\"(-)\",IFERROR(IF(C6-D6>=0,C6-D6,(C6-D6)*-1),\"\")*-1,IFERROR(IF(C6-D6>=0,C6-D6,(C6-D6)*-1),\"\"))","v":{"$error":"#REF!"}},null,"Resultado do Exercício",-454588910.49999619,-218107289.09999999]
[{"$f":"IF(LEFT(#REF!,7)=\"Despesa\",\"\",IF(LEFT(#REF!,7)=\"Receita\",\"\",#REF!))","v":{"$error":"#REF!"}},{"$f":"IF(LEFT(A7,7)=\"Despesa\",\"\",IF(LEFT(A7,7)=\"Receita\",\"\",IF(A7=\"\",\"\",#REF!)))","v":{"$error":"#REF!"}},{"$f":"IFERROR(IFERROR(IFERROR(INDEX(BP!B:H,MATCH(B7,BP!C:C,0),6),INDEX(BP!B:H,MATCH(B7,BP!D:D,0),6)),INDEX(BP!B:H,MATCH(B7,BP!E:E,0),6)),\"\")","v":""},{"$f":"IFERROR(IFERROR(IFERROR(INDEX(BP!B:H,MATCH(B7,BP!C:C,0),7),INDEX(BP!B:H,MATCH(B7,BP!D:D,0),7)),INDEX(BP!B:H,MATCH(B7,BP!E:E,0),7)),\"\")","v":""},{"$f":"IF(A7=\"\",\"\",IF(C7>D7,\"Aumento em\",\"Redução em\"))","v":{"$error":"#REF!"}},{"$f":"IF(A7=\"\",\"\",IF(AND(LEFT(A7,5)=\"Ativo\",C7>D7),\"(-)\",IF(AND(LEFT(A7,5)=\"Ativo\",C7<D7),\"(+)\",IF(AND(LEFT(A7,7)=\"Passivo\",C7>D7),\"(+)\",IF(AND(LEFT(A7,7)=\"Passivo\",C7<D7),\"(-)\",\"-\")))))","v":{"$error":"#REF!"}},{"$f":"IF(F7=\"(-)\",IFERROR(IF(C7-D7>=0,C7-D7,(C7-D7)*-1),\"\")*-1,IFERROR(IF(C7-D7>=0,C7-D7,(C7-D7)*-1),\"\"))","v":{"$error":"#REF!"}},null,"Ajustes de Exercícios Anteriores",null,0]
[{"$f":"IF(LEFT(#REF!,7)=\"Despesa\",\"\",IF(LEFT(#REF!,7)=\"Receita\",\"\",#REF!))","v":{"$error":"#REF!"}},{"$f":"IF(LEFT(A8,7)=\"Despesa\",\"\",IF(LEFT(A8,7)=\"Receita\",\"\",IF(A8=\"\",\"\",#REF!)))","v":{"$error":"#REF!"}},{"$f":"IFERROR(IFERROR(IFERROR(INDEX(BP!B:H,MATCH(B8,BP!C:C,0),6),INDEX(BP!B:H,MATCH(B8,BP!D:D,0),6)),INDEX(BP!B:H,MATCH(B8,BP!E:E,0),6)),\"\")","v":""},{"$f":"IFERROR(IFERROR(IFERROR(INDEX(BP!B:H,MATCH(B8,BP!C:C,0),7),INDEX(BP!B:H,MATCH(B8,BP!D:D,0),7)),INDEX(BP!B:H,MATCH(B8,BP!E:E,0),7)),\"\")","v":""},{"$error":"#REF!"},{"$error":"#REF!"},{"$error":"#REF!"},null,"Depreciação e Amortização",52136496.05999998,42143083.409999996]
[{"$f":"IF(LEFT(#REF!,7)=\"Despesa\",\"\",IF(LEFT(#REF!,7)=\"Receita\",\"\",#REF!))","v":{"$error":"#REF!"}},{"$f":"IF(LEFT(A9,7)=\"Despesa\",\"\",IF(LEFT(A9,7)=\"Receita\",\"\",IF(A9=\"\",\"\",#REF!)))","v":{"$error":"#REF!"}},{"$f":"IFERROR(IFERROR(IFERROR(INDEX(BP!B:H,MATCH(B9,BP!C:C,0),6),INDEX(BP!B:H,MATCH(B9,BP!D:D,0),6)),INDEX(BP!B:H,MATCH(B9,BP!E:E,0),6)),\"\")","v":""},{"$f":"IFERROR(IFERROR(IFERROR(INDEX(BP!B:H,MATCH(B9,BP!C:C,0),7),INDEX(BP!B:H,MATCH(B9,BP!D:D,0),7)),INDEX(BP!B:H,MATCH(B9,BP!E:E,0),7)),\"\")","v":""},{"$error":"#REF!"},{"$error":"#REF!"},{"$error":"#REF!"},null,"Redução a Valor Recuperável - Intangível",-25373.410000000149,0]
[{"$f":"IF(LEFT(#REF!,7)=\"Despesa\",\"\",IF(LEFT(#REF!,7)=\"Receita\",\"\",#REF!))","v":{"$error":"#REF!"}},{"$f":"IF(LEFT(A10,7)=\"Despesa\",\"\",IF(LEFT(A10,7)=\"Receita\",\"\",IF(A10=\"\",\"\",#REF!)))","v":{"$error":"#REF!"}},{"$f":"IFERROR(IFERROR(IFERROR(INDEX(BP!B:H,MATCH(B10,BP!C:C,0),6),INDEX(BP!B:H,MATCH(B10,BP!D:D,0),6)),INDEX(BP!B:H,MATCH(B10,BP!E:E,0),6)),\"\")","v":""},{"$f":"IFERROR(IFERROR(IFERROR(INDEX(BP!B:H,MATCH(B10,BP!C:C,0),7),INDEX(BP!B:H,MATCH(B10,BP!D:D,0),7)),INDEX(BP!B:H,MATCH(B10,BP!E:E,0),7)),\"\")","v":""},{"$error":"#REF!"},{"$error":"#REF!"},{"$error":"#REF!"},null,"Redução a Valor Recuperável - Imobilizado",1181652.7700000005,-105863.92]
[{"$f":"IF(LEFT(#REF!,7)=\"Despesa\",\"\",IF(LEFT(#REF!,7)=\"Receita\",\"\",#REF!))","v":{"$error":"#REF!"}},{"$f":"IF(LEFT(A11,7)=\"Despesa\",\"\",IF(LEFT(A11,7)=\"Receita\",\"\",IF(A11=\"\",\"\",#REF!)))","v":{"$error":"#REF!"}},{"$f":"IFERROR(IFERROR(IFERROR(INDEX(BP!B:H,MATCH(B11,BP!C:C,0),6),INDEX(BP!B:H,MATCH(B11,BP!D:D,0),6)),INDEX(BP!B:H,MATCH(B11,BP!E:E,0),6)),\"\")","v":""},{"$f":"IFERROR(IFERROR(IFERROR(INDEX(BP!B:H,MATCH(B11,BP!C:C,0),7),INDEX(BP!B:H,MATCH(B11,BP!D:D,0),7)),INDEX(BP!B:H,MATCH(B11,BP!E:E,0),7)),\"\")","v":""},{"$f":"IF(A11=\"\",\"\",IF(C11>D11,\"Aumento em\",\"Redução em\"))","v":{"$error":"#REF!"}},{"$f":"IF(A11=\"\",\"\",IF(AND(LEFT(A11,5)=\"Ativo\",C11>D11),\"(-)\",IF(AND(LEFT(A11,5)=\"Ativo\",C11<D11),\"(+)\",IF(AND(LEFT(A11,7)=\"Passivo\",C11>D11),\"(+)\",IF(AND(LEFT(A11,7)=\"Passivo\",C11<D11),\"(-)\",\"-\")))))","v":{"$error":"#REF!"}},{"$f":"IF(F11=\"(-)\",IFERROR(IF(C11-D11>=0,C11-D11,(C11-D11)*-1),\"\")*-1,IFERROR(IF(C11-D11>=0,C11-D11,(C11-D11)*-1),\"\"))","v":{"$error":"#REF!"}},null,"Resultado do Exercício Ajustado",-401296135.07999623,-176070069.60999998]
[{"$f":"IF(LEFT(#REF!,7)=\"Despesa\",\"\",IF(LEFT(#REF!,7)=\"Receita\",\"\",#REF!))","v":{"$error":"#REF!"}},{"$f":"IF(LEFT(A12,7)=\"Despesa\",\"\",IF(LEFT(A12,7)=\"Receita\",\"\",IF(A12=\"\",\"\",#REF!)))","v":{"$error":"#REF!"}},{"$f":"IFERROR(IFERROR(IFERROR(INDEX(BP!B:H,MATCH(B12,BP!C:C,0),6),INDEX(BP!B:H,MATCH(B12,BP!D:D,0),6)),INDEX(BP!B:H,MATCH(B12,BP!E:E,0),6)),\"\")","v":""},{"$f":"IFERROR(IFERROR(IFERROR(INDEX(BP!B:H,MATCH(B12,BP!C:C,0),7),INDEX(BP!B:H,MATCH(B12,BP!D:D,0),7)),INDEX(BP!B:H,MATCH(B12,BP!E:E,0),7)),\"\")","v":""},{"$error":"#REF!"},{"$error":"#REF!"},{"$error":"#REF!"}]
[{"$f":"IF(LEFT(#REF!,7)=\"Despesa\",\"\",IF(LEFT(#REF!,7)=\"Receita\",\"\",#REF!))","v":{"$error":"#REF!"}},{"$f":"IF(LEFT(A13,7)=\"Despesa\",\"\",IF(LEFT(A13,7)=\"Receita\",\"\",IF(A13=\"\",\"\",#REF!)))","v":{"$error":"#REF!"}},{"$f":"IFERROR(IFERROR(IFERROR(INDEX(BP!B:H,MATCH(B13,BP!C:C,0),6),INDEX(BP!B:H,MATCH(B13,BP!D:D,0),6)),INDEX(BP!B:H,MATCH(B13,BP!E:E,0),6)),\"\")","v":""},{"$f":"IFERROR(IFERROR(IFERROR(INDEX(BP!B:H,MATCH(B13,BP!C:C,0),7),INDEX(BP!B:H,MATCH(B13,BP!D:D,0),7)),INDEX(BP!B:H,MATCH(B13,BP!E:E,0),7)),\"\")","v":""},{"$error":"#REF!"},{"$error":"#REF!"},{"$error":"#REF!"},null,"Variações Patrimoniais",651877463.81281471,462412551.02999997]
[{"$f":"IF(LEFT(#REF!,7)=\"Despesa\",\"\",IF(LEFT(#REF!,7)=\"Receita\",\"\",#REF!))","v":{"$error":"#REF!"}},{"$f":"IF(LEFT(A14,7)=\"Despesa\",\"\",IF(LEFT(A14,7)=\"Receita\",\"\",IF(A14=\"\",\"\",#REF!)))","v":{"$error":"#REF!"}},{"$f":"IFERROR(IFERROR(IFERROR(INDEX(BP!B:H,MATCH(B14,BP!C:C,0),6),INDEX(BP!B:H,MATCH(B14,BP!D:D,0),6)),INDEX(BP!B:H,MATCH(B14,BP!E:E,0),6)),\"\")","v":""},{"$f":"IFERROR(IFERROR(IFERROR(INDEX(BP!B:H,MATCH(B14,BP!C:C,0),7),INDEX(BP!B:H,MATCH(B14,BP!D:D,0),7)),INDEX(BP!B:H,MATCH(B14,BP!E:E,0),7)),\"\")","v":""},{"$error":"#REF!"},{"$error":"#REF!"},{"$error":"#REF!"},null,"Aumento/Redução Valores a Curto Prazo - SUS",-4205654.92,30252569.379999999]
[{"$f":"IF(LEFT(#REF!,7)=\"Despesa\",\"\",IF(LEFT(#REF!,7)=\"Receita\",\"\",#REF!))","v":{"$error":"#REF!"}},{"$f":"IF(LEFT(A15,7)=\"Despesa\",\"\",IF(LEFT(A15,7)=\"Receita\",\"\",IF(A15=\"\",\"\",#REF!)))","v":{"$error":"#REF!"}},{"$f":"IFERROR(IFERROR(IFERROR(INDEX(BP!B:H,MATCH(B15,BP!C:C,0),6),INDEX(BP!B:H,MATCH(B15,BP!D:D,0),6)),INDEX(BP!B:H,MATCH(B15,BP!E:E,0),6)),\"\")","v":""},{"$f":"IFERROR(IFERROR(IFERROR(INDEX(BP!B:H,MATCH(B15,BP!C:C,0),7),INDEX(BP!B:H,MATCH(B15,BP!D:D,0),7)),INDEX(BP!B:H,MATCH(B15,BP!E:E,0),7)),\"\")","v":""},{"$error":"#REF!"},{"$error":"#REF!"},{"$error":"#REF!"},null,"Aumento Adiantamentos e Créditos a Receber",-102842550.60999997,-24652268.890000001]
[{"$f":"IF(LEFT(#REF!,7)=\"Despesa\",\"\",IF(LEFT(#REF!,7)=\"Receita\",\"\",#REF!))","v":{"$error":"#REF!"}},{"$f":"IF(LEFT(A16,7)=\"Despesa\",\"\",IF(LEFT(A16,7)=\"Receita\",\"\",IF(A16=\"\",\"\",#REF!)))","v":{"$error":"#REF!"}},{"$f":"IFERROR(IFERROR(IFERROR(INDEX(BP!B:H,MATCH(B16,BP!C:C,0),6),INDEX(BP!B:H,MATCH(B16,BP!D:D,0),6)),INDEX(BP!B:H,MATCH(B16,BP!E:E,0),6)),\"\")","v":""},{"$f":"IFERROR(IFERROR(IFERROR(INDEX(BP!B:H,MATCH(B16,BP!C:C,0),7),INDEX(BP!B:H,MATCH(B16,BP!D:D,0),7)),INDEX(BP!B:H,MATCH(B16,BP!E:E,0),7)),\"\")","v":""},{"$error":"#REF!"},{"$error":"#REF!"},{"$error":"#REF!"},null,"Aumento/Redução Estoques",26303977.900000036,-75440140.790000007]
[{"$f":"IF(LEFT(#REF!,7)=\"Despesa\",\"\",IF(LEFT(#REF!,7)=\"Receita\",\"\",#REF!))","v":{"$error":"#REF!"}},{"$f":"IF(LEFT(A17,7)=\"Despesa\",\"\",IF(LEFT(A17,7)=\"Receita\",\"\",IF(A17=\"\",\"\",#REF!)))","v":{"$error":"#REF!"}},{"$f":"IFERROR(IFERROR(IFERROR(INDEX(BP!B:H,MATCH(B17,BP!C:C,0),6),INDEX(BP!B:H,MATCH(B17,BP!D:D,0),6)),INDEX(BP!B:H,MATCH(B17,BP!E:E,0),6)),\"\")","v":""},{"$f":"IFERROR(IFERROR(IFERROR(INDEX(BP!B:H,MATCH(B17,BP!C:C,0),7),INDEX(BP!B:H,MATCH(B17,BP!D:D,0),7)),INDEX(BP!B:H,MATCH(B17,BP!E:E,0),7)),\"\")","v":""},{"$error":"#REF!"},{"$error":"#REF!"},{"$error":"#REF!"},null,"Aumento/Redução em Valores a Longo Prazo - SUS",631.59999999962747,-9148070.5899999999]
[{"$f":"IF(LEFT(#REF!,7)=\"Despesa\",\"\",IF(LEFT(#REF!,7)=\"Receita\",\"\",#REF!))","v":{"$error":"#REF!"}},{"$f":"IF(LEFT(A18,7)=\"Despesa\",\"\",IF(LEFT(A18,7)=\"Receita\",\"\",IF(A18=\"\",\"\",#REF!)))","v":{"$error":"#REF!"}},{"$f":"IFERROR(IFERROR(IFERROR(INDEX(BP!B:H,MATCH(B18,BP!C:C,0),6),INDEX(BP!B:H,MATCH(B18,BP!D:D,0),6)),INDEX(BP!B:H,MATCH(B18,BP!E:E,0),6)),\"\")","v":""},{"$f":"IFERROR(IFERROR(IFERROR(INDEX(BP!B:H,MATCH(B18,BP!C:C,0),7),INDEX(BP!B:H,MATCH(B18,BP!D:D,0),7)),INDEX(BP!B:H,MATCH(B18,BP!E:E,0),7)),\"\")","v":""},{"$error":"#REF!"},{"$error":"#REF!"},{"$error":"#REF!"},null,"Aumento em Depósitos Judiciais",-9808392.0899999999,-5663492.54]
[{"$f":"IF(LEFT(#REF!,7)=\"Despesa\",\"\",IF(LEFT(#REF!,7)=\"Receita\",\"\",#REF!))","v":{"$error":"#REF!"}},{"$f":"IF(LEFT(A19,7)=\"Despesa\",\"\",IF(LEFT(A19,7)=\"Receita\",\"\",IF(A19=\"\",\"\",#REF!)))","v":{"$error":"#REF!"}},{"$f":"IFERROR(IFERROR(IFERROR(INDEX(BP!B:H,MATCH(B19,BP!C:C,0),6),INDEX(BP!B:H,MATCH(B19,BP!D:D,0),6)),INDEX(BP!B:H,MATCH(B19,BP!E:E,0),6)),\"\")","v":""},{"$f":"IFERROR(IFERROR(IFERROR(INDEX(BP!B:H,MATCH(B19,BP!C:C,0),7),INDEX(BP!B:H,MATCH(B19,BP!D:D,0),7)),INDEX(BP!B:H,MATCH(B19,BP!E:E,0),7)),\"\")","v":""},{"$error":"#REF!"},{"$error":"#REF!"},{"$error":"#REF!"},null,"Aumento/Redução em Obrigações Trabalhistas a Pagar",653690703.36000025,-63359913.520000003]
[{"$f":"IF(LEFT(#REF!,7)=\"Despesa\",\"\",IF(LEFT(#REF!,7)=\"Receita\",\"\",#REF!))","v":{"$error":"#REF!"}},{"$f":"IF(LEFT(A20,7)=\"Despesa\",\"\",IF(LEFT(A20,7)=\"Receita\",\"\",IF(A20=\"\",\"\",#REF!)))","v":{"$error":"#REF!"}},{"$f":"IFERROR(IFERROR(IFERROR(INDEX(BP!B:H,MATCH(B20,BP!C:C,0),6),INDEX(BP!B:H,MATCH(B20,BP!D:D,0),6)),INDEX(BP!B:H,MATCH(B20,BP!E:E,0),6)),\"\")","v":""},{"$f":"IFERROR(IFERROR(IFERROR(INDEX(BP!B:H,MATCH(B20,BP!C:C,0),7),INDEX(BP!B:H,MATCH(B20,BP!D:D,0),7)),INDEX(BP!B:H,MATCH(B20,BP!E:E,0),7)),\"\")","v":""},{"$error":"#REF!"},{"$error":"#REF!"},{"$error":"#REF!"},null,"Aumento/Redução em Fornecedores e Contas a Pagar a Curto Prazo",71594481.460000008,-14727415.08]
{"$rows_left_out":37}
{"sheet":"DR","index":2,"n_rows":51,"n_cols":17,"rows_kept":51,"cut":false,"hidden":false,"merged":[[3,1,3,3],[0,1,0,9],[30,1,30,3],[16,2,16,3],[19,2,19,3],[7,1,7,3],[22,2,22,3],[24,2,24,3],[8,2,8,3],[13,2,13,3],[1,7,1,9],[38,1,38,9],[25,1,25,3],[26,1,26,3],[29,1,29,3],[33,1,33,3],[35,1,35,3],[37,1,37,3]]}
[null,"EBSERH - EMPRESA BRASILEIRA DE SERVIÇOS HOSPITALARES"]
[null,"Demonstração do Resultado",null,null,null,null,null,"31 de dezembro de 2022"]
[null,"Em reais"]
[null,"DESCRIÇÃO",null,null,"Nota","01.01.2022                    a                30.09.2022","  01.10.2022                    a                    31.12.2022"," 01.01.2022                          a                        31.12.2022","  01.10.2021                    a                    31.12.2021"," 01.01.2021                          a                        31.12.2021"]
[null,"Receita Bruta",null,null,"3.1",78931970.010000005,15834174.390000001,94766144.400000006,45009693.07,144216383.47]
[null,null,"Receita com Serviços",null,null,78931970.010000005,15834174.390000001,94766144.400000006,45009693.07,144216383.47]
[null,null,null,"Receita de Serviços e Exploração","3.1.1",78931970.010000005,15834174.390000001,94766144.400000006,45009693.07,144216383.47]
[null,"Despesas Operacionais",null,null,"3.3",-6533171982.2799997,-3082020572.2199998,-9615192554.5,-2324828834.8299999,-8538800838.3200006]
[null,null,"Despesa com Pessoal, Encargos e Benefícios",null,"3.3.1",-4447252014.2299995,-2122429245.8800006,-6569681260.1100006,-1462391712.3699999,-5811710230.6700001]
[null,null,null,"Remuneração a Pessoal","3.3.1.1",-3047579516.9699998,-1458863617.5100007,-4506443134.4800005,-988080684.88,-4091098353.0999999]
[null,null,null,"Encargos Patronais","3.3.1.2",-1087439456.48,-577057475.72000003,-1664496932.2,-344153648.25999999,-1316895095.6400001]
[null,null,null,"Benefícios a Pessoal","3.3.1.3",-249230320.52000001,-86039292.329999954,-335269612.84999996,-85989046.590000004,-338606038.5]
[null,null,null,"Outras Despesas com Pessoal e Encargos","3.3.1.4",-63002720.259999998,-468860.3200000003,-63471580.579999998,-44168332.640000001,-65110743.43]
[null,null,"Despesa com Uso de Bens e Serviços",null,null,-1969137172.03,-784168512.40999877,-2753305684.4399986,-684009769.55999994,-2510972595.0700002]
[null,null,null,"Uso de Material de Consumo","3.3.2",-862985392.08000004,-325553054.34999931,-1188538446.4299994,-291763250.89999998,-1164628947.1600001]
[null,null,null,"Serviços Tomados","3.3.3",-1106151779.95,-458615458.05999947,-1564767238.0099995,-392246518.66000003,-1346343647.9100001]
[null,null,"Despesa com Bens Móveis, Imóveis e Intangíveis",null,null,-63035417.909999996,-5084787.6200000085,-68120205.530000001,-15836519.379999999,-47822349.789999999]
[null,null,null,"Depreciação, Amortização e Impairment","3.3.4",-40217333.329999998,-14691033.150000006,-54908366.480000004,-11840420.58,-42809751.420000002]
[null,null,null,"Perdas Involuntárias e Desfazimentos","3.3.5",-22818084.579999998,9606245.5299999975,-13211839.050000001,-3996098.8,-5012598.37]
[null,null,"Contingência para Riscos Fiscais",null,"3.3.6",-48600150.020000003,-169942818.24000001,-218542968.26000002,-161384306.59999999,-163264983.92999998]
{"$rows_left_out":32}
{"sheet":"DRA","index":3,"n_rows":9,"n_cols":4,"rows_kept":9,"cut":false,"hidden":false,"merged":[[0,1,0,3],[1,2,1,3],[2,11,2,12],[8,1,8,3]]}
[null,"EBSERH - EMPRESA BRASILEIRA DE SERVIÇOS HOSPITALARES"]
[null,"Demonstrações do Resultado Abrangente","31 de dezembro de 2022"]
[null,"Em reais"]
[null,"descrição"," 01.01.2022                          a                        31.12.2022"," 01.01.2021                          a                        31.12.2021"]
[null,"1 Resultado do Exercício",-454588910.49999619,-218107289.10000038]
[null,"2 Outros Resultados Abrangentes",0,0]
[null,"2.1 Ajuste de Avaliação Patrimonial",0,0]
[null,"3 Resultado Abrangente do Período",-454588910.49999619,-218107289.10000038]
[null,"As notas explicativas da Administração são parte integrante das Demonstrações Contábeis"]

{"sheet":"DVA","index":4,"n_rows":38,"n_cols":6,"rows_kept":38,"cut":false,"hidden":false,"merged":[[0,1,0,3],[1,2,1,3]]}
[null,"EBSERH - EMPRESA BRASILEIRA DE SERVIÇOS HOSPITALARES"]
[null,"Demonstração do Valor Adicionado ","31 de dezembro de 2022"]
[null,"Em reais "]
[null,"DESCRIÇÃO"," 01.01.2022                          a                        31.12.2022"," 01.01.2021                          a                        31.12.2021"]
[null,"Geração de Valor Adicionado"]
[null,"1 - Receitas",94766144.400000006,144216383.47]
[null,"1.1 - Atividades Operacionais",94766144.400000006,144216383.47]
[null,"1.1.1 - Receita de Serviços e Exploração",94766144.400000006,144216383.47]
[null,"2 - Insumos Adquiridos de Terceiros",2829165701.4499984,2507811143.6500006]
[null,"2.1 - Materiais de Consumo",1188538446.4299994,1164628947.1600001]
[null,"2.2 - Energia elétrica, Água e Esgoto, Gás",146497387.12,136889015.41]
[null,"2.3 - Serviços de Terceiros",1471337958.2999995,1197458492.5699999]
[null,"2.4 - Contigências para Riscos Cíveis",22791909.599999998,8834688.5099999998]
[null,"3 - Valor Adicionado Bruto (1-2)",-2734399557.0499983,-2363594760.1800008]
[null,"4 - Depreciação, Amortização, Impairment e Perdas",68120205.530000001,47822349.789999992]
[null,"4.1 - Depreciação do Período",48201667.229999997,36902659.329999998]
[null,"4.2 - Amortização do Período",5439697.6599999992,5904313.04]
[null,"4.3 - Redução a Valor Recuperável - Impairment",1267001.5900000001,2779.05]
[null,"4.4 - Perdas Involuntárias e Desfazimentos",13211839.050000001,5012598.37]
[null,"5 - Valor Adicionado Líquido (3-4)",-2802519762.5799985,-2411417109.9700007]
{"$rows_left_out":19}
{"sheet":"DMPL","index":5,"n_rows":22,"n_cols":6,"rows_kept":22,"cut":false,"hidden":false,"merged":[[21,1,21,5],[2,13,2,14],[1,4,1,5],[0,1,0,5],[12,1,13,1],[12,2,13,2],[12,3,13,3],[12,4,13,4],[12,5,13,5],[11,1,11,5],[3,1,4,1],[3,2,4,2],[3,3,4,3],[3,4,4,4],[3,5,4,5]]}
[null,"EBSERH - EMPRESA BRASILEIRA DE SERVIÇOS HOSPITALARES"]
[null,"Demonstração Consolidada das Mutações do Patrimônio Líquido ",null,null,"31 de dezembro de 2022"]
[null,"Em reais"]
[null,"Componentes ","Capital Social Integralizado","Reservas de Capital - AFAC","Resultados Acumulados","Patrimônio Líquido "]
[]
[null,"Saldos Iniciais 31/12/2020",381384237.75,202658776.91,-529544354.01999998,54498660.640000001]
[null,"Resultado Líquido do Exercício",0,0,-218107289.09999999,0]
[null,"Adiantamento para Futuro Aumento de Capital - AFAC",0,112365624.37,0,0]
[null,"Integralização de AFAC ao Capital Social",181119026.97,-181119026.97,0,0]
[null,"Saldos Finais em 31/12/2021",562503264.72000003,133905374.30999997,-747651643.12,-51243004.090000033]
[]
[]
[null,"Componentes ","Capital Social Integralizado","Reservas de Capital - AFAC","Resultados Acumulados","Patrimônio Líquido"]
[]
[null,"Saldos Iniciais em 31/12/2021",562503264.72000003,133905374.31,-747651643.13,-51243004.090000004]
[null,"Resultado Líquido do Exercício",0,0,-454588910.49999619,0]
[null,"Adiantamento para Futuro Aumento de Capital - AFAC",0,228745272.01999992,0,0]
[null,"Compensação do Prejuízo",0,0,0,0]
[null,"Ajustes de Exercícios Anteriores",0,0,0,0]
[null,"Integralização de AFAC ao Capital Social",119056780.93999994,-119056780.93999994,0,0]
{"$rows_left_out":3}
{"sheet":"--","index":6,"n_rows":192,"n_cols":4,"rows_kept":192,"cut":false,"hidden":true,"merged":[]}
["1 - Receitas",null,"Grupo Dva","Subgrupo DVA"]
["1.1 - Atividades operacionais",null,"1.1 - Atividades operacionais","1.1 - Atividades operacionais"]
["Relatório Financeiro PF",null,"Relatório Financeiro PF","Relatório Financeiro PF"]
["2 - Insumos Adquiridos de Terceiros",null,"2 - Insumos Adquiridos de Terceiros","2 - Insumos Adquiridos de Terceiros"]
["2.1 - Materiais de Consumo",null,"2 - Insumos Adquiridos de Terceiros","2.1 - Materiais de Consumo"]
["3.3.1.1.1.01.00",{"$f":"VLOOKUP(A6,#REF!,2,0)","v":{"$error":"#REF!"}},"2 - Insumos Adquiridos de Terceiros","2.1 - Materiais de Consumo"]
["3.3.1.1.1.02.00",{"$f":"VLOOKUP(A7,#REF!,2,0)","v":{"$error":"#REF!"}},"2 - Insumos Adquiridos de Terceiros","2.1 - Materiais de Consumo"]
["3.3.1.1.1.03.00",{"$f":"VLOOKUP(A8,#REF!,2,0)","v":{"$error":"#REF!"}},"2 - Insumos Adquiridos de Terceiros","2.1 - Materiais de Consumo"]
["3.3.1.1.1.04.00",{"$f":"VLOOKUP(A9,#REF!,2,0)","v":{"$error":"#REF!"}},"2 - Insumos Adquiridos de Terceiros","2.1 - Materiais de Consumo"]
["3.3.1.1.1.05.00",{"$f":"VLOOKUP(A10,#REF!,2,0)","v":{"$error":"#REF!"}},"2 - Insumos Adquiridos de Terceiros","2.1 - Materiais de Consumo"]
["3.3.1.1.1.06.00",{"$f":"VLOOKUP(A11,#REF!,2,0)","v":{"$error":"#REF!"}},"2 - Insumos Adquiridos de Terceiros","2.1 - Materiais de Consumo"]
["3.3.1.1.1.07.00",{"$f":"VLOOKUP(A12,#REF!,2,0)","v":{"$error":"#REF!"}},"2 - Insumos Adquiridos de Terceiros","2.1 - Materiais de Consumo"]
["3.3.1.1.1.08.00",{"$f":"VLOOKUP(A13,#REF!,2,0)","v":{"$error":"#REF!"}},"2 - Insumos Adquiridos de Terceiros","2.1 - Materiais de Consumo"]
["3.3.1.1.1.09.00",{"$f":"VLOOKUP(A14,#REF!,2,0)","v":{"$error":"#REF!"}},"2 - Insumos Adquiridos de Terceiros","2.1 - Materiais de Consumo"]
["3.3.1.1.1.99.00",{"$f":"VLOOKUP(A15,#REF!,2,0)","v":{"$error":"#REF!"}},"2 - Insumos Adquiridos de Terceiros","2.1 - Materiais de Consumo"]
["3.6.3.3.1.01.00",{"$f":"VLOOKUP(A16,#REF!,2,0)","v":{"$error":"#REF!"}},"2 - Insumos Adquiridos de Terceiros","2.1 - Materiais de Consumo"]
["2.2 - Energia elétrica, Água e Esgoto, Gás",null,"2 - Insumos Adquiridos de Terceiros","2.2 - Energia elétrica, Água e Esgoto, Gás"]
["3.3.2.3.2.08.00",{"$f":"VLOOKUP(A18,#REF!,2,0)","v":{"$error":"#REF!"}},"2 - Insumos Adquiridos de Terceiros","2.2 - Energia elétrica, Água e Esgoto, Gás"]
["3.3.2.3.4.08.00",{"$f":"VLOOKUP(A19,#REF!,2,0)","v":{"$error":"#REF!"}},"2 - Insumos Adquiridos de Terceiros","2.2 - Energia elétrica, Água e Esgoto, Gás"]
["3.3.2.3.1.08.00",{"$f":"VLOOKUP(A20,#REF!,2,0)","v":{"$error":"#REF!"}},"2 - Insumos Adquiridos de Terceiros","2.2 - Energia elétrica, Água e Esgoto, Gás"]
{"$rows_left_out":172}