{"text_format":"1","workbook":"xlsx","n_sheets":7,"sheets":["BP","DR","DFC","DVA","DMPL","DRA","--"],"not_rendered":{"charts":0,"images":0,"macros":1,"external_links":0,"defined_names":2,"comments":0,"pivot_tables":0},"unopened":[],"bounds":{"document_bytes":16777216,"sheet_cells":100000,"rows_first":2000,"rows_last":500,"rows_between":2000,"halvings":0,"cell_chars":16384,"cell_head_chars":4096},"cells_cut":0,"cells_raw":0,"read":"whole","date_system":"1900"}

{"sheet":"BP","index":0,"n_rows":55,"n_cols":8,"rows_kept":55,"cut":false,"hidden":false,"merged":[[0,1,0,7],[3,1,3,4],[1,6,1,7],[30,6,30,7]]}
[null,"EBSERH - EMPRESA BRASILEIRA DE SERVIÇOS HOSPITALARES"]
[null,"Balanço Patrimonial Intermediário",null,null,null,null,"31 de março de 2022"]
[null,"Em reais"]
[null,"ATIVO ",null,null,null,"NOTA","31.03.2022","31.12.2021"]
[null,"CIRCULANTE",null,null,null,"1.1",2603531502.4499998,1347106009.1400001]
[null,null,"Caixa e Equivalentes de Caixa",null,null,"1.1.1",877711816.2700001,885657238.94000006]
[null,null,"Valores a Curto Prazo - SUS",null,null,"1.1.2",3700019.53,4759346.75]
[null,null,"Subvenção de Custeio SUS a Receber",null,null,"1.1.3",1266302967.9100001,0]
[null,null,"Adiantamentos e Créditos a Receber",null,null,"1.1.4",63712103.349999987,41885310.209999993]
[null,null,"Estoques",null,null,"1.1.5",392104595.38999999,414804113.24000001]
[null,null,"Valores em Liquidação",null,null,null,0,0]
[null,"NÃO CIRCULANTE",null,null,null,"1.2",726670337.51682615,703760365.91991401]
[null,null,"Valores a Longo Prazo - SUS",null,null,"1.2.1",9147438.9900000002,9148070.5899999999]
[null,null,"Depósitos Judiciais",null,null,"1.2.2",17459546.32,20014167.16]
[null,null,"Outras Despesas Antecipadas",null,null,"1.2.2","Fora do Siafi","Fora do Siafi"]
[null,null,"Imobilizado",null,null,"1.2.3",583119762.21999991,537676315.82000005]
[null,null,null,"Bens Móveis",null,"1.2.3.1",643596448.80999982,599223984.51000011]
[null,null,null,null,"Depreciação Bens Móveis","1.2.3.3",-141735670.78999999,-130063016.56]
[null,null,null,null,"Redução a Valor Recup. De Imobilizado","1.2.3.3",-6060015.7199999997,-6060015.7199999997]
[null,null,null,"Bens Imóveis",null,"1.2.3.2",87776296.069999993,74954251.829999998]
{"$rows_left_out":36}
{"sheet":"DR","index":1,"n_rows":51,"n_cols":17,"rows_kept":51,"cut":false,"hidden":false,"merged":[[3,1,3,3],[0,1,0,9],[30,1,30,3],[16,2,16,3],[19,2,19,3],[7,1,7,3],[22,2,22,3],[24,2,24,3],[8,2,8,3],[13,2,13,3],[1,7,1,9],[38,1,38,9],[25,1,25,3],[26,1,26,3],[29,1,29,3],[33,1,33,3],[35,1,35,3],[37,1,37,3]]}
[null,"EBSERH - EMPRESA BRASILEIRA DE SERVIÇOS HOSPITALARES"]
[null,"Demonstração Intermediária do Resultado",null,null,null,null,null,"31 de março de 2022"]
[null,"Em reais"]
[null,"DESCRIÇÃO",null,null,"Nota","01.01.2021                    a                30.09.2021","  01.10.2021                    a                    31.12.2021"," 01.01.2022                          a                        31.03.2022"," 01.01.2022                          a                        31.03.2022"," 01.01.2021                          a                        31.03.2021"]
[null,"Receita Bruta",null,null,"3.1",99206690.400000006,-71805679.5,27401010.899999999,8962469.4600000083,34024361.840000004]
[null,null,"Receita com Serviços",null,null,99206690.400000006,-71805679.5,27401010.899999999,8962469.4600000083,34024361.840000004]
[null,null,null,"Receita de Serviços e Exploração","3.1.1",99206690.400000006,-71805679.5,27401010.899999999,8962469.4600000083,34024361.840000004]
[null,"Despesas Operacionais",null,null,"3.3",-6213972003.4899998,4179744147.5300002,-2034227855.96,-2047715134.0499997,-1962363355.9200001]
[null,null,"Despesa com Pessoal, Encargos e Benefícios",null,"3.3.1",-4349318518.3000002,2934823234.0300002,-1414495284.27,-1442292501.1299999,-1396877837.5699999]
[null,null,null,"Remuneração a Pessoal","3.3.2",-3103017668.2200003,2144910429.4100003,-958107238.80999994,-955936471.6699996,-1001744707.89]
[null,null,null,"Encargos Patronais","3.3.3",-972741447.38,639085175.84000003,-333656271.53999996,-397327665.74000013,-310158462.35999995]
[null,null,null,"Benefícios a Pessoal","3.3.4",-252616991.91,168878942.68000001,-83738049.229999989,-80748896.970000029,-81110249.299999997]
[null,null,null,"Outras Despesas com Pessoal e Encargos","3.3.5",-20942410.790000003,-18051313.899999995,-38993724.689999998,-8279466.7500000009,-3864418.02]
[null,null,"Despesa com Uso de Bens e Serviços",null,null,-1826962825.5100002,1224324335.1300001,-602638490.38000011,-560543614.33999979,-554372495.71999991]
[null,null,null,"Uso de Material de Consumo","3.3.6",-872865696.26000011,599094804.92000008,-273770891.33999997,-250187800.79999995,-258511732.80999997]
[null,null,null,"Serviços Tomados","3.3.7",-954097129.25000012,625229530.21000004,-328867599.04000008,-310355813.53999984,-295860762.90999991]
[null,null,"Despesa com Bens Móveis, Imóveis e Intangíveis",null,null,-31985830.410000004,15807239.430000005,-16178590.979999999,-8992357.4399999976,-10021347.469999999]
[null,null,null,"Depreciação, Amortização e Impairment","3.3.8",-30969330.840000004,17690658.830000006,-13278672.009999998,-8990289.0999999978,-9713566.7799999993]
[null,null,null,"Perdas Involuntárias e Desfazimentos","3.3.9",-1016499.57,-1883419.4000000004,-2899918.97,-2068.3400000000838,-307780.69]
[null,null,"Contingência para Riscos Fiscais",null,"3.3.9",-1880677.33,1880677.33,0,-32309903.249999996,0]
{"$rows_left_out":32}
{"sheet":"DFC","index":2,"n_rows":55,"n_cols":12,"rows_kept":55,"cut":false,"hidden":false,"merged":[[0,0,0,6],[1,10,1,11],[5,8,5,9],[0,8,0,11]]}
["Organizador de DFC",null,null,null,null,null,null,null,"EBSERH - EMPRESA BRASILEIRA DE SERVIÇOS HOSPITALARES"]
["Grupo","Conta Contábil","Valor Fechamento","Valor anterior","Análise","Regra","Δ Variação",null,"Demonstração Intermediária do Fluxo de Caixa",null,"31 de março de 2022"]
[null,null,null,null,null,null,null,null,"Em reais"]
["Passivo-C","Resultado do Exercício",{"$f":"IFERROR(IFERROR(IFERROR(INDEX(BP!B:H,MATCH(B4,BP!C:C,0),6),INDEX(BP!B:H,MATCH(B4,BP!D:D,0),6)),INDEX(BP!B:H,MATCH(B4,BP!E:E,0),6)),\"\")","v":-47043642.659999609},{"$f":"IFERROR(IFERROR(IFERROR(INDEX(BP!B:H,MATCH(B4,BP!C:C,0),7),INDEX(BP!B:H,MATCH(B4,BP!D:D,0),7)),INDEX(BP!B:H,MATCH(B4,BP!E:E,0),7)),\"\")","v":-218107289.10000134},{"$f":"IF(A4=\"\",\"\",IF(C4>D4,\"Aumento em\",\"Redução em\"))","v":"Aumento em"},{"$f":"IF(A4=\"\",\"\",IF(AND(LEFT(A4,5)=\"Ativo\",C4>D4),\"(-)\",IF(AND(LEFT(A4,5)=\"Ativo\",C4<D4),\"(+)\",IF(AND(LEFT(A4,7)=\"Passivo\",C4>D4),\"(+)\",IF(AND(LEFT(A4,7)=\"Passivo\",C4<D4),\"(-)\",\"-\")))))","v":"(+)"},{"$f":"IFERROR(IF(C4-D4>=0,C4-D4,(C4-D4)*-1),\"\")","v":171063646.44000173},null,"DESCRIÇÃO",null," 01.01.2022                          a                        31.03.2022"," 01.01.2021                          a                        31.03.2021"]
[{"$f":"IF(LEFT(#REF!,7)=\"Despesa\",\"\",IF(LEFT(#REF!,7)=\"Receita\",\"\",#REF!))","v":{"$error":"#REF!"}},{"$f":"IF(LEFT(A5,7)=\"Despesa\",\"\",IF(LEFT(A5,7)=\"Receita\",\"\",IF(A5=\"\",\"\",#REF!)))","v":{"$error":"#REF!"}},{"$f":"IFERROR(IFERROR(IFERROR(INDEX(BP!B:H,MATCH(B5,BP!C:C,0),6),INDEX(BP!B:H,MATCH(B5,BP!D:D,0),6)),INDEX(BP!B:H,MATCH(B5,BP!E:E,0),6)),\"\")","v":""},{"$f":"IFERROR(IFERROR(IFERROR(INDEX(BP!B:H,MATCH(B5,BP!C:C,0),7),INDEX(BP!B:H,MATCH(B5,BP!D:D,0),7)),INDEX(BP!B:H,MATCH(B5,BP!E:E,0),7)),\"\")","v":""},{"$f":"IF(A5=\"\",\"\",IF(C5>D5,\"Aumento em\",\"Redução em\"))","v":{"$error":"#REF!"}},{"$error":"#REF!"},{"$f":"IFERROR(IF(C5-D5>=0,C5-D5,(C5-D5)*-1),\"\")","v":""},null,"FLUXO DE CAIXA DAS ATIVIDADES OPERACIONAIS",null,null,"Reclassificação"]
[{"$f":"IF(LEFT(#REF!,7)=\"Despesa\",\"\",IF(LEFT(#REF!,7)=\"Receita\",\"\",#REF!))","v":{"$error":"#REF!"}},{"$f":"IF(LEFT(A6,7)=\"Despesa\",\"\",IF(LEFT(A6,7)=\"Receita\",\"\",IF(A6=\"\",\"\",#REF!)))","v":{"$error":"#REF!"}},{"$f":"IFERROR(IFERROR(IFERROR(INDEX(BP!B:H,MATCH(B6,BP!C:C,0),6),INDEX(BP!B:H,MATCH(B6,BP!D:D,0),6)),INDEX(BP!B:H,MATCH(B6,BP!E:E,0),6)),\"\")","v":""},0,{"$f":"IF(A6=\"\",\"\",IF(C6>D6,\"Aumento em\",\"Redução em\"))","v":{"$error":"#REF!"}},{"$error":"#REF!"},{"$f":"IF(F6=\"(-)\",IFERROR(IF(C6-D6>=0,C6-D6,(C6-D6)*-1),\"\")*-1,IFERROR(IF(C6-D6>=0,C6-D6,(C6-D6)*-1),\"\"))","v":{"$error":"#REF!"}},null,"Resultado do Exercício",null,-47043642.659999609,-64629808.390000001]
[{"$f":"IF(LEFT(#REF!,7)=\"Despesa\",\"\",IF(LEFT(#REF!,7)=\"Receita\",\"\",#REF!))","v":{"$error":"#REF!"}},{"$f":"IF(LEFT(A7,7)=\"Despesa\",\"\",IF(LEFT(A7,7)=\"Receita\",\"\",IF(A7=\"\",\"\",#REF!)))","v":{"$error":"#REF!"}},{"$f":"IFERROR(IFERROR(IFERROR(INDEX(BP!B:H,MATCH(B7,BP!C:C,0),6),INDEX(BP!B:H,MATCH(B7,BP!D:D,0),6)),INDEX(BP!B:H,MATCH(B7,BP!E:E,0),6)),\"\")","v":""},{"$f":"IFERROR(IFERROR(IFERROR(INDEX(BP!B:H,MATCH(B7,BP!C:C,0),7),INDEX(BP!B:H,MATCH(B7,BP!D:D,0),7)),INDEX(BP!B:H,MATCH(B7,BP!E:E,0),7)),\"\")","v":""},{"$f":"IF(A7=\"\",\"\",IF(C7>D7,\"Aumento em\",\"Redução em\"))","v":{"$error":"#REF!"}},{"$error":"#REF!"},{"$f":"IF(F7=\"(-)\",IFERROR(IF(C7-D7>=0,C7-D7,(C7-D7)*-1),\"\")*-1,IFERROR(IF(C7-D7>=0,C7-D7,(C7-D7)*-1),\"\"))","v":{"$error":"#REF!"}},null,"Ajustes de Exercícios Anteriores"]
[{"$f":"IF(LEFT(#REF!,7)=\"Despesa\",\"\",IF(LEFT(#REF!,7)=\"Receita\",\"\",#REF!))","v":{"$error":"#REF!"}},{"$f":"IF(LEFT(A8,7)=\"Despesa\",\"\",IF(LEFT(A8,7)=\"Receita\",\"\",IF(A8=\"\",\"\",#REF!)))","v":{"$error":"#REF!"}},{"$f":"IFERROR(IFERROR(IFERROR(INDEX(BP!B:H,MATCH(B8,BP!C:C,0),6),INDEX(BP!B:H,MATCH(B8,BP!D:D,0),6)),INDEX(BP!B:H,MATCH(B8,BP!E:E,0),6)),\"\")","v":""},{"$f":"IFERROR(IFERROR(IFERROR(INDEX(BP!B:H,MATCH(B8,BP!C:C,0),7),INDEX(BP!B:H,MATCH(B8,BP!D:D,0),7)),INDEX(BP!B:H,MATCH(B8,BP!E:E,0),7)),\"\")","v":""},{"$f":"IF(A8=\"\",\"\",IF(C8>D8,\"Aumento em\",\"Redução em\"))","v":{"$error":"#REF!"}},{"$f":"IF(A8=\"\",\"\",IF(AND(LEFT(A8,5)=\"Ativo\",C8>D8),\"(-)\",IF(AND(LEFT(A8,5)=\"Ativo\",C8<D8),\"(+)\",IF(AND(LEFT(A8,7)=\"Passivo\",C8>D8),\"(+)\",IF(AND(LEFT(A8,7)=\"Passivo\",C8<D8),\"(-)\",\"-\")))))","v":{"$error":"#REF!"}},{"$error":"#REF!"},null,"Depreciação e Amortização",null,13168613.319999991,9727638.8800000008]
[null,null,null,null,null,null,null,null,"Redução/Aumento em Direito de Uso (Contrato de Arrendamento)",null,21268863.953087762,-8322887.511737667]
[{"$f":"IF(LEFT(#REF!,7)=\"Despesa\",\"\",IF(LEFT(#REF!,7)=\"Receita\",\"\",#REF!))","v":{"$error":"#REF!"}},{"$f":"IF(LEFT(A10,7)=\"Despesa\",\"\",IF(LEFT(A10,7)=\"Receita\",\"\",IF(A10=\"\",\"\",#REF!)))","v":{"$error":"#REF!"}},{"$f":"IFERROR(IFERROR(IFERROR(INDEX(BP!B:H,MATCH(B10,BP!C:C,0),6),INDEX(BP!B:H,MATCH(B10,BP!D:D,0),6)),INDEX(BP!B:H,MATCH(B10,BP!E:E,0),6)),\"\")","v":""},{"$f":"IFERROR(IFERROR(IFERROR(INDEX(BP!B:H,MATCH(B10,BP!C:C,0),7),INDEX(BP!B:H,MATCH(B10,BP!D:D,0),7)),INDEX(BP!B:H,MATCH(B10,BP!E:E,0),7)),\"\")","v":""},{"$f":"IF(A10=\"\",\"\",IF(C10>D10,\"Aumento em\",\"Redução em\"))","v":{"$error":"#REF!"}},{"$f":"IF(A10=\"\",\"\",IF(AND(LEFT(A10,5)=\"Ativo\",C10>D10),\"(-)\",IF(AND(LEFT(A10,5)=\"Ativo\",C10<D10),\"(+)\",IF(AND(LEFT(A10,7)=\"Passivo\",C10>D10),\"(+)\",IF(AND(LEFT(A10,7)=\"Passivo\",C10<D10),\"(-)\",\"-\")))))","v":{"$error":"#REF!"}},{"$error":"#REF!"},null,"Redução a Valor Recup. De Intangível",null,-26087.410000000149,0]
[null,null,{"$f":"IFERROR(IFERROR(IFERROR(INDEX(BP!B:H,MATCH(B11,BP!C:C,0),6),INDEX(BP!B:H,MATCH(B11,BP!D:D,0),6)),INDEX(BP!B:H,MATCH(B11,BP!E:E,0),6)),\"\")","v":""},{"$f":"IFERROR(IFERROR(IFERROR(INDEX(BP!B:H,MATCH(B11,BP!C:C,0),7),INDEX(BP!B:H,MATCH(B11,BP!D:D,0),7)),INDEX(BP!B:H,MATCH(B11,BP!E:E,0),7)),\"\")","v":""},null,null,"",null,"Redução a Valor Recup. De Imobilizado",null,0,0]
[{"$f":"IF(LEFT(#REF!,7)=\"Despesa\",\"\",IF(LEFT(#REF!,7)=\"Receita\",\"\",#REF!))","v":{"$error":"#REF!"}},{"$f":"IF(LEFT(A12,7)=\"Despesa\",\"\",IF(LEFT(A12,7)=\"Receita\",\"\",IF(A12=\"\",\"\",#REF!)))","v":{"$error":"#REF!"}},{"$f":"IFERROR(IFERROR(IFERROR(INDEX(BP!B:H,MATCH(B12,BP!C:C,0),6),INDEX(BP!B:H,MATCH(B12,BP!D:D,0),6)),INDEX(BP!B:H,MATCH(B12,BP!E:E,0),6)),\"\")","v":""},{"$f":"IFERROR(IFERROR(IFERROR(INDEX(BP!B:H,MATCH(B12,BP!C:C,0),7),INDEX(BP!B:H,MATCH(B12,BP!D:D,0),7)),INDEX(BP!B:H,MATCH(B12,BP!E:E,0),7)),\"\")","v":""},{"$f":"IF(A12=\"\",\"\",IF(C12>D12,\"Aumento em\",\"Redução em\"))","v":{"$error":"#REF!"}},{"$f":"IF(A12=\"\",\"\",IF(AND(LEFT(A12,5)=\"Ativo\",C12>D12),\"(-)\",IF(AND(LEFT(A12,5)=\"Ativo\",C12<D12),\"(+)\",IF(AND(LEFT(A12,7)=\"Passivo\",C12>D12),\"(+)\",IF(AND(LEFT(A12,7)=\"Passivo\",C12<D12),\"(-)\",\"-\")))))","v":{"$error":"#REF!"}},{"$error":"#REF!"},null,"Redução","Ajustes de Avaliação Patrimonial de Ativos"]
[{"$f":"IF(LEFT(#REF!,7)=\"Despesa\",\"\",IF(LEFT(#REF!,7)=\"Receita\",\"\",#REF!))","v":{"$error":"#REF!"}},{"$f":"IF(LEFT(A13,7)=\"Despesa\",\"\",IF(LEFT(A13,7)=\"Receita\",\"\",IF(A13=\"\",\"\",#REF!)))","v":{"$error":"#REF!"}},{"$f":"IFERROR(IFERROR(IFERROR(INDEX(BP!B:H,MATCH(B13,BP!C:C,0),6),INDEX(BP!B:H,MATCH(B13,BP!D:D,0),6)),INDEX(BP!B:H,MATCH(B13,BP!E:E,0),6)),\"\")","v":""},{"$f":"IFERROR(IFERROR(IFERROR(INDEX(BP!B:H,MATCH(B13,BP!C:C,0),7),INDEX(BP!B:H,MATCH(B13,BP!D:D,0),7)),INDEX(BP!B:H,MATCH(B13,BP!E:E,0),7)),\"\")","v":""},{"$f":"IF(A13=\"\",\"\",IF(C13>D13,\"Aumento em\",\"Redução em\"))","v":{"$error":"#REF!"}},{"$f":"IF(A13=\"\",\"\",IF(AND(LEFT(A13,5)=\"Ativo\",C13>D13),\"(-)\",IF(AND(LEFT(A13,5)=\"Ativo\",C13<D13),\"(+)\",IF(AND(LEFT(A13,7)=\"Passivo\",C13>D13),\"(+)\",IF(AND(LEFT(A13,7)=\"Passivo\",C13<D13),\"(-)\",\"-\")))))","v":{"$error":"#REF!"}},{"$error":"#REF!"},null,"Redução",null,null,0]
[null,null,{"$f":"IFERROR(IFERROR(IFERROR(INDEX(BP!B:H,MATCH(B14,BP!C:C,0),6),INDEX(BP!B:H,MATCH(B14,BP!D:D,0),6)),INDEX(BP!B:H,MATCH(B14,BP!E:E,0),6)),\"\")","v":""},{"$f":"IFERROR(IFERROR(IFERROR(INDEX(BP!B:H,MATCH(B14,BP!C:C,0),7),INDEX(BP!B:H,MATCH(B14,BP!D:D,0),7)),INDEX(BP!B:H,MATCH(B14,BP!E:E,0),7)),\"\")","v":""},null,null,"",null,"Redução"]
[{"$f":"IF(LEFT(#REF!,7)=\"Despesa\",\"\",IF(LEFT(#REF!,7)=\"Receita\",\"\",#REF!))","v":{"$error":"#REF!"}},{"$f":"IF(LEFT(A15,7)=\"Despesa\",\"\",IF(LEFT(A15,7)=\"Receita\",\"\",IF(A15=\"\",\"\",#REF!)))","v":{"$error":"#REF!"}},{"$f":"IFERROR(IFERROR(IFERROR(INDEX(BP!B:H,MATCH(B15,BP!C:C,0),6),INDEX(BP!B:H,MATCH(B15,BP!D:D,0),6)),INDEX(BP!B:H,MATCH(B15,BP!E:E,0),6)),\"\")","v":""},{"$f":"IFERROR(IFERROR(IFERROR(INDEX(BP!B:H,MATCH(B15,BP!C:C,0),7),INDEX(BP!B:H,MATCH(B15,BP!D:D,0),7)),INDEX(BP!B:H,MATCH(B15,BP!E:E,0),7)),\"\")","v":""},{"$f":"IF(A15=\"\",\"\",IF(C15>D15,\"Aumento em\",\"Redução em\"))","v":{"$error":"#REF!"}},{"$f":"IF(A15=\"\",\"\",IF(AND(LEFT(A15,5)=\"Ativo\",C15>D15),\"(-)\",IF(AND(LEFT(A15,5)=\"Ativo\",C15<D15),\"(+)\",IF(AND(LEFT(A15,7)=\"Passivo\",C15>D15),\"(+)\",IF(AND(LEFT(A15,7)=\"Passivo\",C15<D15),\"(-)\",\"-\")))))","v":{"$error":"#REF!"}},{"$error":"#REF!"},null,"Resultado do Exercício Ajustado",null,-12632252.796911854,-63225057.021737665]
[{"$f":"IF(LEFT(#REF!,7)=\"Despesa\",\"\",IF(LEFT(#REF!,7)=\"Receita\",\"\",#REF!))","v":{"$error":"#REF!"}},{"$f":"IF(LEFT(A16,7)=\"Despesa\",\"\",IF(LEFT(A16,7)=\"Receita\",\"\",IF(A16=\"\",\"\",#REF!)))","v":{"$error":"#REF!"}},{"$f":"IFERROR(IFERROR(IFERROR(INDEX(BP!B:H,MATCH(B16,BP!C:C,0),6),INDEX(BP!B:H,MATCH(B16,BP!D:D,0),6)),INDEX(BP!B:H,MATCH(B16,BP!E:E,0),6)),\"\")","v":""},{"$f":"IFERROR(IFERROR(IFERROR(INDEX(BP!B:H,MATCH(B16,BP!C:C,0),7),INDEX(BP!B:H,MATCH(B16,BP!D:D,0),7)),INDEX(BP!B:H,MATCH(B16,BP!E:E,0),7)),\"\")","v":""},{"$error":"#REF!"},{"$error":"#REF!"},{"$error":"#REF!"},null,"Variações Patrimoniais",null,16791149.13691197,75123846.840000063]
[{"$f":"IF(LEFT(#REF!,7)=\"Despesa\",\"\",IF(LEFT(#REF!,7)=\"Receita\",\"\",#REF!))","v":{"$error":"#REF!"}},{"$f":"IF(LEFT(A17,7)=\"Despesa\",\"\",IF(LEFT(A17,7)=\"Receita\",\"\",IF(A17=\"\",\"\",#REF!)))","v":{"$error":"#REF!"}},{"$f":"IFERROR(IFERROR(IFERROR(INDEX(BP!B:H,MATCH(B17,BP!C:C,0),6),INDEX(BP!B:H,MATCH(B17,BP!D:D,0),6)),INDEX(BP!B:H,MATCH(B17,BP!E:E,0),6)),\"\")","v":""},{"$f":"IFERROR(IFERROR(IFERROR(INDEX(BP!B:H,MATCH(B17,BP!C:C,0),7),INDEX(BP!B:H,MATCH(B17,BP!D:D,0),7)),INDEX(BP!B:H,MATCH(B17,BP!E:E,0),7)),\"\")","v":""},{"$error":"#REF!"},{"$error":"#REF!"},{"$error":"#REF!"},null,"Aumento em","Subvenção de Custeio SUS a Receber",-1266302967.9100001,-1315736075.24]
[{"$f":"IF(LEFT(#REF!,7)=\"Despesa\",\"\",IF(LEFT(#REF!,7)=\"Receita\",\"\",#REF!))","v":{"$error":"#REF!"}},{"$f":"IF(LEFT(A18,7)=\"Despesa\",\"\",IF(LEFT(A18,7)=\"Receita\",\"\",IF(A18=\"\",\"\",#REF!)))","v":{"$error":"#REF!"}},{"$f":"IFERROR(IFERROR(IFERROR(INDEX(BP!B:H,MATCH(B18,BP!C:C,0),6),INDEX(BP!B:H,MATCH(B18,BP!D:D,0),6)),INDEX(BP!B:H,MATCH(B18,BP!E:E,0),6)),\"\")","v":""},{"$f":"IFERROR(IFERROR(IFERROR(INDEX(BP!B:H,MATCH(B18,BP!C:C,0),7),INDEX(BP!B:H,MATCH(B18,BP!D:D,0),7)),INDEX(BP!B:H,MATCH(B18,BP!E:E,0),7)),\"\")","v":""},{"$error":"#REF!"},{"$error":"#REF!"},{"$f":"IF(F18=\"(-)\",IFERROR(IF(C18-D18>=0,C18-D18,(C18-D18)*-1),\"\")*-1,IFERROR(IF(C18-D18>=0,C18-D18,(C18-D18)*-1),\"\"))","v":{"$error":"#REF!"}},null,"Redução em","Valores a Curto Prazo - SUS",1059327.2200000002,20015561.02]
[{"$f":"IF(LEFT(#REF!,7)=\"Despesa\",\"\",IF(LEFT(#REF!,7)=\"Receita\",\"\",#REF!))","v":{"$error":"#REF!"}},{"$f":"IF(LEFT(A19,7)=\"Despesa\",\"\",IF(LEFT(A19,7)=\"Receita\",\"\",IF(A19=\"\",\"\",#REF!)))","v":{"$error":"#REF!"}},{"$f":"IFERROR(IFERROR(IFERROR(INDEX(BP!B:H,MATCH(B19,BP!C:C,0),6),INDEX(BP!B:H,MATCH(B19,BP!D:D,0),6)),INDEX(BP!B:H,MATCH(B19,BP!E:E,0),6)),\"\")","v":""},{"$f":"IFERROR(IFERROR(IFERROR(INDEX(BP!B:H,MATCH(B19,BP!C:C,0),7),INDEX(BP!B:H,MATCH(B19,BP!D:D,0),7)),INDEX(BP!B:H,MATCH(B19,BP!E:E,0),7)),\"\")","v":""},{"$error":"#REF!"},{"$error":"#REF!"},{"$f":"IF(F19=\"(-)\",IFERROR(IF(C19-D19>=0,C19-D19,(C19-D19)*-1),\"\")*-1,IFERROR(IF(C19-D19>=0,C19-D19,(C19-D19)*-1),\"\"))","v":{"$error":"#REF!"}},null,"Aumento em","Adiantamentos e Créditos a Receber",-21826793.139999993,4888620.49]
[{"$f":"IF(LEFT(#REF!,7)=\"Despesa\",\"\",IF(LEFT(#REF!,7)=\"Receita\",\"\",#REF!))","v":{"$error":"#REF!"}},{"$f":"IF(LEFT(A20,7)=\"Despesa\",\"\",IF(LEFT(A20,7)=\"Receita\",\"\",IF(A20=\"\",\"\",#REF!)))","v":{"$error":"#REF!"}},{"$f":"IFERROR(IFERROR(IFERROR(INDEX(BP!B:H,MATCH(B20,BP!C:C,0),6),INDEX(BP!B:H,MATCH(B20,BP!D:D,0),6)),INDEX(BP!B:H,MATCH(B20,BP!E:E,0),6)),\"\")","v":""},{"$f":"IFERROR(IFERROR(IFERROR(INDEX(BP!B:H,MATCH(B20,BP!C:C,0),7),INDEX(BP!B:H,MATCH(B20,BP!D:D,0),7)),INDEX(BP!B:H,MATCH(B20,BP!E:E,0),7)),\"\")","v":""},{"$error":"#REF!"},{"$error":"#REF!"},{"$error":"#REF!"},null,"Redução em","Estoques",22699517.850000024,-7620630.25]
{"$rows_left_out":36}
{"sheet":"DVA","index":3,"n_rows":38,"n_cols":6,"rows_kept":38,"cut":false,"hidden":false,"merged":[[0,1,0,3],[1,2,1,3]]}
[null,"EBSERH - EMPRESA BRASILEIRA DE SERVIÇOS HOSPITALARES"]
[null,"Demonstração Intermediária do Valor Adicionado ","31 de março de 2022"]
[null,"Em reais "]
[null,"Descrição"," 01.01.2022                          a                        31.03.2022"," 01.01.2021                          a                        31.03.2021"]
[null,"Geração de Valor Adicionado"]
[null,"1 - Receitas",27401010.899999999,34024361.840000004]
[null,"1.1 - Atividades Operacionais",27401010.899999999,34024361.840000004]
[null,"1.1.1 - Receita de Serviços e Exploração",27401010.899999999,34024361.840000004]
[null,"2 - Insumos Adquiridos de Terceiros",614551077.1400001,546296898.84000003]
[null,"2.1 - Materiais de Consumo",273770891.33999997,258511732.80999997]
[null,"2.2 - Energia elétrica, Água e Esgoto, Gás",36455031.769999996,27552192.84]
[null,"2.3 - Serviços de Terceiros",304325154.03000009,260232973.19000006]
[null,"2.4 - Contigências para Riscos Cíveis",0,0]
[null,"3 - Valor Adicionado Bruto (1-2)",-587150066.24000013,-512272537]
[null,"4 - Depreciação, Amortização, Impairment e Perdas",16178590.98,10021347.469999999]
[null,"4.1 - Depreciação do Período",11804335.92,8209137.8499999996]
[null,"4.2 - Amortização do Período",1469566.6600000001,1504428.9300000002]
[null,"4.3 - Redução a Valor Recuperável - Impairment",4769.43,0]
[null,"4.4 - Perdas Involuntárias e Desfazimentos",2899918.97,307780.69]
[null,"5 - Valor Adicionado Líquido (3-4)",-603328657.22000015,-522293884.47000003]
{"$rows_left_out":19}
{"sheet":"DMPL","index":4,"n_rows":37,"n_cols":7,"rows_kept":37,"cut":false,"hidden":false,"merged":[[26,4,27,4],[0,1,0,6],[1,5,1,6],[3,1,4,1],[3,2,4,2],[3,3,4,3],[3,4,4,4],[3,5,4,5],[3,6,4,6],[13,5,13,6],[12,1,12,6],[26,1,27,1],[26,2,27,2],[26,3,27,3],[26,5,27,5],[26,6,27,6],[25,1,25,6],[15,1,16,1],[15,2,16,2],[15,3,16,3],[15,5,16,5],[15,6,16,6],[15,4,16,4]]}
[null,"EBSERH - EMPRESA BRASILEIRA DE SERVIÇOS HOSPITALARES"]
[null,"Demonstração Intermediária das Mutações do Patrimônio Líquido ",null,null,null,"31 de março de 2022"]
[null,"Em reais"]
[null,"Componentes ","Capital Social ","Reservas de Capital - AFAC"," Ajuste de Avaliação Patrimonial","Prejuízos  Acumulados","Patrimônio Líquido "]
[]
[null,"Saldos Iniciais (31/12/2020)",381384237.75,202658776.91,null,-529544354.01999998,54498660.639999986]
[null,"Resultado do Período",null,null,null,-218107289.09999999,-218107289.09999999]
[null,"Adiantamento Fut Aume Cap - AFAC",null,112365624.37,null,null,112365624.37]
[null,"Integralização de AFAC ao Capital Social",181119026.97,-181119026.97,null,null,0]
[null,"Ajustes de Avaliação Patrimonial de Ativos",null,null,null,null,0]
[null,"Saldos Finais em 31/12/2021",562503264.72000003,133905374.30999997,null,-747651643.12,-51243004.090000033]
[]
[null,"EBSERH - EMPRESA BRASILEIRA DE SERVIÇOS HOSPITALARES"]
[null,"Demonstração Intermediária das Mutações do Patrimônio Líquido "]
[null,"Em reais"]
[null,"Componentes ","Capital Social ","Reservas de Capital - AFAC"," Ajuste de Avaliação Patrimonial","Prejuízos  Acumulados","Patrimônio Líquido "]
[]
[null,"Saldos Finais em 31/12/2021",562503264.72000003,133905374.30999997,0,-747651643.12,-51243004.090000033]
[null,"Resultado do Período",null,null,null,-64629808.390001059,-64629808.390001059]
[null,"Adiantamento Fut Aume Cap - AFAC",null,37944058.590000004,null,null,37944058.590000004]
{"$rows_left_out":18}
{"sheet":"DRA","index":5,"n_rows":9,"n_cols":3,"rows_kept":9,"cut":false,"hidden":false,"merged":[[0,0,0,2],[1,1,1,2]]}
["EBSERH - EMPRESA BRASILEIRA DE SERVIÇOS HOSPITALARES"]
["Demonstrações Intermediárias do Resultado Abrangente","31 de Março de 2022"]
["Em reais "]
["Descrição"," 01.01.2022                          a                        31.03.2022"," 01.01.2021                          a                        31.03.2021"]
["1 Resultado do Exercício",-47043642.659999609,-64629808.390001059]
["2 Outros Resultados Abrangentes",15773.48,0]
["2.1 -Ajuste de Avaliação Patrimonial",15773.48,0]
["3 Resultado Abrangente do Período",-47027869.179999612,-64629808.390001059]
["As notas explicativas da Administração são parte integrante das demonstrações contábeis consolidadas."]

{"sheet":"--","index":6,"n_rows":192,"n_cols":4,"rows_kept":192,"cut":false,"hidden":true,"merged":[]}
["1 - Receitas",null,"Grupo Dva","Subgrupo DVA"]
["1.1 - Atividades operacionais",null,"1.1 - Atividades operacionais","1.1 - Atividades operacionais"]
["Relatório Financeiro PF",null,"Relatório Financeiro PF","Relatório Financeiro PF"]
["2 - Insumos Adquiridos de Terceiros",null,"2 - Insumos Adquiridos de Terceiros","2 - Insumos Adquiridos de Terceiros"]
["2.1 - Materiais de Consumo",null,"2 - Insumos Adquiridos de Terceiros","2.1 - Materiais de Consumo"]
["3.3.1.1.1.01.00",{"$f":"VLOOKUP(A6,#REF!,2,0)","v":{"$error":"#REF!"}},"2 - Insumos Adquiridos de Terceiros","2.1 - Materiais de Consumo"]
["3.3.1.1.1.02.00",{"$f":"VLOOKUP(A7,#REF!,2,0)","v":{"$error":"#REF!"}},"2 - Insumos Adquiridos de Terceiros","2.1 - Materiais de Consumo"]
["3.3.1.1.1.03.00",{"$f":"VLOOKUP(A8,#REF!,2,0)","v":{"$error":"#REF!"}},"2 - Insumos Adquiridos de Terceiros","2.1 - Materiais de Consumo"]
["3.3.1.1.1.04.00",{"$f":"VLOOKUP(A9,#REF!,2,0)","v":{"$error":"#REF!"}},"2 - Insumos Adquiridos de Terceiros","2.1 - Materiais de Consumo"]
["3.3.1.1.1.05.00",{"$f":"VLOOKUP(A10,#REF!,2,0)","v":{"$error":"#REF!"}},"2 - Insumos Adquiridos de Terceiros","2.1 - Materiais de Consumo"]
["3.3.1.1.1.06.00",{"$f":"VLOOKUP(A11,#REF!,2,0)","v":{"$error":"#REF!"}},"2 - Insumos Adquiridos de Terceiros","2.1 - Materiais de Consumo"]
["3.3.1.1.1.07.00",{"$f":"VLOOKUP(A12,#REF!,2,0)","v":{"$error":"#REF!"}},"2 - Insumos Adquiridos de Terceiros","2.1 - Materiais de Consumo"]
["3.3.1.1.1.08.00",{"$f":"VLOOKUP(A13,#REF!,2,0)","v":{"$error":"#REF!"}},"2 - Insumos Adquiridos de Terceiros","2.1 - Materiais de Consumo"]
["3.3.1.1.1.09.00",{"$f":"VLOOKUP(A14,#REF!,2,0)","v":{"$error":"#REF!"}},"2 - Insumos Adquiridos de Terceiros","2.1 - Materiais de Consumo"]
["3.3.1.1.1.99.00",{"$f":"VLOOKUP(A15,#REF!,2,0)","v":{"$error":"#REF!"}},"2 - Insumos Adquiridos de Terceiros","2.1 - Materiais de Consumo"]
["3.6.3.3.1.01.00",{"$f":"VLOOKUP(A16,#REF!,2,0)","v":{"$error":"#REF!"}},"2 - Insumos Adquiridos de Terceiros","2.1 - Materiais de Consumo"]
["2.2 - Energia elétrica, Água e Esgoto, Gás",null,"2 - Insumos Adquiridos de Terceiros","2.2 - Energia elétrica, Água e Esgoto, Gás"]
["3.3.2.3.2.08.00",{"$f":"VLOOKUP(A18,#REF!,2,0)","v":{"$error":"#REF!"}},"2 - Insumos Adquiridos de Terceiros","2.2 - Energia elétrica, Água e Esgoto, Gás"]
["3.3.2.3.4.08.00",{"$f":"VLOOKUP(A19,#REF!,2,0)","v":{"$error":"#REF!"}},"2 - Insumos Adquiridos de Terceiros","2.2 - Energia elétrica, Água e Esgoto, Gás"]
["3.3.2.3.1.08.00",{"$f":"VLOOKUP(A20,#REF!,2,0)","v":{"$error":"#REF!"}},"2 - Insumos Adquiridos de Terceiros","2.2 - Energia elétrica, Água e Esgoto, Gás"]
{"$rows_left_out":172}