{"text_format":"1","workbook":"xlsx","n_sheets":8,"sheets":["BP","DR","DFC","DVA","DMPL","DRA","Cálculo de RI","--"],"not_rendered":{"charts":0,"images":0,"macros":1,"external_links":0,"defined_names":2,"comments":0,"pivot_tables":0},"unopened":[],"bounds":{"document_bytes":16777216,"sheet_cells":100000,"rows_first":2000,"rows_last":500,"rows_between":2000,"halvings":0,"cell_chars":16384,"cell_head_chars":4096},"cells_cut":0,"cells_raw":0,"read":"whole","date_system":"1900"}

{"sheet":"BP","index":0,"n_rows":57,"n_cols":8,"rows_kept":57,"cut":false,"hidden":false,"merged":[[0,1,0,7],[3,1,3,4],[1,6,1,7],[30,6,30,7]]}
[null,"EBSERH - EMPRESA BRASILEIRA DE SERVIÇOS HOSPITALARES"]
[null,"Balanço Patrimonial Consolidado ",null,null,null,null,"30 de junho de 2022"]
[null,"Em reais"]
[null,"ATIVO ",null,null,null,"NOTA","30.06.2022","31.12.2021"]
[null,"CIRCULANTE",null,null,null,"1.1",2418207585.3599768,1347106009.1400001]
[null,null,"Caixa e Equivalentes de Caixa",null,null,"1.1.1",1025722078.03,885657238.94000006]
[null,null,"Valores a Curto Prazo - SUS",null,null,"1.1.2",1525945.23,4759346.75]
[null,null,"Subvenção de Custeio SUS a Receber",null,null,"1.1.3",834598150.47000003,0]
[null,null,"Adiantamentos e Créditos a Receber",null,null,"1.1.4",182055822.48997667,41885310.209999993]
[null,null,"Estoques",null,null,"1.1.5",374305589.13999999,414804113.24000001]
[null,null,"Valores em Liquidação",null,null,null,0,0]
[null,"NÃO CIRCULANTE",null,null,null,"1.2",759600387.02931237,703760365.91991401]
[null,null,"Valores a Longo Prazo - SUS",null,null,"1.2.1",9247709.8800000008,9148070.5899999999]
[null,null,"Depósitos Judiciais",null,null,"1.2.2",15866925.100000001,20014167.16]
[null,null,"Outras Despesas Antecipadas",null,null,"1.2.2","Fora do Siafi","Fora do Siafi"]
{"$rows_left_out":43}
{"sheet":"DR","index":1,"n_rows":51,"n_cols":18,"rows_kept":51,"cut":false,"hidden":false,"merged":[[3,1,3,3],[0,1,0,10],[30,1,30,3],[16,2,16,3],[19,2,19,3],[7,1,7,3],[22,2,22,3],[24,2,24,3],[8,2,8,3],[13,2,13,3],[1,7,1,10],[38,1,38,10],[25,1,25,3],[26,1,26,3],[29,1,29,3],[33,1,33,3],[35,1,35,3],[37,1,37,3]]}
[null,"EBSERH - EMPRESA BRASILEIRA DE SERVIÇOS HOSPITALARES"]
[null,"Demonstração do Resultado",null,null,null,null,null,"30 de junho de 2022"]
[null,"Em reais"]
[null,"DESCRIÇÃO",null,null,"Nota"," 01.01.2022                          a                        31.03.2022","  01.04.2022                          a                 30.06.2022"," 01.01.2022                          a                        30.06.2022","  01.01.2021                          a                 31.03.2021","  01.04.2021                          a                 30.06.2021"," 01.01.2021                          a                        30.06.2021"]
[null,"Receita Bruta",null,null,"3.1",27401010.899999999,24288633.700000003,51689644.600000001,34024361.840000004,29536473.239999995,63560835.079999998]
[null,null,"Receita com Serviços",null,null,27401010.899999999,24288633.700000003,51689644.600000001,34024361.840000004,29536473.239999995,63560835.079999998]
[null,null,null,"Receita de Serviços e Exploração","3.1.1",27401010.899999999,24288633.700000003,51689644.600000001,34024361.840000004,29536473.239999995,63560835.079999998]
[null,"Despesas Operacionais",null,null,"3.3",-2034227855.96,-2297515585.4300232,-4331743441.3900232,-1962363355.9200001,-2155842009.8899994,-4118205365.8099995]
[null,null,"Despesa com Pessoal, Encargos e Benefícios",null,"3.3.1",-1414495284.27,-1577836052.3900237,-2992331336.6600237,-1396877837.5699999,-1514207525.6000001,-2911085363.1700001]
[null,null,null,"Remuneração a Pessoal","3.3.2",-958107238.80999994,-1044929363.1300235,-2003036601.9400234,-1001744707.89,-1085056526.1700001,-2086801234.0600002]
[null,null,null,"Encargos Patronais","3.3.3",-333656271.53999996,-430950852.61000001,-764607124.14999998,-310158462.35999995,-338418361.90000004,-648576824.25999999]
[null,null,null,"Benefícios a Pessoal","3.3.4",-83738049.229999989,-82498530.820000023,-166236580.05000001,-81110249.299999997,-84881661.719999984,-165991911.01999998]
[null,null,null,"Outras Despesas com Pessoal e Encargos","3.3.5",-38993724.689999998,-19457305.829999998,-58451030.519999996,-3864418.02,-5850975.8100000005,-9715393.8300000001]
[null,null,"Despesa com Uso de Bens e Serviços",null,null,-602638490.38000011,-665692674.0599997,-1268331164.4399998,-554372495.71999991,-627939949.79999983,-1182312445.5199997]
[null,null,null,"Uso de Material de Consumo","3.3.6",-273770891.33999997,-294288206.54000002,-568059097.88,-258511732.80999997,-307234573.14999998,-565746305.95999992]
{"$rows_left_out":37}
{"sheet":"DFC","index":2,"n_rows":55,"n_cols":12,"rows_kept":55,"cut":false,"hidden":false,"merged":[[0,0,0,6],[1,10,1,11],[5,8,5,9],[0,8,0,11]]}
["Organizador de DFC",null,null,null,null,null,null,null,"EBSERH - EMPRESA BRASILEIRA DE SERVIÇOS HOSPITALARES"]
["Grupo","Conta Contábil","Valor Fechamento","Valor anterior","Análise","Regra","Δ Variação",null,"Demonstração do Fluxo de Caixa - Método Indireto",null,"30 de junho de 2022"]
[null,null,null,null,null,null,null,null,"Em reais"]
["Passivo-C","Resultado do Exercício",{"$f":"IFERROR(IFERROR(IFERROR(INDEX(BP!B:H,MATCH(B4,BP!C:C,0),6),INDEX(BP!B:H,MATCH(B4,BP!D:D,0),6)),INDEX(BP!B:H,MATCH(B4,BP!E:E,0),6)),\"\")","v":-130458095.46002293},{"$f":"IFERROR(IFERROR(IFERROR(INDEX(BP!B:H,MATCH(B4,BP!C:C,0),7),INDEX(BP!B:H,MATCH(B4,BP!D:D,0),7)),INDEX(BP!B:H,MATCH(B4,BP!E:E,0),7)),\"\")","v":-218107289.10000134},{"$f":"IF(A4=\"\",\"\",IF(C4>D4,\"Aumento em\",\"Redução em\"))","v":"Aumento em"},{"$f":"IF(A4=\"\",\"\",IF(AND(LEFT(A4,5)=\"Ativo\",C4>D4),\"(-)\",IF(AND(LEFT(A4,5)=\"Ativo\",C4<D4),\"(+)\",IF(AND(LEFT(A4,7)=\"Passivo\",C4>D4),\"(+)\",IF(AND(LEFT(A4,7)=\"Passivo\",C4<D4),\"(-)\",\"-\")))))","v":"(+)"},{"$f":"IFERROR(IF(C4-D4>=0,C4-D4,(C4-D4)*-1),\"\")","v":87649193.639978409},null,"DESCRIÇÃO",null," 01.01.2022                          a                        30.06.2022"," 01.01.2021                          a                        30.06.2021"]
[{"$f":"IF(LEFT(#REF!,7)=\"Despesa\",\"\",IF(LEFT(#REF!,7)=\"Receita\",\"\",#REF!))","v":{"$error":"#REF!"}},{"$f":"IF(LEFT(A5,7)=\"Despesa\",\"\",IF(LEFT(A5,7)=\"Receita\",\"\",IF(A5=\"\",\"\",#REF!)))","v":{"$error":"#REF!"}},{"$f":"IFERROR(IFERROR(IFERROR(INDEX(BP!B:H,MATCH(B5,BP!C:C,0),6),INDEX(BP!B:H,MATCH(B5,BP!D:D,0),6)),INDEX(BP!B:H,MATCH(B5,BP!E:E,0),6)),\"\")","v":""},{"$f":"IFERROR(IFERROR(IFERROR(INDEX(BP!B:H,MATCH(B5,BP!C:C,0),7),INDEX(BP!B:H,MATCH(B5,BP!D:D,0),7)),INDEX(BP!B:H,MATCH(B5,BP!E:E,0),7)),\"\")","v":""},{"$f":"IF(A5=\"\",\"\",IF(C5>D5,\"Aumento em\",\"Redução em\"))","v":{"$error":"#REF!"}},{"$error":"#REF!"},{"$f":"IFERROR(IF(C5-D5>=0,C5-D5,(C5-D5)*-1),\"\")","v":""},null,"FLUXO DE CAIXA DAS ATIVIDADES OPERACIONAIS",null,null,"Reclassificação"]
[{"$f":"IF(LEFT(#REF!,7)=\"Despesa\",\"\",IF(LEFT(#REF!,7)=\"Receita\",\"\",#REF!))","v":{"$error":"#REF!"}},{"$f":"IF(LEFT(A6,7)=\"Despesa\",\"\",IF(LEFT(A6,7)=\"Receita\",\"\",IF(A6=\"\",\"\",#REF!)))","v":{"$error":"#REF!"}},{"$f":"IFERROR(IFERROR(IFERROR(INDEX(BP!B:H,MATCH(B6,BP!C:C,0),6),INDEX(BP!B:H,MATCH(B6,BP!D:D,0),6)),INDEX(BP!B:H,MATCH(B6,BP!E:E,0),6)),\"\")","v":""},0,{"$f":"IF(A6=\"\",\"\",IF(C6>D6,\"Aumento em\",\"Redução em\"))","v":{"$error":"#REF!"}},{"$error":"#REF!"},{"$f":"IF(F6=\"(-)\",IFERROR(IF(C6-D6>=0,C6-D6,(C6-D6)*-1),\"\")*-1,IFERROR(IF(C6-D6>=0,C6-D6,(C6-D6)*-1),\"\"))","v":{"$error":"#REF!"}},null,"Resultado do Exercício",null,-130458095.46002293,-77191010.199999809]
[{"$f":"IF(LEFT(#REF!,7)=\"Despesa\",\"\",IF(LEFT(#REF!,7)=\"Receita\",\"\",#REF!))","v":{"$error":"#REF!"}},{"$f":"IF(LEFT(A7,7)=\"Despesa\",\"\",IF(LEFT(A7,7)=\"Receita\",\"\",IF(A7=\"\",\"\",#REF!)))","v":{"$error":"#REF!"}},{"$f":"IFERROR(IFERROR(IFERROR(INDEX(BP!B:H,MATCH(B7,BP!C:C,0),6),INDEX(BP!B:H,MATCH(B7,BP!D:D,0),6)),INDEX(BP!B:H,MATCH(B7,BP!E:E,0),6)),\"\")","v":""},{"$f":"IFERROR(IFERROR(IFERROR(INDEX(BP!B:H,MATCH(B7,BP!C:C,0),7),INDEX(BP!B:H,MATCH(B7,BP!D:D,0),7)),INDEX(BP!B:H,MATCH(B7,BP!E:E,0),7)),\"\")","v":""},{"$f":"IF(A7=\"\",\"\",IF(C7>D7,\"Aumento em\",\"Redução em\"))","v":{"$error":"#REF!"}},{"$error":"#REF!"},{"$f":"IF(F7=\"(-)\",IFERROR(IF(C7-D7>=0,C7-D7,(C7-D7)*-1),\"\")*-1,IFERROR(IF(C7-D7>=0,C7-D7,(C7-D7)*-1),\"\"))","v":{"$error":"#REF!"}},null,"Depreciação e Amortização",null,26398634.019999996,19845778.50999999]
[{"$f":"IF(LEFT(#REF!,7)=\"Despesa\",\"\",IF(LEFT(#REF!,7)=\"Receita\",\"\",#REF!))","v":{"$error":"#REF!"}},{"$f":"IF(LEFT(A8,7)=\"Despesa\",\"\",IF(LEFT(A8,7)=\"Receita\",\"\",IF(A8=\"\",\"\",#REF!)))","v":{"$error":"#REF!"}},{"$f":"IFERROR(IFERROR(IFERROR(INDEX(BP!B:H,MATCH(B8,BP!C:C,0),6),INDEX(BP!B:H,MATCH(B8,BP!D:D,0),6)),INDEX(BP!B:H,MATCH(B8,BP!E:E,0),6)),\"\")","v":""},{"$f":"IFERROR(IFERROR(IFERROR(INDEX(BP!B:H,MATCH(B8,BP!C:C,0),7),INDEX(BP!B:H,MATCH(B8,BP!D:D,0),7)),INDEX(BP!B:H,MATCH(B8,BP!E:E,0),7)),\"\")","v":""},{"$f":"IF(A8=\"\",\"\",IF(C8>D8,\"Aumento em\",\"Redução em\"))","v":{"$error":"#REF!"}},{"$f":"IF(A8=\"\",\"\",IF(AND(LEFT(A8,5)=\"Ativo\",C8>D8),\"(-)\",IF(AND(LEFT(A8,5)=\"Ativo\",C8<D8),\"(+)\",IF(AND(LEFT(A8,7)=\"Passivo\",C8>D8),\"(+)\",IF(AND(LEFT(A8,7)=\"Passivo\",C8<D8),\"(-)\",\"-\")))))","v":{"$error":"#REF!"}},{"$error":"#REF!"},null,"Redução a Valor Recup. De Intangível",null,-26087.410000000149,0]
[{"$f":"IF(LEFT(#REF!,7)=\"Despesa\",\"\",IF(LEFT(#REF!,7)=\"Receita\",\"\",#REF!))","v":{"$error":"#REF!"}},{"$f":"IF(LEFT(A9,7)=\"Despesa\",\"\",IF(LEFT(A9,7)=\"Receita\",\"\",IF(A9=\"\",\"\",#REF!)))","v":{"$error":"#REF!"}},{"$f":"IFERROR(IFERROR(IFERROR(INDEX(BP!B:H,MATCH(B9,BP!C:C,0),6),INDEX(BP!B:H,MATCH(B9,BP!D:D,0),6)),INDEX(BP!B:H,MATCH(B9,BP!E:E,0),6)),\"\")","v":""},{"$f":"IFERROR(IFERROR(IFERROR(INDEX(BP!B:H,MATCH(B9,BP!C:C,0),7),INDEX(BP!B:H,MATCH(B9,BP!D:D,0),7)),INDEX(BP!B:H,MATCH(B9,BP!E:E,0),7)),\"\")","v":""},{"$f":"IF(A9=\"\",\"\",IF(C9>D9,\"Aumento em\",\"Redução em\"))","v":{"$error":"#REF!"}},{"$f":"IF(A9=\"\",\"\",IF(AND(LEFT(A9,5)=\"Ativo\",C9>D9),\"(-)\",IF(AND(LEFT(A9,5)=\"Ativo\",C9<D9),\"(+)\",IF(AND(LEFT(A9,7)=\"Passivo\",C9>D9),\"(+)\",IF(AND(LEFT(A9,7)=\"Passivo\",C9<D9),\"(-)\",\"-\")))))","v":{"$error":"#REF!"}},{"$error":"#REF!"},null,"Redução a Valor Recup. De Imobilizado",null,-66747.910000000149,0]
[null,null,{"$f":"IFERROR(IFERROR(IFERROR(INDEX(BP!B:H,MATCH(B10,BP!C:C,0),6),INDEX(BP!B:H,MATCH(B10,BP!D:D,0),6)),INDEX(BP!B:H,MATCH(B10,BP!E:E,0),6)),\"\")","v":""},{"$f":"IFERROR(IFERROR(IFERROR(INDEX(BP!B:H,MATCH(B10,BP!C:C,0),7),INDEX(BP!B:H,MATCH(B10,BP!D:D,0),7)),INDEX(BP!B:H,MATCH(B10,BP!E:E,0),7)),\"\")","v":""},null,null,"",null,"Ajustes de Avaliação Patrimonial de Ativos",null,null,0]
[{"$f":"IF(LEFT(#REF!,7)=\"Despesa\",\"\",IF(LEFT(#REF!,7)=\"Receita\",\"\",#REF!))","v":{"$error":"#REF!"}},{"$f":"IF(LEFT(A11,7)=\"Despesa\",\"\",IF(LEFT(A11,7)=\"Receita\",\"\",IF(A11=\"\",\"\",#REF!)))","v":{"$error":"#REF!"}},{"$f":"IFERROR(IFERROR(IFERROR(INDEX(BP!B:H,MATCH(B11,BP!C:C,0),6),INDEX(BP!B:H,MATCH(B11,BP!D:D,0),6)),INDEX(BP!B:H,MATCH(B11,BP!E:E,0),6)),\"\")","v":""},{"$f":"IFERROR(IFERROR(IFERROR(INDEX(BP!B:H,MATCH(B11,BP!C:C,0),7),INDEX(BP!B:H,MATCH(B11,BP!D:D,0),7)),INDEX(BP!B:H,MATCH(B11,BP!E:E,0),7)),\"\")","v":""},{"$f":"IF(A11=\"\",\"\",IF(C11>D11,\"Aumento em\",\"Redução em\"))","v":{"$error":"#REF!"}},{"$f":"IF(A11=\"\",\"\",IF(AND(LEFT(A11,5)=\"Ativo\",C11>D11),\"(-)\",IF(AND(LEFT(A11,5)=\"Ativo\",C11<D11),\"(+)\",IF(AND(LEFT(A11,7)=\"Passivo\",C11>D11),\"(+)\",IF(AND(LEFT(A11,7)=\"Passivo\",C11<D11),\"(-)\",\"-\")))))","v":{"$error":"#REF!"}},{"$error":"#REF!"},null,"Ajustes de Avaliação Patrimonial de Ativos",null,null,0]
[{"$f":"IF(LEFT(#REF!,7)=\"Despesa\",\"\",IF(LEFT(#REF!,7)=\"Receita\",\"\",#REF!))","v":{"$error":"#REF!"}},{"$f":"IF(LEFT(A12,7)=\"Despesa\",\"\",IF(LEFT(A12,7)=\"Receita\",\"\",IF(A12=\"\",\"\",#REF!)))","v":{"$error":"#REF!"}},{"$f":"IFERROR(IFERROR(IFERROR(INDEX(BP!B:H,MATCH(B12,BP!C:C,0),6),INDEX(BP!B:H,MATCH(B12,BP!D:D,0),6)),INDEX(BP!B:H,MATCH(B12,BP!E:E,0),6)),\"\")","v":""},{"$f":"IFERROR(IFERROR(IFERROR(INDEX(BP!B:H,MATCH(B12,BP!C:C,0),7),INDEX(BP!B:H,MATCH(B12,BP!D:D,0),7)),INDEX(BP!B:H,MATCH(B12,BP!E:E,0),7)),\"\")","v":""},{"$f":"IF(A12=\"\",\"\",IF(C12>D12,\"Aumento em\",\"Redução em\"))","v":{"$error":"#REF!"}},{"$f":"IF(A12=\"\",\"\",IF(AND(LEFT(A12,5)=\"Ativo\",C12>D12),\"(-)\",IF(AND(LEFT(A12,5)=\"Ativo\",C12<D12),\"(+)\",IF(AND(LEFT(A12,7)=\"Passivo\",C12>D12),\"(+)\",IF(AND(LEFT(A12,7)=\"Passivo\",C12<D12),\"(-)\",\"-\")))))","v":{"$error":"#REF!"}},{"$error":"#REF!"},null,"AFAC - PL"]
[null,null,{"$f":"IFERROR(IFERROR(IFERROR(INDEX(BP!B:H,MATCH(B13,BP!C:C,0),6),INDEX(BP!B:H,MATCH(B13,BP!D:D,0),6)),INDEX(BP!B:H,MATCH(B13,BP!E:E,0),6)),\"\")","v":""},{"$f":"IFERROR(IFERROR(IFERROR(INDEX(BP!B:H,MATCH(B13,BP!C:C,0),7),INDEX(BP!B:H,MATCH(B13,BP!D:D,0),7)),INDEX(BP!B:H,MATCH(B13,BP!E:E,0),7)),\"\")","v":""},null,null,"",null,"Resultado do Exercício Ajustado",null,-104152296.76002292,-57345231.689999819]
[{"$f":"IF(LEFT(#REF!,7)=\"Despesa\",\"\",IF(LEFT(#REF!,7)=\"Receita\",\"\",#REF!))","v":{"$error":"#REF!"}},{"$f":"IF(LEFT(A14,7)=\"Despesa\",\"\",IF(LEFT(A14,7)=\"Receita\",\"\",IF(A14=\"\",\"\",#REF!)))","v":{"$error":"#REF!"}},{"$f":"IFERROR(IFERROR(IFERROR(INDEX(BP!B:H,MATCH(B14,BP!C:C,0),6),INDEX(BP!B:H,MATCH(B14,BP!D:D,0),6)),INDEX(BP!B:H,MATCH(B14,BP!E:E,0),6)),\"\")","v":""},{"$f":"IFERROR(IFERROR(IFERROR(INDEX(BP!B:H,MATCH(B14,BP!C:C,0),7),INDEX(BP!B:H,MATCH(B14,BP!D:D,0),7)),INDEX(BP!B:H,MATCH(B14,BP!E:E,0),7)),\"\")","v":""},{"$f":"IF(A14=\"\",\"\",IF(C14>D14,\"Aumento em\",\"Redução em\"))","v":{"$error":"#REF!"}},{"$f":"IF(A14=\"\",\"\",IF(AND(LEFT(A14,5)=\"Ativo\",C14>D14),\"(-)\",IF(AND(LEFT(A14,5)=\"Ativo\",C14<D14),\"(+)\",IF(AND(LEFT(A14,7)=\"Passivo\",C14>D14),\"(+)\",IF(AND(LEFT(A14,7)=\"Passivo\",C14<D14),\"(-)\",\"-\")))))","v":{"$error":"#REF!"}},{"$error":"#REF!"},null,"Variações Patrimoniais",null,273798712.52002239,360151364.61380363]
[{"$f":"IF(LEFT(#REF!,7)=\"Despesa\",\"\",IF(LEFT(#REF!,7)=\"Receita\",\"\",#REF!))","v":{"$error":"#REF!"}},{"$f":"IF(LEFT(A15,7)=\"Despesa\",\"\",IF(LEFT(A15,7)=\"Receita\",\"\",IF(A15=\"\",\"\",#REF!)))","v":{"$error":"#REF!"}},{"$f":"IFERROR(IFERROR(IFERROR(INDEX(BP!B:H,MATCH(B15,BP!C:C,0),6),INDEX(BP!B:H,MATCH(B15,BP!D:D,0),6)),INDEX(BP!B:H,MATCH(B15,BP!E:E,0),6)),\"\")","v":""},{"$f":"IFERROR(IFERROR(IFERROR(INDEX(BP!B:H,MATCH(B15,BP!C:C,0),7),INDEX(BP!B:H,MATCH(B15,BP!D:D,0),7)),INDEX(BP!B:H,MATCH(B15,BP!E:E,0),7)),\"\")","v":""},{"$error":"#REF!"},{"$error":"#REF!"},{"$error":"#REF!"},null,"Aumento em","Subvenção de Custeio SUS a Receber",-834598150.47000003,-775826501.6400001]
{"$rows_left_out":41}
{"sheet":"DVA","index":3,"n_rows":38,"n_cols":6,"rows_kept":38,"cut":false,"hidden":false,"merged":[[0,1,0,3],[1,2,1,3]]}
[null,"EBSERH - EMPRESA BRASILEIRA DE SERVIÇOS HOSPITALARES"]
[null,"Demonstração Valor Adicionado ","30 de junho de 2022"]
[null,"Em reais "]
[null,"Descrição"," 01.01.2022                          a                        30.06.2022"," 01.01.2021                          a                        30.06.2021"]
[null,"Geração de Valor Adicionado"]
[null,"1 - Receitas",51689644.600000001,63560835.079999998]
[null,"1.1 - Atividades Operacionais",51689644.600000001,63560835.079999998]
[null,"1.1.1 - Receita de Serviços e Exploração",51689644.600000001,63560835.079999998]
[null,"2 - Insumos Adquiridos de Terceiros",1297455287.0599997,1164969115.21]
[null,"2.1 - Materiais de Consumo",568059097.88,565746305.95999992]
[null,"2.2 - Energia elétrica, Água e Esgoto, Gás",74301323.560000002,60032974.810000002]
[null,"2.3 - Serviços de Terceiros",648949070.9399997,539189834.43999994]
[null,"2.4 - Contigências para Riscos Cíveis",6145794.6799999997,0]
[null,"3 - Valor Adicionado Bruto (1-2)",-1245765642.4599998,-1101408280.1300001]
[null,"4 - Depreciação, Amortização, Impairment e Perdas",32554076.259999998,20893749.199999999]
{"$rows_left_out":24}
{"sheet":"DMPL","index":4,"n_rows":20,"n_cols":6,"rows_kept":20,"cut":false,"hidden":false,"merged":[[2,13,2,14],[1,4,1,5],[0,1,0,5],[12,1,13,1],[12,2,13,2],[12,3,13,3],[12,4,13,4],[12,5,13,5],[11,1,11,5],[3,1,4,1],[3,2,4,2],[3,3,4,3],[3,4,4,4],[3,5,4,5]]}
[null,"EBSERH - EMPRESA BRASILEIRA DE SERVIÇOS HOSPITALARES"]
[null,"Demonstração Consolidada das Mutações do Patrimônio Líquido ",null,null,"30 de junho de 2022"]
[null,"Em reais"]
[null,"Componentes ","Capital Social ","Reservas de Capital - AFAC","Resultados Acumulados","Patrimônio Líquido "]
[]
[null,"Saldos Iniciais (31/12/2020)",381384237.75,202658776.91,-529544354.01999998,54498660.639999986]
[null,"Resultado do Período",null,null,-218107289.09999999,-218107289.09999999]
[null,"Adiantamento Fut Aume Cap - AFAC",null,112365624.37,null,112365624.37]
[null,"Integralização de AFAC ao Capital Social",181119026.97,-181119026.97,null,0]
[null,"Saldos Finais em 31/12/2021",562503264.72000003,133905374.30999997,-747651643.12,-51243004.090000004]
[]
[]
[null,"Componentes ","Capital Social ","Reservas de Capital - AFAC","Prejuízos  Acumulados","Patrimônio Líquido "]
[]
[null,"2021-12-31",562503264.72000003,133905374.31,-747651643.12000132,-51243004.090001345]
{"$rows_left_out":6}
{"sheet":"DRA","index":5,"n_rows":9,"n_cols":3,"rows_kept":9,"cut":false,"hidden":false,"merged":[[0,0,0,2],[1,1,1,2]]}
["EBSERH - EMPRESA BRASILEIRA DE SERVIÇOS HOSPITALARES"]
["Demonstrações Intermediárias do Resultado Abrangente"]
["Em reais "]
["Descrição"," 01.01.2022                          a                        30.06.2022"," 01.01.2021                          a                        30.06.2021"]
["1 Resultado do Exercício",-130458095.46002293,-77191010.199999809]
["2 Outros Resultados Abrangentes",0,0]
["2.1 -Ajuste de Avaliação Patrimonial",0,0]
["3 Resultado Abrangente do Período",-130458095.46002293,-77191010.199999809]
["As notas explicativas da Administração são parte integrante das demonstrações contábeis consolidadas."]

{"sheet":"Cálculo de RI","index":6,"n_rows":10,"n_cols":5,"rows_kept":10,"cut":false,"hidden":false,"merged":[]}
[]
["Despesa indedutível da Base IR",76026913.629999995,{"$f":"0.15","v":0.15},{"$f":"C2*B3","v":17975239.390499622},"IR Sobre a Base"]
["Base de IR",119834929.26999748,0.1,{"$f":"C3*B5","v":11977492.926999748},"Adicional IR"]
["Percentual Isento",60000,0.09,{"$f":"B3*C4","v":10785143.634299772},"CSLL a Recolher"]
[null,119774929.26999748,null,{"$f":"D2+D3","v":29952732.317499369},"Total de IR Apurado"]
[null,null,0.3,{"$f":"D5*C6","v":8985819.6952498108},"Compensação de Prejuízo Fiscal Acumulado"]
[]
[null,null,null,{"$f":"D5-D6","v":20966912.622249559},"IR a Recolher"]
[null,null,null,{"$f":"D4","v":10785143.634299772},"CSLL a Recolher"]
[null,null,null,{"$f":"D8+D9","v":31752056.256549329},"Total"]

{"sheet":"--","index":7,"n_rows":192,"n_cols":4,"rows_kept":192,"cut":false,"hidden":true,"merged":[]}
["1 - Receitas",null,"Grupo Dva","Subgrupo DVA"]
["1.1 - Atividades operacionais",null,"1.1 - Atividades operacionais","1.1 - Atividades operacionais"]
["Relatório Financeiro PF",null,"Relatório Financeiro PF","Relatório Financeiro PF"]
["2 - Insumos Adquiridos de Terceiros",null,"2 - Insumos Adquiridos de Terceiros","2 - Insumos Adquiridos de Terceiros"]
["2.1 - Materiais de Consumo",null,"2 - Insumos Adquiridos de Terceiros","2.1 - Materiais de Consumo"]
["3.3.1.1.1.01.00",{"$f":"VLOOKUP(A6,#REF!,2,0)","v":{"$error":"#REF!"}},"2 - Insumos Adquiridos de Terceiros","2.1 - Materiais de Consumo"]
["3.3.1.1.1.02.00",{"$f":"VLOOKUP(A7,#REF!,2,0)","v":{"$error":"#REF!"}},"2 - Insumos Adquiridos de Terceiros","2.1 - Materiais de Consumo"]
["3.3.1.1.1.03.00",{"$f":"VLOOKUP(A8,#REF!,2,0)","v":{"$error":"#REF!"}},"2 - Insumos Adquiridos de Terceiros","2.1 - Materiais de Consumo"]
["3.3.1.1.1.04.00",{"$f":"VLOOKUP(A9,#REF!,2,0)","v":{"$error":"#REF!"}},"2 - Insumos Adquiridos de Terceiros","2.1 - Materiais de Consumo"]
["3.3.1.1.1.05.00",{"$f":"VLOOKUP(A10,#REF!,2,0)","v":{"$error":"#REF!"}},"2 - Insumos Adquiridos de Terceiros","2.1 - Materiais de Consumo"]
["3.3.1.1.1.06.00",{"$f":"VLOOKUP(A11,#REF!,2,0)","v":{"$error":"#REF!"}},"2 - Insumos Adquiridos de Terceiros","2.1 - Materiais de Consumo"]
["3.3.1.1.1.07.00",{"$f":"VLOOKUP(A12,#REF!,2,0)","v":{"$error":"#REF!"}},"2 - Insumos Adquiridos de Terceiros","2.1 - Materiais de Consumo"]
["3.3.1.1.1.08.00",{"$f":"VLOOKUP(A13,#REF!,2,0)","v":{"$error":"#REF!"}},"2 - Insumos Adquiridos de Terceiros","2.1 - Materiais de Consumo"]
["3.3.1.1.1.09.00",{"$f":"VLOOKUP(A14,#REF!,2,0)","v":{"$error":"#REF!"}},"2 - Insumos Adquiridos de Terceiros","2.1 - Materiais de Consumo"]
["3.3.1.1.1.99.00",{"$f":"VLOOKUP(A15,#REF!,2,0)","v":{"$error":"#REF!"}},"2 - Insumos Adquiridos de Terceiros","2.1 - Materiais de Consumo"]
{"$rows_left_out":177}