{"text_format":"1","workbook":"xlsx","n_sheets":6,"sheets":["BP","DR","DFC","DVA","DMPL","--"],"not_rendered":{"charts":0,"images":0,"macros":1,"external_links":0,"defined_names":2,"comments":0,"pivot_tables":0},"unopened":[],"bounds":{"document_bytes":16777216,"sheet_cells":100000,"rows_first":2000,"rows_last":500,"rows_between":2000,"halvings":0,"cell_chars":16384,"cell_head_chars":4096},"cells_cut":0,"cells_raw":0,"read":"whole","date_system":"1900"}

{"sheet":"BP","index":0,"n_rows":54,"n_cols":8,"rows_kept":54,"cut":false,"hidden":false,"merged":[[0,1,0,7],[3,1,3,4],[1,6,1,7],[30,6,30,7]]}
[null,"EBSERH - EMPRESA BRASILEIRA DE SERVIÇOS HOSPITALARES"]
[null,"Balanço Patrimonial Consolidado ",null,null,null,null,"31 de Dezembro de 2020"]
[null,"Em reais"]
[null,"ATIVO ",null,null,null,"NOTA","31.12.2020","31.12.2019"]
[null,"CIRCULANTE",null,null,null,"1.1",1137165231.4200001,811323437.56000018]
[null,null,"Caixa e Equivalentes de Caixa",null,null,"1.1.1",745556301.51999998,571660067.48000002]
[null,null,"Valores a Curto Prazo - SUS",null,null,"1.1.2",35011916.130000003,31687262.81000001]
[null,null,"Subvenção de Custeio SUS a Receber",null,null,"1.1.3",0,0]
[null,null,"Adiantamentos e Créditos a Receber",null,null,"1.1.3",17233041.32,18069597.82]
[null,null,"Estoques",null,null,"1.1.4",339363972.45000005,189906509.44999999]
[null,null,"Valores em Liquidação",null,null,null,0,0]
[null,"NÃO CIRCULANTE",null,null,null,"1.2",557949458.56107235,272852213.68892306]
[null,null,"Valores a Receber",null,null,null,0,0]
[null,null,"Depósitos Judiciais",null,null,"1.2.1",14350674.620000001,11847225.620000001]
[null,null,"Outras Despesas Antecipadas",null,null,"1.2.2","Fora do Siafi",0]
[null,null,"Imobilizado",null,null,"1.2.3",483557905.12281001,217745484.08799946]
[null,null,null,"Bens Móveis",null,"1.2.3.1",529446242.16281003,282786502.69373602]
[null,null,null,null,"Depreciação Bens Móveis","1.2.3.2",-93914863.650000006,-67631977.150000006]
[null,null,null,null,"Redução a Valor Recup. De Imobilizado","1.2.3.3",-6165879.6399999997,-6153142.4357365416]
[null,null,null,"Bens Imóveis",null,"1.2.3.4",54348047.870000005,8817256.7300000004]
{"$rows_left_out":35}
{"sheet":"DR","index":1,"n_rows":40,"n_cols":10,"rows_kept":40,"cut":false,"hidden":false,"merged":[[39,1,39,9],[3,1,3,3],[30,1,30,3],[16,2,16,3],[19,2,19,3],[7,1,7,3],[22,2,22,3],[24,2,24,3],[8,2,8,3],[13,2,13,3],[25,1,25,3],[26,1,26,3],[29,1,29,3],[34,1,34,3],[36,1,36,3],[0,1,0,9],[1,6,1,9],[38,1,38,3]]}
[null,"EBSERH - EMPRESA BRASILEIRA DE SERVIÇOS HOSPITALARES"]
[null,"Demonstração do Resultado",null,null,null,null,{"$f":"BP!G2","v":"31 de Dezembro de 2020"}]
[null,"Em reais",null,null,null,null,null,null,"Reapresentação"]
[null,"DESCRIÇÃO",null,null,"Nota","01.10.2020                               a                          31.12.2020","01.01.2020                               a                          31.12.2020","01.10.2019                               a                          31.12.2019","01.01.2019                                a                               31.12.2019","01.01.2019                                a                          31.12.2019"]
[null,"Receita Bruta",null,null,3,8962469.4600000083,88713900.430000007,52703531.630000003,68951596.200000003,728890950.33000004]
[null,null,"Receita com Serviços",null,"3.1",8962469.4600000083,88713900.430000007,52703531.630000003,68951596.200000003,728890950.33000004]
[null,null,null,"Receita de Serviços e Exploração","3.1.1",8962469.4600000083,88713900.430000007,52703531.630000003,68951596.200000003,728890950.33000004]
[null,"Despesas Operacionais",null,null,"3.2",-2047715134.0500002,-7423363279.0700006,-1891295697.2800002,-5985320155.5500002,-5985320155.5500002]
[null,null,"Despesa com Pessoal, Encargos e Benefícios",null,"3.2.1",-1442292501.1300001,-5365418840.9499998,-1434961089.6700001,-4696822706.8000002,-4696822706.8000002]
[null,null,null,"Remuneração a Pessoal","3.2.2",-955936471.6699996,-3723570892.6199994,-959251276.90999937,-3328393359.4799995,-3328393359.4799995]
[null,null,null,"Encargos Patronais","3.3.3",-397327665.74000013,-1338785993.21,-363921609.50000012,-1089660364.3600001,-1089660364.3600001]
[null,null,null,"Benefícios a Pessoal","3.3.4",-80748896.970000029,-288063938.16000003,-109530968.84000003,-268514057.11000001,-268514057.11000001]
[null,null,null,"Outras Despesas com Pessoal e Encargos","3.3.5",-8279466.7500000009,-14998016.960000001,-2257234.4200000018,-10254925.850000001,-10254925.850000001]
[null,null,"Despesa com Uso de Bens e Serviços",null,"3.3",-560543614.33999991,-1931988928.3700001,-354174122.01999986,-1069346017.4799998,-1069346017.4799998]
[null,null,null,"Uso de Material de Consumo","3.3.1",-250187800.79999995,-849160380.46000004,-161900332.19999999,-437085411.69999999,-437085411.69999999]
[null,null,null,"Serviços Tomados","3.3.2",-310355813.53999984,-1082828547.9100001,-192273789.81999993,-632260605.77999985,-632260605.77999985]
[null,null,"Despesa com Bens Móveis, Imóveis e Intangíveis",null,"3.4",-8992357.4399999939,-34629002.349999994,-6123335.7800000012,-23351355.879999999,-23351355.879999999]
[null,null,null,"Depreciação, Amortização e Impairment","3.4.1",-8990289.0999999978,-32609821.479999997,-6123335.7800000012,-23351355.879999999,-23351355.879999999]
[null,null,null,"Perdas Involuntárias e Desfazimentos","3.4.2",-2068.3400000000838,-2019180.87,0,0,0]
[null,null,"Contingência para Riscos Fiscais",null,"3.5",-32309903.249999993,-77850681.539999992,-76026913.63000001,-103736384.46000001,-103736384.46000001]
{"$rows_left_out":21}
{"sheet":"DFC","index":2,"n_rows":50,"n_cols":12,"rows_kept":50,"cut":false,"hidden":false,"merged":[[0,0,0,6],[1,10,1,11],[5,8,5,9],[0,8,0,11]]}
["Organizador de DFC",null,null,null,null,null,null,null,"EBSERH - EMPRESA BRASILEIRA DE SERVIÇOS HOSPITALARES"]
["Grupo","Conta Contábil","Valor Fechamento","Valor anterior","Análise","Regra","Δ Variação",null,"Demonstração do Fluxo de Caixa - Método Indireto",null,"31 de Dezembro de 2020"]
[null,null,null,null,null,null,null,null,"Em reais"]
["Passivo-C","Resultado do Exercício",{"$f":"IFERROR(IFERROR(IFERROR(INDEX(BP!B:H,MATCH(B4,BP!C:C,0),6),INDEX(BP!B:H,MATCH(B4,BP!D:D,0),6)),INDEX(BP!B:H,MATCH(B4,BP!E:E,0),6)),\"\")","v":-13719772.700000763},{"$f":"IFERROR(IFERROR(IFERROR(INDEX(BP!B:H,MATCH(B4,BP!C:C,0),7),INDEX(BP!B:H,MATCH(B4,BP!D:D,0),7)),INDEX(BP!B:H,MATCH(B4,BP!E:E,0),7)),\"\")","v":-117909916.93000031},{"$f":"IF(A4=\"\",\"\",IF(C4>D4,\"Aumento em\",\"Redução em\"))","v":"Aumento em"},{"$f":"IF(A4=\"\",\"\",IF(AND(LEFT(A4,5)=\"Ativo\",C4>D4),\"(-)\",IF(AND(LEFT(A4,5)=\"Ativo\",C4<D4),\"(+)\",IF(AND(LEFT(A4,7)=\"Passivo\",C4>D4),\"(+)\",IF(AND(LEFT(A4,7)=\"Passivo\",C4<D4),\"(-)\",\"-\")))))","v":"(+)"},{"$f":"IFERROR(IF(C4-D4>=0,C4-D4,(C4-D4)*-1),\"\")","v":104190144.22999954},null,"DESCRIÇÃO",null,"01.01.2020                               a                          31.12.2020","01.01.2019                                a                          31.12.2019"]
[{"$f":"IF(LEFT(#REF!,7)=\"Despesa\",\"\",IF(LEFT(#REF!,7)=\"Receita\",\"\",#REF!))","v":{"$error":"#REF!"}},{"$f":"IF(LEFT(A5,7)=\"Despesa\",\"\",IF(LEFT(A5,7)=\"Receita\",\"\",IF(A5=\"\",\"\",#REF!)))","v":{"$error":"#REF!"}},{"$f":"IFERROR(IFERROR(IFERROR(INDEX(BP!B:H,MATCH(B5,BP!C:C,0),6),INDEX(BP!B:H,MATCH(B5,BP!D:D,0),6)),INDEX(BP!B:H,MATCH(B5,BP!E:E,0),6)),\"\")","v":""},{"$f":"IFERROR(IFERROR(IFERROR(INDEX(BP!B:H,MATCH(B5,BP!C:C,0),7),INDEX(BP!B:H,MATCH(B5,BP!D:D,0),7)),INDEX(BP!B:H,MATCH(B5,BP!E:E,0),7)),\"\")","v":""},{"$f":"IF(A5=\"\",\"\",IF(C5>D5,\"Aumento em\",\"Redução em\"))","v":{"$error":"#REF!"}},{"$error":"#REF!"},{"$f":"IFERROR(IF(C5-D5>=0,C5-D5,(C5-D5)*-1),\"\")","v":""},null,"FLUXO DE CAIXA DAS ATIVIDADES OPERACIONAIS"]
[{"$f":"IF(LEFT(#REF!,7)=\"Despesa\",\"\",IF(LEFT(#REF!,7)=\"Receita\",\"\",#REF!))","v":{"$error":"#REF!"}},{"$f":"IF(LEFT(A6,7)=\"Despesa\",\"\",IF(LEFT(A6,7)=\"Receita\",\"\",IF(A6=\"\",\"\",#REF!)))","v":{"$error":"#REF!"}},{"$f":"IFERROR(IFERROR(IFERROR(INDEX(BP!B:H,MATCH(B6,BP!C:C,0),6),INDEX(BP!B:H,MATCH(B6,BP!D:D,0),6)),INDEX(BP!B:H,MATCH(B6,BP!E:E,0),6)),\"\")","v":""},{"$f":"IFERROR(IFERROR(IFERROR(INDEX(BP!B:H,MATCH(B6,BP!C:C,0),7),INDEX(BP!B:H,MATCH(B6,BP!D:D,0),7)),INDEX(BP!B:H,MATCH(B6,BP!E:E,0),7)),\"\")","v":""},{"$f":"IF(A6=\"\",\"\",IF(C6>D6,\"Aumento em\",\"Redução em\"))","v":{"$error":"#REF!"}},{"$error":"#REF!"},{"$f":"IF(F6=\"(-)\",IFERROR(IF(C6-D6>=0,C6-D6,(C6-D6)*-1),\"\")*-1,IFERROR(IF(C6-D6>=0,C6-D6,(C6-D6)*-1),\"\"))","v":{"$error":"#REF!"}},null,"Resultado do Exercício",null,-13719772.700000763,-117909916.93000001]
[{"$f":"IF(LEFT(#REF!,7)=\"Despesa\",\"\",IF(LEFT(#REF!,7)=\"Receita\",\"\",#REF!))","v":{"$error":"#REF!"}},{"$f":"IF(LEFT(A7,7)=\"Despesa\",\"\",IF(LEFT(A7,7)=\"Receita\",\"\",IF(A7=\"\",\"\",#REF!)))","v":{"$error":"#REF!"}},{"$f":"IFERROR(IFERROR(IFERROR(INDEX(BP!B:H,MATCH(B7,BP!C:C,0),6),INDEX(BP!B:H,MATCH(B7,BP!D:D,0),6)),INDEX(BP!B:H,MATCH(B7,BP!E:E,0),6)),\"\")","v":""},{"$f":"IFERROR(IFERROR(IFERROR(INDEX(BP!B:H,MATCH(B7,BP!C:C,0),7),INDEX(BP!B:H,MATCH(B7,BP!D:D,0),7)),INDEX(BP!B:H,MATCH(B7,BP!E:E,0),7)),\"\")","v":""},{"$f":"IF(A7=\"\",\"\",IF(C7>D7,\"Aumento em\",\"Redução em\"))","v":{"$error":"#REF!"}},{"$error":"#REF!"},{"$error":"#REF!"},null,"Ajustes de Exercícios Anteriores",null,-3651055.2000004598,-55298123.979999997]
[null,null,null,null,null,null,null,null,"Aumento de Capital Social",null,376384237.75,0]
[{"$f":"IF(LEFT(#REF!,7)=\"Despesa\",\"\",IF(LEFT(#REF!,7)=\"Receita\",\"\",#REF!))","v":{"$error":"#REF!"}},{"$f":"IF(LEFT(A9,7)=\"Despesa\",\"\",IF(LEFT(A9,7)=\"Receita\",\"\",IF(A9=\"\",\"\",#REF!)))","v":{"$error":"#REF!"}},{"$f":"IFERROR(IFERROR(IFERROR(INDEX(BP!B:H,MATCH(B9,BP!C:C,0),6),INDEX(BP!B:H,MATCH(B9,BP!D:D,0),6)),INDEX(BP!B:H,MATCH(B9,BP!E:E,0),6)),\"\")","v":""},{"$f":"IFERROR(IFERROR(IFERROR(INDEX(BP!B:H,MATCH(B9,BP!C:C,0),7),INDEX(BP!B:H,MATCH(B9,BP!D:D,0),7)),INDEX(BP!B:H,MATCH(B9,BP!E:E,0),7)),\"\")","v":""},{"$error":"#REF!"},{"$error":"#REF!"},{"$error":"#REF!"},null,"Depreciação e Amortização",null,31325974.840000004,22954950.399999999]
[{"$f":"IF(LEFT(#REF!,7)=\"Despesa\",\"\",IF(LEFT(#REF!,7)=\"Receita\",\"\",#REF!))","v":{"$error":"#REF!"}},{"$f":"IF(LEFT(A10,7)=\"Despesa\",\"\",IF(LEFT(A10,7)=\"Receita\",\"\",IF(A10=\"\",\"\",#REF!)))","v":{"$error":"#REF!"}},{"$f":"IFERROR(IFERROR(IFERROR(INDEX(BP!B:H,MATCH(B10,BP!C:C,0),6),INDEX(BP!B:H,MATCH(B10,BP!D:D,0),6)),INDEX(BP!B:H,MATCH(B10,BP!E:E,0),6)),\"\")","v":""},{"$f":"IFERROR(IFERROR(IFERROR(INDEX(BP!B:H,MATCH(B10,BP!C:C,0),7),INDEX(BP!B:H,MATCH(B10,BP!D:D,0),7)),INDEX(BP!B:H,MATCH(B10,BP!E:E,0),7)),\"\")","v":""},{"$error":"#REF!"},{"$error":"#REF!"},{"$error":"#REF!"},null,"Redução a Valor Recup. De Intangível",null,-978026.21,0]
[{"$f":"IF(LEFT(#REF!,7)=\"Despesa\",\"\",IF(LEFT(#REF!,7)=\"Receita\",\"\",#REF!))","v":{"$error":"#REF!"}},{"$f":"IF(LEFT(A11,7)=\"Despesa\",\"\",IF(LEFT(A11,7)=\"Receita\",\"\",IF(A11=\"\",\"\",#REF!)))","v":{"$error":"#REF!"}},{"$f":"IFERROR(IFERROR(IFERROR(INDEX(BP!B:H,MATCH(B11,BP!C:C,0),6),INDEX(BP!B:H,MATCH(B11,BP!D:D,0),6)),INDEX(BP!B:H,MATCH(B11,BP!E:E,0),6)),\"\")","v":""},{"$f":"IFERROR(IFERROR(IFERROR(INDEX(BP!B:H,MATCH(B11,BP!C:C,0),7),INDEX(BP!B:H,MATCH(B11,BP!D:D,0),7)),INDEX(BP!B:H,MATCH(B11,BP!E:E,0),7)),\"\")","v":""},{"$error":"#REF!"},{"$error":"#REF!"},{"$error":"#REF!"},null,"Redução a Valor Recup. De Imobilizado",null,12737.204263458028,0]
[{"$f":"IF(LEFT(#REF!,7)=\"Despesa\",\"\",IF(LEFT(#REF!,7)=\"Receita\",\"\",#REF!))","v":{"$error":"#REF!"}},{"$f":"IF(LEFT(A12,7)=\"Despesa\",\"\",IF(LEFT(A12,7)=\"Receita\",\"\",IF(A12=\"\",\"\",#REF!)))","v":{"$error":"#REF!"}},{"$f":"IFERROR(IFERROR(IFERROR(INDEX(BP!B:H,MATCH(B12,BP!C:C,0),6),INDEX(BP!B:H,MATCH(B12,BP!D:D,0),6)),INDEX(BP!B:H,MATCH(B12,BP!E:E,0),6)),\"\")","v":""},{"$f":"IFERROR(IFERROR(IFERROR(INDEX(BP!B:H,MATCH(B12,BP!C:C,0),7),INDEX(BP!B:H,MATCH(B12,BP!D:D,0),7)),INDEX(BP!B:H,MATCH(B12,BP!E:E,0),7)),\"\")","v":""},{"$error":"#REF!"},{"$error":"#REF!"},{"$error":"#REF!"},null,"Ajustes de Avaliação Patrimonial de Ativos",null,383667.75,0]
[null,null,null,null,null,null,null,null,"AFAC - PL"]
[{"$f":"IF(LEFT(#REF!,7)=\"Despesa\",\"\",IF(LEFT(#REF!,7)=\"Receita\",\"\",#REF!))","v":{"$error":"#REF!"}},{"$f":"IF(LEFT(A14,7)=\"Despesa\",\"\",IF(LEFT(A14,7)=\"Receita\",\"\",IF(A14=\"\",\"\",#REF!)))","v":{"$error":"#REF!"}},{"$f":"IFERROR(IFERROR(IFERROR(INDEX(BP!B:H,MATCH(B14,BP!C:C,0),6),INDEX(BP!B:H,MATCH(B14,BP!D:D,0),6)),INDEX(BP!B:H,MATCH(B14,BP!E:E,0),6)),\"\")","v":""},{"$f":"IFERROR(IFERROR(IFERROR(INDEX(BP!B:H,MATCH(B14,BP!C:C,0),7),INDEX(BP!B:H,MATCH(B14,BP!D:D,0),7)),INDEX(BP!B:H,MATCH(B14,BP!E:E,0),7)),\"\")","v":""},{"$error":"#REF!"},{"$error":"#REF!"},{"$error":"#REF!"},null,"Resultado do Exercício Ajustado",null,389757763.43426222,-150253090.50999999]
[{"$f":"IF(LEFT(#REF!,7)=\"Despesa\",\"\",IF(LEFT(#REF!,7)=\"Receita\",\"\",#REF!))","v":{"$error":"#REF!"}},{"$f":"IF(LEFT(A15,7)=\"Despesa\",\"\",IF(LEFT(A15,7)=\"Receita\",\"\",IF(A15=\"\",\"\",#REF!)))","v":{"$error":"#REF!"}},{"$f":"IFERROR(IFERROR(IFERROR(INDEX(BP!B:H,MATCH(B15,BP!C:C,0),6),INDEX(BP!B:H,MATCH(B15,BP!D:D,0),6)),INDEX(BP!B:H,MATCH(B15,BP!E:E,0),6)),\"\")","v":""},{"$f":"IFERROR(IFERROR(IFERROR(INDEX(BP!B:H,MATCH(B15,BP!C:C,0),7),INDEX(BP!B:H,MATCH(B15,BP!D:D,0),7)),INDEX(BP!B:H,MATCH(B15,BP!E:E,0),7)),\"\")","v":""},{"$error":"#REF!"},{"$error":"#REF!"},{"$error":"#REF!"},null,"Variações Patrimoniais",null,97092952.316412479,543948970.16465974]
[{"$f":"IF(LEFT(#REF!,7)=\"Despesa\",\"\",IF(LEFT(#REF!,7)=\"Receita\",\"\",#REF!))","v":{"$error":"#REF!"}},{"$f":"IF(LEFT(A16,7)=\"Despesa\",\"\",IF(LEFT(A16,7)=\"Receita\",\"\",IF(A16=\"\",\"\",#REF!)))","v":{"$error":"#REF!"}},{"$f":"IFERROR(IFERROR(IFERROR(INDEX(BP!B:H,MATCH(B16,BP!C:C,0),6),INDEX(BP!B:H,MATCH(B16,BP!D:D,0),6)),INDEX(BP!B:H,MATCH(B16,BP!E:E,0),6)),\"\")","v":""},{"$f":"IFERROR(IFERROR(IFERROR(INDEX(BP!B:H,MATCH(B16,BP!C:C,0),7),INDEX(BP!B:H,MATCH(B16,BP!D:D,0),7)),INDEX(BP!B:H,MATCH(B16,BP!E:E,0),7)),\"\")","v":""},{"$error":"#REF!"},{"$error":"#REF!"},{"$error":"#REF!"},null,"Redução em","Subvenção de Custeio SUS a Receber",0]
[{"$f":"IF(LEFT(#REF!,7)=\"Despesa\",\"\",IF(LEFT(#REF!,7)=\"Receita\",\"\",#REF!))","v":{"$error":"#REF!"}},{"$f":"IF(LEFT(A17,7)=\"Despesa\",\"\",IF(LEFT(A17,7)=\"Receita\",\"\",IF(A17=\"\",\"\",#REF!)))","v":{"$error":"#REF!"}},{"$f":"IFERROR(IFERROR(IFERROR(INDEX(BP!B:H,MATCH(B17,BP!C:C,0),6),INDEX(BP!B:H,MATCH(B17,BP!D:D,0),6)),INDEX(BP!B:H,MATCH(B17,BP!E:E,0),6)),\"\")","v":""},{"$f":"IFERROR(IFERROR(IFERROR(INDEX(BP!B:H,MATCH(B17,BP!C:C,0),7),INDEX(BP!B:H,MATCH(B17,BP!D:D,0),7)),INDEX(BP!B:H,MATCH(B17,BP!E:E,0),7)),\"\")","v":""},{"$error":"#REF!"},{"$error":"#REF!"},{"$error":"#REF!"},null,"Aumento em","Valores a Curto Prazo - SUS",-3324653.3199999928,34894925.579999991]
[{"$f":"IF(LEFT(#REF!,7)=\"Despesa\",\"\",IF(LEFT(#REF!,7)=\"Receita\",\"\",#REF!))","v":{"$error":"#REF!"}},{"$f":"IF(LEFT(A18,7)=\"Despesa\",\"\",IF(LEFT(A18,7)=\"Receita\",\"\",IF(A18=\"\",\"\",#REF!)))","v":{"$error":"#REF!"}},{"$f":"IFERROR(IFERROR(IFERROR(INDEX(BP!B:H,MATCH(B18,BP!C:C,0),6),INDEX(BP!B:H,MATCH(B18,BP!D:D,0),6)),INDEX(BP!B:H,MATCH(B18,BP!E:E,0),6)),\"\")","v":""},{"$f":"IFERROR(IFERROR(IFERROR(INDEX(BP!B:H,MATCH(B18,BP!C:C,0),7),INDEX(BP!B:H,MATCH(B18,BP!D:D,0),7)),INDEX(BP!B:H,MATCH(B18,BP!E:E,0),7)),\"\")","v":""},{"$error":"#REF!"},{"$error":"#REF!"},{"$error":"#REF!"},null,"Redução em","Adiantamentos e Créditos a Receber",836556.5,-4909919.74]
[{"$f":"IF(LEFT(#REF!,7)=\"Despesa\",\"\",IF(LEFT(#REF!,7)=\"Receita\",\"\",#REF!))","v":{"$error":"#REF!"}},{"$f":"IF(LEFT(A19,7)=\"Despesa\",\"\",IF(LEFT(A19,7)=\"Receita\",\"\",IF(A19=\"\",\"\",#REF!)))","v":{"$error":"#REF!"}},{"$f":"IFERROR(IFERROR(IFERROR(INDEX(BP!B:H,MATCH(B19,BP!C:C,0),6),INDEX(BP!B:H,MATCH(B19,BP!D:D,0),6)),INDEX(BP!B:H,MATCH(B19,BP!E:E,0),6)),\"\")","v":""},{"$f":"IFERROR(IFERROR(IFERROR(INDEX(BP!B:H,MATCH(B19,BP!C:C,0),7),INDEX(BP!B:H,MATCH(B19,BP!D:D,0),7)),INDEX(BP!B:H,MATCH(B19,BP!E:E,0),7)),\"\")","v":""},{"$error":"#REF!"},{"$error":"#REF!"},{"$error":"#REF!"},null,"Aumento em","Estoques",-149457463.00000006,-90441407.949999988]
[{"$f":"IF(LEFT(#REF!,7)=\"Despesa\",\"\",IF(LEFT(#REF!,7)=\"Receita\",\"\",#REF!))","v":{"$error":"#REF!"}},{"$f":"IF(LEFT(A20,7)=\"Despesa\",\"\",IF(LEFT(A20,7)=\"Receita\",\"\",IF(A20=\"\",\"\",#REF!)))","v":{"$error":"#REF!"}},{"$f":"IFERROR(IFERROR(IFERROR(INDEX(BP!B:H,MATCH(B20,BP!C:C,0),6),INDEX(BP!B:H,MATCH(B20,BP!D:D,0),6)),INDEX(BP!B:H,MATCH(B20,BP!E:E,0),6)),\"\")","v":""},{"$f":"IFERROR(IFERROR(IFERROR(INDEX(BP!B:H,MATCH(B20,BP!C:C,0),7),INDEX(BP!B:H,MATCH(B20,BP!D:D,0),7)),INDEX(BP!B:H,MATCH(B20,BP!E:E,0),7)),\"\")","v":""},{"$error":"#REF!"},{"$error":"#REF!"},{"$error":"#REF!"},null,null,"Outras Despesas Antecipadas",0]
{"$rows_left_out":31}
{"sheet":"DVA","index":3,"n_rows":38,"n_cols":5,"rows_kept":38,"cut":false,"hidden":false,"merged":[[0,1,0,4],[1,2,1,4],[37,1,37,4]]}
[null,"EBSERH - EMPRESA BRASILEIRA DE SERVIÇOS HOSPITALARES"]
[null,"Demonstração Valor Adicionado ","31 de Dezembro de 2020"]
[null,"Em reais ",null,"Reapresentação"]
[null,"Descrição","01.01.2020                               a                          31.12.2020","01.01.2019                                a                          31.12.2019","01.01.2019                                a                          31.12.2019"]
[null,"Geração de Valor Adicionado"]
[null,"1 - Receitas",88713900.430000007,68951596.200000003,728890950.33000004]
[null,"1.1 - Atividades Operacionais",88713900.430000007,68951596.200000003,728890950.33000004]
[null,"1.1.1 - Receita de Serviços e Exploração",88713900.430000007,68951596.200000003,728890950.33000004]
[null,"2 - Insumos Adquiridos de Terceiros",1921353302.8800004,1265254239.6700001,1265254239.6700001]
[null,"2.1 - Materiais de Consumo",849160380.46000004,437085411.69999999,437085411.69999999]
[null,"2.2 - Energia elétrica, Água e Esgoto, Gás",84177887.75999999,53046487.299999997,53046487.299999997]
[null,"2.3 - Serviços de Terceiros",966278413.28000021,775122340.66999996,775122340.66999996]
[null,"2.4 - Contigências para Riscos Cíveis",21736621.379999999,0,0]
[null,"3 - Valor Adicionado Bruto (1-2)",-1832639402.4500003,-1196302643.47,-536363289.34000003]
[null,"4 - Depreciação, Amortização, Impairment e Perdas",34629002.349999994,23351355.879999999,23351355.879999999]
[null,"4.1 - Depreciação do Período",26798993.559999999,19845253.109999999,19845253.109999999]
[null,"4.2 - Amortização do Período",5810827.9199999999,3506102.77,3506102.77]
[null,"4.3 - Redução a Valor Recuperável - Impairment",0,0,0]
[null,"4.4 - Perdas Involuntárias e Desfazimentos",2019180.87,0,0]
[null,"5 - Valor Adicionado Líquido (3-4)",-1867268404.8000002,-1219653999.3500001,-559714645.22000003]
{"$rows_left_out":19}
{"sheet":"DMPL","index":4,"n_rows":24,"n_cols":6,"rows_kept":24,"cut":false,"hidden":false,"merged":[[2,17,2,18],[1,4,1,5],[0,1,0,5],[13,1,14,1],[13,2,14,2],[13,3,14,3],[13,4,14,4],[13,5,14,5],[12,1,12,5],[3,1,4,1],[3,2,4,2],[3,3,4,3],[3,4,4,4],[3,5,4,5]]}
[null,"EBSERH - EMPRESA BRASILEIRA DE SERVIÇOS HOSPITALARES"]
[null,"Demonstração Consolidada das Mutações do Patrimônio Líquido ",null,null,"30 de Setembro de 2020"]
[null,"Em reais"]
[null,"Componentes ","Capital Social Integralizado","Reservas de Capital - AFAC","Resultados Acumulados","Patrimônio Líquido "]
[]
[null,"Saldos Iniciais (31/12/2018)",5000000,94321337.019999996,-339361890.14573699,-240040553.07999998]
[null,"Resultado Líquido do Exercício",null,null,-117909916.93000031]
[null,"Adiantamento Fut Aume Cap - AFAC",null,124813719.89999999]
[null,"Compensação do Prejuízo"]
[null,"Ajustes de Exercicios Anteriores",null,null,-55285386.789999999]
[null,"Saldos Finais em 31/12/2019",5000000,219135056.91999999,-512557193.86573732,-288422136.94573736]
[]
[]
[null,"Componentes ","Capital Social Integralizado","Reservas de Capital - AFAC","Resultados Acumulados","Patrimônio Líquido"]
[]
[null,"Saldos Iniciais (31/12/2019)",5000000,219135056.91999999,-512557193.86573732,-288422136.94573736]
[null,"Resultado Líquido do Exercício",null,null,-13719772.700000763]
[null,"Adiantamento Fut Aume Cap - AFAC",null,202658776.91]
[null,"Compensação do Prejuízo"]
[null,"Ajustes de Exercicios Anteriores",null,null,-3651055.2000004598]
{"$rows_left_out":5}
{"sheet":"--","index":5,"n_rows":192,"n_cols":4,"rows_kept":192,"cut":false,"hidden":true,"merged":[]}
["1 - Receitas",null,"Grupo Dva","Subgrupo DVA"]
["1.1 - Atividades operacionais",null,"1.1 - Atividades operacionais","1.1 - Atividades operacionais"]
["Relatório Financeiro PF",null,"Relatório Financeiro PF","Relatório Financeiro PF"]
["2 - Insumos Adquiridos de Terceiros",null,"2 - Insumos Adquiridos de Terceiros","2 - Insumos Adquiridos de Terceiros"]
["2.1 - Materiais de Consumo",null,"2 - Insumos Adquiridos de Terceiros","2.1 - Materiais de Consumo"]
["3.3.1.1.1.01.00",{"$f":"VLOOKUP(A6,#REF!,2,0)","v":{"$error":"#REF!"}},"2 - Insumos Adquiridos de Terceiros","2.1 - Materiais de Consumo"]
["3.3.1.1.1.02.00",{"$f":"VLOOKUP(A7,#REF!,2,0)","v":{"$error":"#REF!"}},"2 - Insumos Adquiridos de Terceiros","2.1 - Materiais de Consumo"]
["3.3.1.1.1.03.00",{"$f":"VLOOKUP(A8,#REF!,2,0)","v":{"$error":"#REF!"}},"2 - Insumos Adquiridos de Terceiros","2.1 - Materiais de Consumo"]
["3.3.1.1.1.04.00",{"$f":"VLOOKUP(A9,#REF!,2,0)","v":{"$error":"#REF!"}},"2 - Insumos Adquiridos de Terceiros","2.1 - Materiais de Consumo"]
["3.3.1.1.1.05.00",{"$f":"VLOOKUP(A10,#REF!,2,0)","v":{"$error":"#REF!"}},"2 - Insumos Adquiridos de Terceiros","2.1 - Materiais de Consumo"]
["3.3.1.1.1.06.00",{"$f":"VLOOKUP(A11,#REF!,2,0)","v":{"$error":"#REF!"}},"2 - Insumos Adquiridos de Terceiros","2.1 - Materiais de Consumo"]
["3.3.1.1.1.07.00",{"$f":"VLOOKUP(A12,#REF!,2,0)","v":{"$error":"#REF!"}},"2 - Insumos Adquiridos de Terceiros","2.1 - Materiais de Consumo"]
["3.3.1.1.1.08.00",{"$f":"VLOOKUP(A13,#REF!,2,0)","v":{"$error":"#REF!"}},"2 - Insumos Adquiridos de Terceiros","2.1 - Materiais de Consumo"]
["3.3.1.1.1.09.00",{"$f":"VLOOKUP(A14,#REF!,2,0)","v":{"$error":"#REF!"}},"2 - Insumos Adquiridos de Terceiros","2.1 - Materiais de Consumo"]
["3.3.1.1.1.99.00",{"$f":"VLOOKUP(A15,#REF!,2,0)","v":{"$error":"#REF!"}},"2 - Insumos Adquiridos de Terceiros","2.1 - Materiais de Consumo"]
["3.6.3.3.1.01.00",{"$f":"VLOOKUP(A16,#REF!,2,0)","v":{"$error":"#REF!"}},"2 - Insumos Adquiridos de Terceiros","2.1 - Materiais de Consumo"]
["2.2 - Energia elétrica, Água e Esgoto, Gás",null,"2 - Insumos Adquiridos de Terceiros","2.2 - Energia elétrica, Água e Esgoto, Gás"]
["3.3.2.3.2.08.00",{"$f":"VLOOKUP(A18,#REF!,2,0)","v":{"$error":"#REF!"}},"2 - Insumos Adquiridos de Terceiros","2.2 - Energia elétrica, Água e Esgoto, Gás"]
["3.3.2.3.4.08.00",{"$f":"VLOOKUP(A19,#REF!,2,0)","v":{"$error":"#REF!"}},"2 - Insumos Adquiridos de Terceiros","2.2 - Energia elétrica, Água e Esgoto, Gás"]
["3.3.2.3.1.08.00",{"$f":"VLOOKUP(A20,#REF!,2,0)","v":{"$error":"#REF!"}},"2 - Insumos Adquiridos de Terceiros","2.2 - Energia elétrica, Água e Esgoto, Gás"]
{"$rows_left_out":172}