{"text_format":"1","workbook":"xlsx","n_sheets":6,"sheets":["BP","DR","DFC","DVA","DMPL","--"],"not_rendered":{"charts":0,"images":0,"macros":1,"external_links":0,"defined_names":2,"comments":0,"pivot_tables":0},"unopened":[],"bounds":{"document_bytes":16777216,"sheet_cells":100000,"rows_first":2000,"rows_last":500,"rows_between":2000,"halvings":0,"cell_chars":16384,"cell_head_chars":4096},"cells_cut":0,"cells_raw":0,"read":"whole","date_system":"1900"}

{"sheet":"BP","index":0,"n_rows":56,"n_cols":8,"rows_kept":56,"cut":false,"hidden":false,"merged":[[0,1,0,7],[3,1,3,4],[1,6,1,7],[30,6,30,7]]}
[null,"EBSERH - EMPRESA BRASILEIRA DE SERVIÇOS HOSPITALARES"]
[null,"Balanço Patrimonial Consolidado ",null,null,null,null,"30 de Setembro de 2020"]
[null,"Em reais"]
[null,"ATIVO ",null,null,null,"NOTA","30.09.2020","31.12.2019"]
[null,"CIRCULANTE",null,null,null,"1.1",1715840565.3199999,811323437.56000018]
[null,null,"Caixa e Equivalentes de Caixa",null,null,"1.1.1",819666095.80000007,571660067.48000002]
[null,null,"Valores a Curto Prazo - SUS",null,null,"1.1.2",35751338.009999998,31687262.81000001]
[null,null,"Subvenção de Custeio SUS a Receber",null,null,"1.1.3",401285976.63999999,0]
[null,null,"Adiantamentos e Créditos a Receber",null,null,"1.1.4",134038759.11999999,18069597.82]
[null,null,"Estoques",null,null,"1.1.5",325098395.75,189906509.44999999]
[null,null,"Valores em Liquidação",null,null,null,0,0]
[null,"NÃO CIRCULANTE",null,null,null,"1.2",409727171.45784295,272852213.68892306]
[null,null,"Valores a Receber",null,null,null,0,0]
[null,null,"Depósitos Judiciais",null,null,"1.2.1",17544702.440000001,11847225.620000001]
[null,null,"Outras Despesas Antecipadas",null,null,"1.2.2",9067.11,0]
[null,null,"Imobilizado",null,null,"1.2.3",347213439.12083399,217745484.08799946]
[null,null,null,"Bens Móveis",null,"1.2.3.1",392419953.12083399,282786502.69373602]
[null,null,null,null,"Depreciação Bens Móveis","1.2.3.4",-87441675.670000002,-67631977.150000006]
[null,null,null,null,"Redução a Valor Recup. De Imobilizado","1.2.3.5",-6165879.6399999997,-6153142.4357365416]
[null,null,null,"Bens Imóveis",null,"1.2.3.2",48507879.689999998,8817256.7300000004]
{"$rows_left_out":37}
{"sheet":"DR","index":1,"n_rows":52,"n_cols":10,"rows_kept":52,"cut":false,"hidden":false,"merged":[[3,1,3,3],[0,1,0,8],[30,1,30,3],[16,2,16,3],[19,2,19,3],[7,1,7,3],[22,2,22,3],[24,2,24,3],[8,2,8,3],[13,2,13,3],[2,7,2,8],[1,6,1,8],[39,1,39,8],[25,1,25,3],[26,1,26,3],[29,1,29,3],[34,1,34,3],[36,1,36,3],[38,1,38,3]]}
[null,"EBSERH - EMPRESA BRASILEIRA DE SERVIÇOS HOSPITALARES"]
[null,"Demonstração do Resultado",null,null,null,null,"30 de Setembro  de 2020"]
[null,"Em reais",null,null,null,null,null,"Reapresentação"]
[null,"DESCRIÇÃO",null,null,"Nota","01.07.2020                               a                          30.09.2020","01.01.2020                               a                          30.09.2020","01.07.2019                        a                      30.09.2019","01.01.2019                                a                          30.09.2019"]
[null,"Receita Bruta",null,null,"3.1",37318818.140000001,79751430.969999999,16248064.57,16248064.57]
[null,null,"Receita com Serviços",null,null,37318818.140000001,79751430.969999999,16248064.57,16248064.57]
[null,null,null,"Receita de Serviços e Exploração","3.1.1",37318818.140000001,79751430.969999999,16248064.57,16248064.57]
[null,"Despesas Operacionais",null,null,"3.3",-1928931867.0500002,-5375648145.0200005,-1327251562.26,-4094024458.27]
[null,null,"Despesa com Pessoal, Encargos e Benefícios",null,"3.3.1",-1347153574.9599996,-3923126339.8199997,-1092817621.8600001,-3261861617.1300001]
[null,null,null,"Remuneração a Pessoal","3.3.2",-959955219.69999981,-2767634420.9499998,-808167895.62000012,-2369142082.5700002]
[null,null,null,"Encargos Patronais","3.3.3",-305486346.54999995,-941458327.46999991,-163807637.84000003,-725738754.86000001]
[null,null,null,"Benefícios a Pessoal","3.3.4",-78754626.230000004,-207315041.19,-118942183.15999998,-158983088.26999998]
[null,null,null,"Outras Despesas com Pessoal e Encargos","3.3.5",-2957382.4799999995,-6718550.21,-1899905.2400000002,-7997691.4299999997]
[null,null,"Despesa com Uso de Bens e Serviços",null,null,-526196453.13000011,-1371445314.0300002,-205772078.58999997,-715171895.45999992]
[null,null,null,"Uso de Material de Consumo","3.3.6",-250205922.79000002,-598972579.66000009,-100476742.68999994,-275185079.5]
[null,null,null,"Serviços Tomados","3.3.7",-275990530.34000021,-772472734.37000024,-105295335.90000004,-439986815.95999992]
[null,null,"Despesa com Bens Móveis, Imóveis e Intangíveis",null,null,-10053631.82,-25636644.91,-6592397.8199999966,-17228020.099999998]
[null,null,null,"Depreciação, Amortização e Impairment","3.3.8",-8129832.379999999,-23619532.379999999,-6592397.8199999966,-17228020.099999998]
[null,null,null,"Perdas Involuntárias e Desfazimentos","3.3.9",-1923799.44,-2017112.53,0,0]
[null,null,"Contingência para Riscos Fiscais",null,"3.3.10",-44132479.469999999,-45540778.289999999,0,-27709470.830000002]
{"$rows_left_out":33}
{"sheet":"DFC","index":2,"n_rows":49,"n_cols":12,"rows_kept":49,"cut":false,"hidden":false,"merged":[[0,0,0,6],[1,10,1,11],[5,8,5,9],[0,8,0,11]]}
["Organizador de DFC",null,null,null,null,null,null,null,"EBSERH - EMPRESA BRASILEIRA DE SERVIÇOS HOSPITALARES"]
["Grupo","Conta Contábil","Valor Fechamento","Valor anterior","Análise","Regra","Δ Variação",null,"Demonstração do Fluxo de Caixa - Método Indireto",null,{"$f":"BP!G2","v":"30 de Setembro de 2020"}]
[null,null,null,null,null,null,null,null,"Em reais"]
["Passivo-C","Resultado do Exercício",{"$f":"IFERROR(IFERROR(IFERROR(INDEX(BP!B:H,MATCH(B4,BP!C:C,0),6),INDEX(BP!B:H,MATCH(B4,BP!D:D,0),6)),INDEX(BP!B:H,MATCH(B4,BP!E:E,0),6)),\"\")","v":-13463813.489997864},{"$f":"IFERROR(IFERROR(IFERROR(INDEX(BP!B:H,MATCH(B4,BP!C:C,0),7),INDEX(BP!B:H,MATCH(B4,BP!D:D,0),7)),INDEX(BP!B:H,MATCH(B4,BP!E:E,0),7)),\"\")","v":-117909916.93000031},{"$f":"IF(A4=\"\",\"\",IF(C4>D4,\"Aumento em\",\"Redução em\"))","v":"Aumento em"},{"$f":"IF(A4=\"\",\"\",IF(AND(LEFT(A4,5)=\"Ativo\",C4>D4),\"(-)\",IF(AND(LEFT(A4,5)=\"Ativo\",C4<D4),\"(+)\",IF(AND(LEFT(A4,7)=\"Passivo\",C4>D4),\"(+)\",IF(AND(LEFT(A4,7)=\"Passivo\",C4<D4),\"(-)\",\"-\")))))","v":"(+)"},{"$f":"IFERROR(IF(C4-D4>=0,C4-D4,(C4-D4)*-1),\"\")","v":104446103.44000244},null,"DESCRIÇÃO",null,"01.01.2020               a                     30.09.2020","01.01.2019       a         30.09.2019"]
[{"$f":"IF(LEFT(#REF!,7)=\"Despesa\",\"\",IF(LEFT(#REF!,7)=\"Receita\",\"\",#REF!))","v":{"$error":"#REF!"}},{"$f":"IF(LEFT(A5,7)=\"Despesa\",\"\",IF(LEFT(A5,7)=\"Receita\",\"\",IF(A5=\"\",\"\",#REF!)))","v":{"$error":"#REF!"}},{"$f":"IFERROR(IFERROR(IFERROR(INDEX(BP!B:H,MATCH(B5,BP!C:C,0),6),INDEX(BP!B:H,MATCH(B5,BP!D:D,0),6)),INDEX(BP!B:H,MATCH(B5,BP!E:E,0),6)),\"\")","v":""},{"$f":"IFERROR(IFERROR(IFERROR(INDEX(BP!B:H,MATCH(B5,BP!C:C,0),7),INDEX(BP!B:H,MATCH(B5,BP!D:D,0),7)),INDEX(BP!B:H,MATCH(B5,BP!E:E,0),7)),\"\")","v":""},{"$f":"IF(A5=\"\",\"\",IF(C5>D5,\"Aumento em\",\"Redução em\"))","v":{"$error":"#REF!"}},{"$error":"#REF!"},{"$f":"IFERROR(IF(C5-D5>=0,C5-D5,(C5-D5)*-1),\"\")","v":""},null,"FLUXO DE CAIXA DAS ATIVIDADES OPERACIONAIS"]
[{"$f":"IF(LEFT(#REF!,7)=\"Despesa\",\"\",IF(LEFT(#REF!,7)=\"Receita\",\"\",#REF!))","v":{"$error":"#REF!"}},{"$f":"IF(LEFT(A6,7)=\"Despesa\",\"\",IF(LEFT(A6,7)=\"Receita\",\"\",IF(A6=\"\",\"\",#REF!)))","v":{"$error":"#REF!"}},{"$f":"IFERROR(IFERROR(IFERROR(INDEX(BP!B:H,MATCH(B6,BP!C:C,0),6),INDEX(BP!B:H,MATCH(B6,BP!D:D,0),6)),INDEX(BP!B:H,MATCH(B6,BP!E:E,0),6)),\"\")","v":""},{"$f":"IFERROR(IFERROR(IFERROR(INDEX(BP!B:H,MATCH(B6,BP!C:C,0),7),INDEX(BP!B:H,MATCH(B6,BP!D:D,0),7)),INDEX(BP!B:H,MATCH(B6,BP!E:E,0),7)),\"\")","v":""},{"$f":"IF(A6=\"\",\"\",IF(C6>D6,\"Aumento em\",\"Redução em\"))","v":{"$error":"#REF!"}},{"$error":"#REF!"},{"$f":"IF(F6=\"(-)\",IFERROR(IF(C6-D6>=0,C6-D6,(C6-D6)*-1),\"\")*-1,IFERROR(IF(C6-D6>=0,C6-D6,(C6-D6)*-1),\"\"))","v":{"$error":"#REF!"}},null,"Resultado do Exercício",null,-13463813.489997864,-15665922.819998741]
[{"$f":"IF(LEFT(#REF!,7)=\"Despesa\",\"\",IF(LEFT(#REF!,7)=\"Receita\",\"\",#REF!))","v":{"$error":"#REF!"}},{"$f":"IF(LEFT(A7,7)=\"Despesa\",\"\",IF(LEFT(A7,7)=\"Receita\",\"\",IF(A7=\"\",\"\",#REF!)))","v":{"$error":"#REF!"}},{"$f":"IFERROR(IFERROR(IFERROR(INDEX(BP!B:H,MATCH(B7,BP!C:C,0),6),INDEX(BP!B:H,MATCH(B7,BP!D:D,0),6)),INDEX(BP!B:H,MATCH(B7,BP!E:E,0),6)),\"\")","v":""},{"$f":"IFERROR(IFERROR(IFERROR(INDEX(BP!B:H,MATCH(B7,BP!C:C,0),7),INDEX(BP!B:H,MATCH(B7,BP!D:D,0),7)),INDEX(BP!B:H,MATCH(B7,BP!E:E,0),7)),\"\")","v":""},{"$f":"IF(A7=\"\",\"\",IF(C7>D7,\"Aumento em\",\"Redução em\"))","v":{"$error":"#REF!"}},{"$error":"#REF!"},{"$error":"#REF!"},null,"Ajustes de Exercícios Anteriores",null,373059283.88999999,-3666994.3099999996]
[{"$f":"IF(LEFT(#REF!,7)=\"Despesa\",\"\",IF(LEFT(#REF!,7)=\"Receita\",\"\",#REF!))","v":{"$error":"#REF!"}},{"$f":"IF(LEFT(A8,7)=\"Despesa\",\"\",IF(LEFT(A8,7)=\"Receita\",\"\",IF(A8=\"\",\"\",#REF!)))","v":{"$error":"#REF!"}},{"$f":"IFERROR(IFERROR(IFERROR(INDEX(BP!B:H,MATCH(B8,BP!C:C,0),6),INDEX(BP!B:H,MATCH(B8,BP!D:D,0),6)),INDEX(BP!B:H,MATCH(B8,BP!E:E,0),6)),\"\")","v":""},{"$f":"IFERROR(IFERROR(IFERROR(INDEX(BP!B:H,MATCH(B8,BP!C:C,0),7),INDEX(BP!B:H,MATCH(B8,BP!D:D,0),7)),INDEX(BP!B:H,MATCH(B8,BP!E:E,0),7)),\"\")","v":""},{"$error":"#REF!"},{"$error":"#REF!"},{"$error":"#REF!"},null,"Depreciação e Amortização",null,23789644.949999996,17208997.810000002]
[{"$f":"IF(LEFT(#REF!,7)=\"Despesa\",\"\",IF(LEFT(#REF!,7)=\"Receita\",\"\",#REF!))","v":{"$error":"#REF!"}},{"$f":"IF(LEFT(A9,7)=\"Despesa\",\"\",IF(LEFT(A9,7)=\"Receita\",\"\",IF(A9=\"\",\"\",#REF!)))","v":{"$error":"#REF!"}},{"$f":"IFERROR(IFERROR(IFERROR(INDEX(BP!B:H,MATCH(B9,BP!C:C,0),6),INDEX(BP!B:H,MATCH(B9,BP!D:D,0),6)),INDEX(BP!B:H,MATCH(B9,BP!E:E,0),6)),\"\")","v":""},{"$f":"IFERROR(IFERROR(IFERROR(INDEX(BP!B:H,MATCH(B9,BP!C:C,0),7),INDEX(BP!B:H,MATCH(B9,BP!D:D,0),7)),INDEX(BP!B:H,MATCH(B9,BP!E:E,0),7)),\"\")","v":""},{"$error":"#REF!"},{"$error":"#REF!"},{"$error":"#REF!"},null,"Redução a Valor Recup. De Intangível",null,null,0]
[{"$f":"IF(LEFT(#REF!,7)=\"Despesa\",\"\",IF(LEFT(#REF!,7)=\"Receita\",\"\",#REF!))","v":{"$error":"#REF!"}},{"$f":"IF(LEFT(A10,7)=\"Despesa\",\"\",IF(LEFT(A10,7)=\"Receita\",\"\",IF(A10=\"\",\"\",#REF!)))","v":{"$error":"#REF!"}},{"$f":"IFERROR(IFERROR(IFERROR(INDEX(BP!B:H,MATCH(B10,BP!C:C,0),6),INDEX(BP!B:H,MATCH(B10,BP!D:D,0),6)),INDEX(BP!B:H,MATCH(B10,BP!E:E,0),6)),\"\")","v":""},{"$f":"IFERROR(IFERROR(IFERROR(INDEX(BP!B:H,MATCH(B10,BP!C:C,0),7),INDEX(BP!B:H,MATCH(B10,BP!D:D,0),7)),INDEX(BP!B:H,MATCH(B10,BP!E:E,0),7)),\"\")","v":""},{"$error":"#REF!"},{"$error":"#REF!"},{"$error":"#REF!"},null,null,null,null,0]
[{"$f":"IF(LEFT(#REF!,7)=\"Despesa\",\"\",IF(LEFT(#REF!,7)=\"Receita\",\"\",#REF!))","v":{"$error":"#REF!"}},{"$f":"IF(LEFT(A11,7)=\"Despesa\",\"\",IF(LEFT(A11,7)=\"Receita\",\"\",IF(A11=\"\",\"\",#REF!)))","v":{"$error":"#REF!"}},{"$f":"IFERROR(IFERROR(IFERROR(INDEX(BP!B:H,MATCH(B11,BP!C:C,0),6),INDEX(BP!B:H,MATCH(B11,BP!D:D,0),6)),INDEX(BP!B:H,MATCH(B11,BP!E:E,0),6)),\"\")","v":""},{"$f":"IFERROR(IFERROR(IFERROR(INDEX(BP!B:H,MATCH(B11,BP!C:C,0),7),INDEX(BP!B:H,MATCH(B11,BP!D:D,0),7)),INDEX(BP!B:H,MATCH(B11,BP!E:E,0),7)),\"\")","v":""},{"$error":"#REF!"},{"$error":"#REF!"},{"$error":"#REF!"},null,"Ajustes de Avaliação Patrimonial de Ativos",null,0,0]
[null,null,null,null,null,null,null,null,"AFAC - PL"]
[{"$f":"IF(LEFT(#REF!,7)=\"Despesa\",\"\",IF(LEFT(#REF!,7)=\"Receita\",\"\",#REF!))","v":{"$error":"#REF!"}},{"$f":"IF(LEFT(A13,7)=\"Despesa\",\"\",IF(LEFT(A13,7)=\"Receita\",\"\",IF(A13=\"\",\"\",#REF!)))","v":{"$error":"#REF!"}},{"$f":"IFERROR(IFERROR(IFERROR(INDEX(BP!B:H,MATCH(B13,BP!C:C,0),6),INDEX(BP!B:H,MATCH(B13,BP!D:D,0),6)),INDEX(BP!B:H,MATCH(B13,BP!E:E,0),6)),\"\")","v":""},{"$f":"IFERROR(IFERROR(IFERROR(INDEX(BP!B:H,MATCH(B13,BP!C:C,0),7),INDEX(BP!B:H,MATCH(B13,BP!D:D,0),7)),INDEX(BP!B:H,MATCH(B13,BP!E:E,0),7)),\"\")","v":""},{"$error":"#REF!"},{"$error":"#REF!"},{"$error":"#REF!"},null,"Resultado do Exercício Ajustado",null,383385115.35000211,-2123919.3199987374]
[{"$f":"IF(LEFT(#REF!,7)=\"Despesa\",\"\",IF(LEFT(#REF!,7)=\"Receita\",\"\",#REF!))","v":{"$error":"#REF!"}},{"$f":"IF(LEFT(A14,7)=\"Despesa\",\"\",IF(LEFT(A14,7)=\"Receita\",\"\",IF(A14=\"\",\"\",#REF!)))","v":{"$error":"#REF!"}},{"$f":"IFERROR(IFERROR(IFERROR(INDEX(BP!B:H,MATCH(B14,BP!C:C,0),6),INDEX(BP!B:H,MATCH(B14,BP!D:D,0),6)),INDEX(BP!B:H,MATCH(B14,BP!E:E,0),6)),\"\")","v":""},{"$f":"IFERROR(IFERROR(IFERROR(INDEX(BP!B:H,MATCH(B14,BP!C:C,0),7),INDEX(BP!B:H,MATCH(B14,BP!D:D,0),7)),INDEX(BP!B:H,MATCH(B14,BP!E:E,0),7)),\"\")","v":""},{"$error":"#REF!"},{"$error":"#REF!"},{"$error":"#REF!"},null,"Variações Patrimoniais",null,19578971.763180733,120092306.57000004]
[{"$f":"IF(LEFT(#REF!,7)=\"Despesa\",\"\",IF(LEFT(#REF!,7)=\"Receita\",\"\",#REF!))","v":{"$error":"#REF!"}},{"$f":"IF(LEFT(A15,7)=\"Despesa\",\"\",IF(LEFT(A15,7)=\"Receita\",\"\",IF(A15=\"\",\"\",#REF!)))","v":{"$error":"#REF!"}},{"$f":"IFERROR(IFERROR(IFERROR(INDEX(BP!B:H,MATCH(B15,BP!C:C,0),6),INDEX(BP!B:H,MATCH(B15,BP!D:D,0),6)),INDEX(BP!B:H,MATCH(B15,BP!E:E,0),6)),\"\")","v":""},{"$f":"IFERROR(IFERROR(IFERROR(INDEX(BP!B:H,MATCH(B15,BP!C:C,0),7),INDEX(BP!B:H,MATCH(B15,BP!D:D,0),7)),INDEX(BP!B:H,MATCH(B15,BP!E:E,0),7)),\"\")","v":""},{"$error":"#REF!"},{"$error":"#REF!"},{"$error":"#REF!"},null,"Aumento em","Subvenção de Custeio SUS a Receber",-401285976.63999999,0]
[{"$f":"IF(LEFT(#REF!,7)=\"Despesa\",\"\",IF(LEFT(#REF!,7)=\"Receita\",\"\",#REF!))","v":{"$error":"#REF!"}},{"$f":"IF(LEFT(A16,7)=\"Despesa\",\"\",IF(LEFT(A16,7)=\"Receita\",\"\",IF(A16=\"\",\"\",#REF!)))","v":{"$error":"#REF!"}},{"$f":"IFERROR(IFERROR(IFERROR(INDEX(BP!B:H,MATCH(B16,BP!C:C,0),6),INDEX(BP!B:H,MATCH(B16,BP!D:D,0),6)),INDEX(BP!B:H,MATCH(B16,BP!E:E,0),6)),\"\")","v":""},{"$f":"IFERROR(IFERROR(IFERROR(INDEX(BP!B:H,MATCH(B16,BP!C:C,0),7),INDEX(BP!B:H,MATCH(B16,BP!D:D,0),7)),INDEX(BP!B:H,MATCH(B16,BP!E:E,0),7)),\"\")","v":""},{"$error":"#REF!"},{"$error":"#REF!"},{"$error":"#REF!"},null,"Aumento em","Valores a Curto Prazo - SUS",-4064075.1999999881,-66302840.570000008]
[{"$f":"IF(LEFT(#REF!,7)=\"Despesa\",\"\",IF(LEFT(#REF!,7)=\"Receita\",\"\",#REF!))","v":{"$error":"#REF!"}},{"$f":"IF(LEFT(A17,7)=\"Despesa\",\"\",IF(LEFT(A17,7)=\"Receita\",\"\",IF(A17=\"\",\"\",#REF!)))","v":{"$error":"#REF!"}},{"$f":"IFERROR(IFERROR(IFERROR(INDEX(BP!B:H,MATCH(B17,BP!C:C,0),6),INDEX(BP!B:H,MATCH(B17,BP!D:D,0),6)),INDEX(BP!B:H,MATCH(B17,BP!E:E,0),6)),\"\")","v":""},{"$f":"IFERROR(IFERROR(IFERROR(INDEX(BP!B:H,MATCH(B17,BP!C:C,0),7),INDEX(BP!B:H,MATCH(B17,BP!D:D,0),7)),INDEX(BP!B:H,MATCH(B17,BP!E:E,0),7)),\"\")","v":""},{"$error":"#REF!"},{"$error":"#REF!"},{"$error":"#REF!"},null,"Aumento em","Adiantamentos e Créditos a Receber",-115969161.29999998,-98761408.399999991]
[{"$f":"IF(LEFT(#REF!,7)=\"Despesa\",\"\",IF(LEFT(#REF!,7)=\"Receita\",\"\",#REF!))","v":{"$error":"#REF!"}},{"$f":"IF(LEFT(A18,7)=\"Despesa\",\"\",IF(LEFT(A18,7)=\"Receita\",\"\",IF(A18=\"\",\"\",#REF!)))","v":{"$error":"#REF!"}},{"$f":"IFERROR(IFERROR(IFERROR(INDEX(BP!B:H,MATCH(B18,BP!C:C,0),6),INDEX(BP!B:H,MATCH(B18,BP!D:D,0),6)),INDEX(BP!B:H,MATCH(B18,BP!E:E,0),6)),\"\")","v":""},{"$f":"IFERROR(IFERROR(IFERROR(INDEX(BP!B:H,MATCH(B18,BP!C:C,0),7),INDEX(BP!B:H,MATCH(B18,BP!D:D,0),7)),INDEX(BP!B:H,MATCH(B18,BP!E:E,0),7)),\"\")","v":""},{"$error":"#REF!"},{"$error":"#REF!"},{"$error":"#REF!"},null,"Aumento em","Estoques",-135191886.30000001,-17472832.5]
[{"$f":"IF(LEFT(#REF!,7)=\"Despesa\",\"\",IF(LEFT(#REF!,7)=\"Receita\",\"\",#REF!))","v":{"$error":"#REF!"}},{"$f":"IF(LEFT(A19,7)=\"Despesa\",\"\",IF(LEFT(A19,7)=\"Receita\",\"\",IF(A19=\"\",\"\",#REF!)))","v":{"$error":"#REF!"}},{"$f":"IFERROR(IFERROR(IFERROR(INDEX(BP!B:H,MATCH(B19,BP!C:C,0),6),INDEX(BP!B:H,MATCH(B19,BP!D:D,0),6)),INDEX(BP!B:H,MATCH(B19,BP!E:E,0),6)),\"\")","v":""},{"$f":"IFERROR(IFERROR(IFERROR(INDEX(BP!B:H,MATCH(B19,BP!C:C,0),7),INDEX(BP!B:H,MATCH(B19,BP!D:D,0),7)),INDEX(BP!B:H,MATCH(B19,BP!E:E,0),7)),\"\")","v":""},{"$error":"#REF!"},{"$error":"#REF!"},{"$error":"#REF!"},null,"Aumento em","Outras Despesas Antecipadas",-9067.11,0]
[{"$f":"IF(LEFT(#REF!,7)=\"Despesa\",\"\",IF(LEFT(#REF!,7)=\"Receita\",\"\",#REF!))","v":{"$error":"#REF!"}},{"$f":"IF(LEFT(A20,7)=\"Despesa\",\"\",IF(LEFT(A20,7)=\"Receita\",\"\",IF(A20=\"\",\"\",#REF!)))","v":{"$error":"#REF!"}},{"$f":"IFERROR(IFERROR(IFERROR(INDEX(BP!B:H,MATCH(B20,BP!C:C,0),6),INDEX(BP!B:H,MATCH(B20,BP!D:D,0),6)),INDEX(BP!B:H,MATCH(B20,BP!E:E,0),6)),\"\")","v":""},{"$f":"IFERROR(IFERROR(IFERROR(INDEX(BP!B:H,MATCH(B20,BP!C:C,0),7),INDEX(BP!B:H,MATCH(B20,BP!D:D,0),7)),INDEX(BP!B:H,MATCH(B20,BP!E:E,0),7)),\"\")","v":""},{"$error":"#REF!"},{"$error":"#REF!"},{"$error":"#REF!"},null,"Aumento em","Depósitos Judiciais",-5697476.8200000003,-4386273.76]
{"$rows_left_out":30}
{"sheet":"DVA","index":3,"n_rows":38,"n_cols":4,"rows_kept":38,"cut":false,"hidden":false,"merged":[[0,1,0,3],[1,2,1,3]]}
[null,"EBSERH - EMPRESA BRASILEIRA DE SERVIÇOS HOSPITALARES"]
[null,"Demonstração Valor Adicionado ","30 de Setembro de 2020"]
[null,"Em reais ",null,"Reapresentação"]
[null,"Descrição","01.01.2020 \na                            30.09.2020","01.01.2019                               a                       30.09.2019"]
[null,"Geração de Valor Adicionado"]
[null,"1 - Receitas",79751430.969999999,16248064.57]
[null,"1.1 - Atividades Operacionais",79751430.969999999,16248064.57]
[null,"1.1.1 - Receita de Serviços e Exploração",79751430.969999999,16248064.57]
[null,"2 - Insumos Adquiridos de Terceiros",1366049152.1300004,747431975.89999986]
[null,"2.1 - Materiais de Consumo",598972579.66000009,275185079.5]
[null,"2.2 - Energia elétrica, Água e Esgoto, Gás",56075992.080000006,37664244.390000001]
[null,"2.3 - Serviços de Terceiros",693289722.57000017,427727012.47999996]
[null,"2.4 - Contigências para Riscos Cíveis",17710857.82,6855639.5300000003]
[null,"3 - Valor Adicionado Bruto (1-2)",-1286297721.1600003,-731183911.3299998]
[null,"4 - Depreciação, Amortização, Impairment e Perdas",25636644.910000004,17228020.099999998]
[null,"4.1 - Depreciação do Período",19452489.120000001,14951331.029999999]
[null,"4.2 - Amortização do Período",4167043.26,2276689.0699999998]
[null,"4.3 - Redução a Valor Recuperável - Impairment",0,0]
[null,"4.4 - Perdas Involuntárias e Desfazimentos",2017112.53,0]
[null,"5 - Valor Adicionado Líquido (3-4)",-1311934366.0700004,-748411931.42999983]
{"$rows_left_out":19}
{"sheet":"DMPL","index":4,"n_rows":23,"n_cols":6,"rows_kept":23,"cut":false,"hidden":false,"merged":[[2,17,2,18],[1,4,1,5],[0,1,0,5],[13,1,14,1],[13,2,14,2],[13,3,14,3],[13,4,14,4],[13,5,14,5],[12,1,12,5],[3,1,4,1],[3,2,4,2],[3,3,4,3],[3,4,4,4],[3,5,4,5]]}
[null,"EBSERH - EMPRESA BRASILEIRA DE SERVIÇOS HOSPITALARES"]
[null,"Demonstração Consolidada das Mutações do Patrimônio Líquido ",null,null,"30 de Setembro de 2020"]
[null,"Em reais"]
[null,"Componentes ","Capital Social Integralizado","Reservas de Capital - AFAC","Resultados Acumulados","Patrimônio Líquido "]
[]
[null,"Saldos Iniciais (31/12/2018)",5000000,94321337.019999996,-339361890,-240040552.98000002]
[null,"Resultado Líquido do Exercício",null,null,-3986134.519999628,-3986134.519999628]
[null,"Adiantamento Fut Aume Cap - AFAC"]
[null,"Compensação do Prejuízo",null,null,null,0]
[null,"Ajustes de Exercicios Anteriores",null,null,-3464496.3900000006,-3464496.3900000006]
[null,"Saldos Finais em 30/09/2019",5000000,94321337.019999996,-346812520.90999961,-247491183.88999963]
[]
[]
[null,"Componentes ","Capital Social Integralizado","Reservas de Capital - AFAC","Resultados Acumulados","Patrimônio Líquido"]
[]
[null,"Saldos Iniciais (31/12/2019)",5000000,219135056.91999999,-512557193.8657369,-288422136.94573689]
[null,"Resultado Líquido do Exercício",null,null,-13463813.489997864]
[null,"Adiantamento Fut Aume Cap - AFAC",null,67050000]
[null,"Compensação do Prejuízo"]
[null,"Ajustes de Exercicios Anteriores",null,null,-3324953.8599999906]
{"$rows_left_out":4}
{"sheet":"--","index":5,"n_rows":192,"n_cols":4,"rows_kept":192,"cut":false,"hidden":true,"merged":[]}
["1 - Receitas",null,"Grupo Dva","Subgrupo DVA"]
["1.1 - Atividades operacionais",null,"1.1 - Atividades operacionais","1.1 - Atividades operacionais"]
["Relatório Financeiro PF",null,"Relatório Financeiro PF","Relatório Financeiro PF"]
["2 - Insumos Adquiridos de Terceiros",null,"2 - Insumos Adquiridos de Terceiros","2 - Insumos Adquiridos de Terceiros"]
["2.1 - Materiais de Consumo",null,"2 - Insumos Adquiridos de Terceiros","2.1 - Materiais de Consumo"]
["3.3.1.1.1.01.00",{"$f":"VLOOKUP(A6,#REF!,2,0)","v":{"$error":"#REF!"}},"2 - Insumos Adquiridos de Terceiros","2.1 - Materiais de Consumo"]
["3.3.1.1.1.02.00",{"$f":"VLOOKUP(A7,#REF!,2,0)","v":{"$error":"#REF!"}},"2 - Insumos Adquiridos de Terceiros","2.1 - Materiais de Consumo"]
["3.3.1.1.1.03.00",{"$f":"VLOOKUP(A8,#REF!,2,0)","v":{"$error":"#REF!"}},"2 - Insumos Adquiridos de Terceiros","2.1 - Materiais de Consumo"]
["3.3.1.1.1.04.00",{"$f":"VLOOKUP(A9,#REF!,2,0)","v":{"$error":"#REF!"}},"2 - Insumos Adquiridos de Terceiros","2.1 - Materiais de Consumo"]
["3.3.1.1.1.05.00",{"$f":"VLOOKUP(A10,#REF!,2,0)","v":{"$error":"#REF!"}},"2 - Insumos Adquiridos de Terceiros","2.1 - Materiais de Consumo"]
["3.3.1.1.1.06.00",{"$f":"VLOOKUP(A11,#REF!,2,0)","v":{"$error":"#REF!"}},"2 - Insumos Adquiridos de Terceiros","2.1 - Materiais de Consumo"]
["3.3.1.1.1.07.00",{"$f":"VLOOKUP(A12,#REF!,2,0)","v":{"$error":"#REF!"}},"2 - Insumos Adquiridos de Terceiros","2.1 - Materiais de Consumo"]
["3.3.1.1.1.08.00",{"$f":"VLOOKUP(A13,#REF!,2,0)","v":{"$error":"#REF!"}},"2 - Insumos Adquiridos de Terceiros","2.1 - Materiais de Consumo"]
["3.3.1.1.1.09.00",{"$f":"VLOOKUP(A14,#REF!,2,0)","v":{"$error":"#REF!"}},"2 - Insumos Adquiridos de Terceiros","2.1 - Materiais de Consumo"]
["3.3.1.1.1.99.00",{"$f":"VLOOKUP(A15,#REF!,2,0)","v":{"$error":"#REF!"}},"2 - Insumos Adquiridos de Terceiros","2.1 - Materiais de Consumo"]
["3.6.3.3.1.01.00",{"$f":"VLOOKUP(A16,#REF!,2,0)","v":{"$error":"#REF!"}},"2 - Insumos Adquiridos de Terceiros","2.1 - Materiais de Consumo"]
["2.2 - Energia elétrica, Água e Esgoto, Gás",null,"2 - Insumos Adquiridos de Terceiros","2.2 - Energia elétrica, Água e Esgoto, Gás"]
["3.3.2.3.2.08.00",{"$f":"VLOOKUP(A18,#REF!,2,0)","v":{"$error":"#REF!"}},"2 - Insumos Adquiridos de Terceiros","2.2 - Energia elétrica, Água e Esgoto, Gás"]
["3.3.2.3.4.08.00",{"$f":"VLOOKUP(A19,#REF!,2,0)","v":{"$error":"#REF!"}},"2 - Insumos Adquiridos de Terceiros","2.2 - Energia elétrica, Água e Esgoto, Gás"]
["3.3.2.3.1.08.00",{"$f":"VLOOKUP(A20,#REF!,2,0)","v":{"$error":"#REF!"}},"2 - Insumos Adquiridos de Terceiros","2.2 - Energia elétrica, Água e Esgoto, Gás"]
{"$rows_left_out":172}