{"text_format":"1","workbook":"xlsx","n_sheets":5,"sheets":["Lista de Tabelas","1. Histórico de Produção","2. Dados de Produção","3. Ranking","4. Pandemia_Covid-19"],"not_rendered":{"charts":0,"images":1,"macros":1,"external_links":1,"defined_names":0,"comments":0,"pivot_tables":0},"unopened":[],"bounds":{"document_bytes":16777216,"sheet_cells":100000,"rows_first":2000,"rows_last":500,"rows_between":2000,"halvings":0,"cell_chars":16384,"cell_head_chars":4096},"cells_cut":0,"cells_raw":0,"read":"whole","date_system":"1900"}

{"sheet":"Lista de Tabelas","index":0,"n_rows":42,"n_cols":8,"rows_kept":42,"cut":false,"hidden":false,"merged":[]}
[]
[]
[]
[]
[]
[]
[]
[""]
[]
[]
[]
[]
[]
[]
[]
[]
[]
[]
[]
[]
[]
[]
[]
[]
[]
[]
[]
[]
[]
[]
[]
[]
[]
[]
[]
[]
[]
[]
[]
[]
[]
[null,null,null,null,"4. EFEITOS DA PANDEMIA/COVID-21","4. EFEITOS DA PANDEMIA/COVID-22","4. EFEITOS DA PANDEMIA/COVID-23","4. EFEITOS DA PANDEMIA/COVID-24"]

{"sheet":"1. Histórico de Produção","index":1,"n_rows":45,"n_cols":15,"rows_kept":45,"cut":false,"hidden":false,"merged":[[21,1,21,14],[38,1,39,14],[5,1,5,14]]}
[]
[null,"1. HISTÓRICO DA PRODUÇÃO NACIONAL"]
[]
[]
[]
[null,"Tabela 1. Histórico de produção de petróleo – óleo e condensado (Mbbl/d)"]
[]
[null,null,"04/2019","05/2019","06/2019","07/2019","08/2019","09/2019","10/2019","11/2019","12/2019","01/2020","02/2020","03/2020","04/2020"]
[null,"Óleo",2591.6598314924399,2718.8742589949702,2545.48592517207,2762.3678568588398,2977.2372416599301,2915.3913044333199,2952.1997505700901,3078.7528596994998,3095.0602741378598,3156.2553179798401,2959.9202597162198,2962.9604393079399,2948.31033924445]
[null,"Condensado",12.242423979875699,12.095033995707499,11.946197886762,12.3342282712185,12.192971139981699,11.883360950970999,11.695286131585,11.7150227530423,11.5383029110117,12.1521975298445,11.7569460209877,10.4251095153462,10.053946004080499]
[null,"Petróleo",2603.9022554723201,2730.9692929906801,2557.4321230588398,2774.7020851300599,2989.4302127999099,2927.2746653842901,2963.8950367016701,3090.4678824525399,3106.5985770488701,3168.4075155096898,2971.67720573721,2973.3855488232798,2958.36428524853]
[]
[]
[null,"Tabela 2. Histórico de produção de gás natural – GASA e GASN (MMm³/d)"]
[]
[null,null,"04/2019","05/2019","06/2019","07/2019","08/2019","09/2019","10/2019","11/2019","12/2019","01/2020","02/2020","03/2020","04/2020"]
[null,"GASA",94.033607283999999,98.511129965806404,92.040305930333304,100.704296007097,107.599664166129,102.903797009333,106.116400765484,110.587249003667,111.927529607097,111.606382977419,105.872977705517,106.97996705322601,110.560868492667]
[null,"GASN",18.894523032999999,19.4282871616129,19.111857668999999,23.452390829032201,25.723139259032301,25.952551918333299,25.478259905161298,26.009605332333301,25.851482608709698,27.146490074516102,23.062257192069001,14.7693720470968,13.444934752]
[null,"Gás Total",112.928130317,117.93941712741901,111.15216359933299,124.156686836129,133.322803425161,128.856348927667,131.594660670645,136.59685433600001,137.77901221580601,138.75287305193501,128.93523489758601,121.749339100323,124.00580324466701]
[]
[]
[null,"Tabela 3. Histórico da movimentação da gás natural (Mm³/d)"]
[]
[null,"Período","Consumo Interno","Queima","Disponível","Injeção","Produção"]
[null,"04/19",12896.915365999999,6040.9068550000002,55334.791292666698,38655.516806666703,112928.130320333]
[null,"05/19",13315.131511612901,4905.8661080645197,58276.358307741903,41442.061203871002,117939.41713129]
[null,"06/19",13104.238265333301,4051.00289433333,54753.025919666703,39243.8965243333,111152.163603667]
[null,"07/19",13767.604833548399,3469.9381019354801,61728.871861935499,45190.272042903198,124156.686840323]
[null,"08/19",14393.587770967701,3323.2558190322602,65534.581229677402,50071.37861,133322.80342967701]
[null,"09/19",14287.933495666701,3275.474287,67163.302139333304,44129.639009333303,128856.34893133301]
[null,"10/19",14284.623305483899,3507.72561419355,66688.775187419393,47113.536567419404,131594.660674516]
[null,"11/19",14345.488343666701,3432.3651483333301,66420.349403666696,52398.651444666699,136596.854340333]
[null,"12/19",14347.483688709701,3679.25316225806,65605.895499032296,54146.412942580602,137779.045292581]
[null,"01/20",14640.6637596774,4033.68644483871,67943.574161290293,52082.822843548398,138700.747209355]
[null,"02/20",14164.818576551699,3643.9892717241401,61364.6023406897,49761.824714482798,128935.234903448]
[null,"03/20",14380.2607874194,3398.0656980645199,47959,56012,121749.339103226]
[null,"2020-04-01",14339.3594793333,2723.6130063333298,50600.745385000002,56342.537527666696,124006.255398333]
[]
[null,"Tabela 4. Histórico de produção de petróleo e gás natural (Mboe/d)"]
[]
[]
[null,null,"04/19","05/19","06/19","07/19","08/19","09/19","10/19","11/19","12/19","01/20","02/20","03/20","04/20"]
[null,"Mar",46364.7033713333,49364.845831612904,43928.537259999997,46958.301902258099,50022.776581935497,50694.940713999997,49800.450652580599,48779.3551526667,48704.694672903199,50051.128851612899,46976.564592758601,38959.710516129002,41382.389392999998]
[null,"Terra",8970.0879213333301,8911.5124761290299,10824.4886596667,14770.569959677399,15511.804647741899,16468.3614253333,16888.324534838699,17640.994251,16901.200826128999,17892.445309677401,14388.037747930999,8971.8033167741905,9218.3559920000007]
[null,"Total",55334.791292666698,58276.358307741903,54753.025919666703,61728.871861935499,65534.581229677402,67163.302139333304,66688.775187419393,66420.349403666696,65605.895499032296,67943.574161290293,61364.6023406897,47931.513832903198,50600.745385000002]

{"sheet":"2. Dados de Produção","index":2,"n_rows":288,"n_cols":11,"rows_kept":288,"cut":false,"hidden":false,"merged":[[146,1,147,1],[146,2,146,3],[146,4,146,5],[146,6,146,7]]}
[]
[null,"2. DADOS DE PRODUÇÃO - DISTRIBUIÇÃO "]
[]
[]
[]
[null,"Tabela 5. Distribuição da produção de petróleo e gás natural por estado"]
[]
[null,"Estado","Petróleo (bbl/d)","Gás Natural (Mm³/d)","Produção Total (boe/d)","Nº Campos produtores"]
[null,"Rio De Janeiro",2394861.5387440599,84389.683856999996,2925656.6161646601,37]
[null,"São Paulo",257665.12304479399,17408.735632333301,367162.76251239999,8]
[null,"Espírito Santo",214642.772110363,4368.1079946666696,242117.34145629799,39]
[null,"Amazonas",16741.629209066701,14238.358261666701,106298.19738688,8]
[null,"Rio Grande Do Norte",32991.580160905098,606.73582099999999,36807.833195189101,74]
[null,"Bahia",25473.847243066801,1675.2962056666699,36011.142070431102,75]
[null,"Sergipe",12607.1119523177,386.49298099999999,15038.0793691413,13]
[null,"Alagoas",2592.9597981875499,872.82422266666697,8082.8583221585704,11]
[null,"Ceará",782.00327156599803,0.98834733333333302,788.21978850667097,2]
[null,"Maranhão",5.7197142012200004,58.579921333333303,374.176289202833,5]
[null,"Total Geral",2958364.2852485301,124005.803244667,3738337.2265548701,272]
[null,"Tabela 6. Distribuição da produção de petróleo e gás natural por bacia"]
[]
[null,"Bacia","Petróleo (bbl/d)","Gás Natural (Mm³/d)","Produção Total (boe/d)","Nº Campos produtores"]
[null,"Santos",2006785.5018917001,89962.8862073333,2572634.9631874501,18]
[null,"Campos",839976.85399923299,15940.805699,940241.49309285998,30]
[null,"Solimões",16734.056277826701,14222.952728333299,106193.726578025,7]
[null,"Potiguar",33773.583432471103,607.72416833333295,37596.052983695801,76]
[null,"Recôncavo",25471.2013296601,1638.2384216666701,35775.4097366434,69]
[null,"Espírito Santo",20407.078008286499,262.83557766666701,22060.263853050099,36]
[null,"Sergipe",12607.1119523177,386.49298099999999,15038.0793691413,13]
[null,"Alagoas",2592.9597981875499,872.82422266666697,8082.8583221585704,11]
[null,"Parnaíba",5.7197142012200004,58.579921333333303,374.176289202833,5]
[null,"Tucano Sul",2.6459134066666699,31.7661506666667,202.44896553137301,5]
[null,"Amazonas",7.57293124,15.405533333333301,104.470808855333,1]
[null,"Camamu",0,5.2916333333333299,33.283368256333297,1]
[null,"Total Geral",2958364.2852485301,124005.803244667,3738337.2265548701,272]
[]
[null,"Tabela 7. Distribuição da produção de petróleo e gás natural por operador"]
[]
[null,"Nº","Operador","Petróleo (bbl/d)","Gás Natural (Mm³/d)","Produção Total (boe/d)"]
[null,1,"Petrobras",2783112.2129195598,121634.260349,3548168.60000531]
[null,2,"Shell Brasil",54373.357139668296,585.88027866666698,58058.432775228699]
[null,3,"Total E&P do Brasil",28712.647193466699,886.28905199999997,34287.236935626803]
[null,4,"Enauta Energia S.A.",29647.700831083301,221.26996666666699,31039.446880123]
[null,5,"Petro Rio Jaguar",19076.809228906699,256.13560000000001,20687.8534871427]
[null,6,"Equinor Brasil",12481.752653003299,18.773,12599.8312561333]
[null,7,"Petro Rio O&G",10628.8002349164,35.806165999999997,10854.014215884899]
[null,8,"Potiguar E&P S.A.",4775.1491904956602,154.31557933333301,5745.7648645422496]
[null,9,"Dommo Energia",5447.0446437167902,15.137326,5542.2555481648496]
[null,10,"Perenco Brasil",4012.8584832839301,18.6653016666667,4130.2596843599504]
[null,11,"Maha Energy",2845.0360753674499,50.179190666666699,3160.6536506145599]
[null,12,"SHB",1563.79069152902,13.3477036666667,1647.7452115286601]
[null,13,"Eneva",13.292645441219999,73.985454666666698,478.64709805816699]
[null,14,"Petrosynergy",367.44762448290999,6.7743643333333301,410.05708901035302]
[null,15,"Nova Petróleo",249.481487348917,2.1690079999999998,263.12413555739698]
[null,16,"Geopark Brasil",239.26646900333299,1.5216133333333299,248.83712776346701]
[null,17,"Imetame",151.91171126335001,11.03243,221.30359980164999]
[null,18,"Partex Brasil",192.925245526667,0.27605400000000002,194.66157273640701]
[null,19,"Petrogal Brasil",159.13704873332,2.3240673333333302,173.75499068719299]
[null,20,"Recôncavo E&P",146.84819407000001,1.0554206666666699,153.486589533407]
[null,21,"Phoenix Óleo & Gás",61.737001073999998,5.2978186666666698,95.059273901786696]
[null,22,"Petroborn",0,9.5598933333333296,60.129912686933302]
[null,23,"Santana",38.0568727936,1.19526333333333,45.574852060233297]
[null,24,"Guto & Cacal",18.953294133333301,5.9483000000000001E-2,19.3274309015633]
[null,25,"EPG Brasil",15.9907936233333,0.369416666666667,18.314354267500001]
[null,26,"Perícia",14.466563000000001,4.5999999999999999E-2,14.75589426]
[null,27,"Vipetro",6.2314866884733302,1.48576666666667E-2,6.3249385888500003]
[null,28,"Alvopetro",4.3053749449999996,5.1487999999999999E-2,4.6292246822800003]
[null,29,"Ubuntu Engenharia",3.87221669633333,6.1563333333333296E-3,3.91093886329667]
[null,30,"Nord",2.0966033333333298,3.27066666666667E-3,2.1171752052400001]
[null,31,"Leros",0.99651556433333299,1.58433333333333E-3,1.0064807199766701]
[null,32,"BGM",0.10881371300000001,8.6333333333333295E-5,0.10935673326333301]
[null,33,"Central Resources",2.09660333333333E-6,3.3333333333333298E-7,4.1932066666666702E-6]
[null,null,"Total Geral",2958364.2852485301,124005.803244667,3738337.2265548701]
[]
[null,"Tabela 8. Distribuição da produção de petróleo e gás natural por concessionário"]
[]
[null,"Nº","Concessionário","Petróleo (bbl/d)","Gás Natural (Mm³/d)","Produção Total (boe/d)"]
[null,1,"Petrobras",2162921.36570998,96147.036630333299,2767667.9581778198]
[null,2,"Shell Brasil",382621.16210384702,15880.154870333299,482504.319008819]
[null,3,"Petrogal Brasil",109975.633025053,4736.4468833333303,139766.98399631199]
[null,4,"Repsol Sinopec",62656.362973299598,2880.663462,80775.188823221804]
[null,5,"Petronas",48432.729264934598,557.751665,51940.8812649682]
[null,6,"Equinor Energy",36901.6679437208,1198.7983513333299,44441.881801920703]
[null,7,"Total E&P do Brasil",30926.837476448301,969.24627533333296,37023.212391502697]
[null,8,"Enauta Energia S.A.",14823.850415541699,113.016218333333,15534.7009557769]
[null,9,"Barra Energia",14823.850415541699,110.634983333333,15519.7234400615]
[null,10,"ONGC Campos",12513.007257720399,115.985411,13242.5334556823]
[null,11,"QPI Brasil",10659.228404724799,98.8023873333333,11280.676648597901]
[null,12,"Petro Rio O&G",10628.8002349164,35.806165999999997,10854.014215884899]
[null,13,"Petro Rio Jaguar",9870.1694046086595,132.522254333333,10703.709205137]
[null,14,"Chevron Brasil",7308.43524865973,45.837024333333297,7596.74142268177]
[null,15,"Equinor Brasil",7489.0515918020001,11.2638,7559.8987536799996]
[null,16,"Potiguar E&P S.A.",5966.2652975389701,163.79699866666701,6996.5172977225502]
[null,17,"Dommo Energia",5447.0446437167902,15.137326,5542.2555481648496]
[null,18,"CNODC Brasil",3624.31345859263,244.415910666667,5161.6430976629399]
[null,19,"CNOOC Petroleum",3624.31345859263,244.415910666667,5161.6430976629399]
[null,20,"Sinochem Petróleo",4992.70106120133,7.5091999999999999,5039.93250245333]
[null,21,"Perenco Brasil",4012.8584832839301,18.6653016666667,4130.2596843599504]
[null,22,"Frade",3483.5970556259999,46.772665666666697,3777.7882358628599]
[null,23,"Maha Energy",2658.6443175631998,48.187340666666699,2961.73353476181]
[null,24,"SHB",473.49767044663002,6.1516443333333299,512.19034449087303]
[null,25,"OP Pescada",89.246114090000006,62.336082666666698,481.32823020762697]
[null,26,"Eneva",13.292645441219999,73.985454666666698,478.64709805816699]
[null,27,"Petrosynergy",367.44762448290999,6.7743643333333301,410.05708901035302]
[null,28,"Nova Petróleo",249.481487348917,2.1690079999999998,263.12413555739698]
[null,29,"Imetame",151.91171126335001,11.03243,221.30359980164999]
[null,30,"Geopark Brasil",167.486528302333,1.5942926666666699,177.51432626005999]
[null,31,"Recôncavo E&P",146.84819407000001,1.0554206666666699,153.486589533407]
[null,32,"Partex Brasil",96.4626227633333,0.13802700000000001,97.330786368203306]
[null,33,"Phoenix Óleo & Gás",61.737001073999998,5.2978186666666698,95.059273901786696]
[null,34,"Geopar - Geosol",71.779940701000001,0.456484,74.651138329039995]
[null,34,"Petroborn",0,9.5598933333333296,60.129912686933302]
[null,34,"Santana",38.0568727936,1.19526333333333,45.574852060233297]
[null,37,"Guto & Cacal",18.953294133333301,5.9483000000000001E-2,19.3274309015633]
[null,38,"Petro-Victory",15.2066639766667,0.19373333333333301,16.425209834]
[null,39,"EPG Brasil",10.910723746666701,0.207883333333333,12.218270415499999]
[null,40,"Sonangol Guanambi",8.1259313352000007,0.108519333333333,8.8084973231933308]
[null,41,"Vipetro",6.2314866884733302,1.48576666666667E-2,6.3249385888500003]
[null,42,"Alvopetro",4.3053749449999996,5.1487999999999999E-2,4.6292246822800003]
[null,43,"Perícia",4.3399688999999997,1.38E-2,4.4267682779999999]
[null,44,"Ubuntu Engenharia",3.87221669633333,6.1563333333333296E-3,3.91093886329667]
[null,45,"Brasoil Manati",0,0.52916333333333299,3.3283368256333299]
[null,46,"Nord",2.0966033333333298,3.27066666666667E-3,2.1171752052400001]
[null,47,"Leros",0.99651556433333299,1.58433333333333E-3,1.0064807199766701]
[null,48,"BGM",0.10881371300000001,8.6333333333333295E-5,0.10935673326333301]
[null,49,"Central Resources",2.09660333333333E-6,3.3333333333333298E-7,4.1932066666666702E-6]
[null,null,"Total Geral",2958364.2852548198,124005.803246,3738337.2265695399]
[null,"Tabela 9. Movimentação de gás natural por destinação (Mm³/d)"]
[]
[null,"Bacia","Consumo Interno","Queima","Disponível","Injeção","Produção"]
[null,"Santos",6945.4515696666704,1425.816693,32663.825459,48927.792485666701,89962.8862073333]
[null,"Campos",6375.1338923333296,853.226088333333,8584.1138906666692,128.33183099999999,15940.8057023333]
[null,"Solimões",468.41563233333301,196.554599,7002.28603033333,6555.6964666666699,14222.952728333299]
[null,"Recôncavo",99.954222666666695,76.763602000000006,982.06245166666702,479.45814533333299,1638.2384216666701]
[null,"Alagoas",3.3329326666666699,17.449501333333298,851.86662200000001,0.175166666666667,872.82422266666697]
[null,"Potiguar",116.95421033333299,41.3765656666667,449.393392333333,0,607.72416833333295]
[null,"Sergipe",88.975694000000004,45.923112000000003,0.51074266666666701,251.08343233333301,386.49298099999999]
[null,"Espírito Santo",235.30872966666701,24.9918856666667,2.53496233333333,0,262.83557766666701]
[null,"Parnaíba",2.7954623333333299,23.408359000000001,32.828250333333301,0,59.032071666666702]
[null,"Tucano Sul",9.9999999999999996E-39,0.44256699999999999,31.3235836666667,0,31.7661506666667]
[null,"Amazonas",0,15.405533333333301,0,0,15.405533333333301]
[null,"Camamu",3.0371333333333301,2.2545000000000002,0,0,5.2916333333333299]
[null,"Total Geral",14339.3594793333,2723.6130063333298,50600.745385000002,56342.537527666696,124006.255398333]
[]
[null,"Tabela 10. Distribuição da produção dos campos do Pré-sal¹"]
[]
[null,"Campo","Petróleo (bbl/d)",null,"Gás natural (Mm³/d)",null,"Produção (boe/d)"]
[null,null,"Pré-sal","Pós-sal","Pré-sal","Pós-sal","Pré-sal","Pós-sal"]
[null,"Lula",1032997.5129077201,0,45681.675153999997,0,1320326.5701081001,0]
[null,"Búzios",514615.36593225697,0,19518.131945333302,0,637380.70742333401,0]
[null,"Sapinhoá",200991.827487345,0,10046.3520293333,0,264181.47294496599,0]
[null,"Jubarte",94729.542353515106,53161.680425767998,3229.3613073333299,446.33551333333298,115041.61139799299,55969.046000887101]
[null,"Sul De Lula",61758.030296861201,0,2475.1152590000002,0,77326.035004071993,0]
[null,"Berbigão",60572.373505885102,0,756.50349400000005,0,65330.636747481301,0]
[null,"Mero",36243.134594312702,0,2444.1591050000002,0,51616.430974532799,0]
[null,"Lapa",28712.647193466699,0,886.28905199999997,0,34287.236935626803,0]
[null,"Marlim Leste",6219.0676682886697,39359.3570040247,105.737569333333,565.72120633333304,6884.13688925716,42917.635904832103]
[null,"Sudoeste De Sapinhoá",4535.3595329999198,0,226.694742666667,0,5961.2263923721503,0]
[null,"Anc_Lula",4626.5991017324604,0,185.42250100000001,0,5792.8714027472697,0]
[null,"Tambuatá",3321.5292825028,0,125.977600333333,0,4113.9044528554005,0]
[null,"Noroeste De Sapinhoa",2638.1468960409002,0,131.86469366666699,0,3467.5507649124402,0]
[null,"Marlim",2264.9393612776598,77161.8184934772,63.171562333333299,992.80857966666701,2662.2764857574798,83406.3958259504]
[null,"Voador",1177.2257535374099,0,32.834072999999997,0,1383.7458342335401,0]
[null,"Nordeste De Sapinhoá",548.91719293130302,0,27.436874,0,721.48991738524296,0]
[null,"Barracuda",537.49951259524005,9105.4244701432308,12.926676666666699,198.54835966666701,618.80585276000704,10354.255928258201]
[null,"Caratinga",496.15339624175999,2212.2057451931,11.932316,61.997676333333303,571.20539674172005,2602.1593497712602]
[null,"Anc_Brava",81.935337937593303,0,2.2852600000000001,0,96.309189138193304,0]
[null,"Outros Campos",0,720295.99180247798,0,35776.520694333303,0,945323.50943090196]
[null,"Total Geral",2057067.8073074487,901296.47794108419,85963.871214999934,38041.932029666634,2597764.2241142658,1140573.0024406011]
[]
[]
[null,"Tabela 11. Produção dos poços do Pré-sal¹"]
[]
[null,"Nome ANP do Poço","Campo","Bacia","Petróleo (bbl/d)","Gás natural (Mm³/d)","Produção Total (boe/d)"]
[null,"7-BUZ-29D-RJS","Búzios/Tambuatá","Santos",51700.299680557997,1890.17030833333,63589.111787616101]
[null,"7-BUZ-12-RJS","Búzios/Tambuatá","Santos",49437.264410399002,1733.1860526666701,60338.675376322302]
[null,"7-BUZ-10-RJS","Búzios/Tambuatá","Santos",43143.353454279,1604.3584213333299,53234.463096365602]
[null,"3-BRSA-1305A-RJS","Mero","Santos",36243.134594312702,2444.1591050000002,51616.430974532799]
[null,"7-BUZ-30-RJS","Búzios/Tambuatá","Santos",38400.601056064297,1350.04886733333,46892.151922306199]
[null,"9-BUZ-3-RJS","Búzios","Santos",36980.801615783297,1392.5944973333301,45739.9564110555]
[null,"7-BUZ-14DA-RJS","Búzios/Tambuatá","Santos",34066.330304603704,1291.1058226666701,42187.140619070698]
[null,"7-BUZ-25-RJS","Búzios/Tambuatá","Santos",32578.5635967833,1253.68629733333,40464.012206613501]
[null,"7-SPH-20D-SPS","Nordeste De Sapinhoá/Noroeste De Sapinhoa/Sapinhoá","Santos",32570.566696707101,1199.248055,40113.609105526601]
[null,"7-LL-15D-RJS","Anc_Lula/Lula/Sul De Lula","Santos",30939.909590667899,1363.8165573333299,39518.056611148699]
[null,"9-BUZ-4-RJS","Búzios","Santos",32323.0849328447,1127.05018466667,39412.016454862904]
[null,"9-LL-2-RJS","Lula","Santos",27082.884460670699,1905.6314219999999,39068.944035080502]
[null,"9-BRSA-1191-RJS","Búzios","Santos",30897.531155055,1182.098761,38332.707762980397]
[null,"7-SPH-17-SPS","Nordeste De Sapinhoá/Noroeste De Sapinhoa/Sapinhoá/Sudoeste De Sapinhoá","Santos",28233.602229283701,1335.3424030000001,36632.652229097199,null,"Mar","Petrobras",24.074179333333301]
[null,"7-LL-103D-RJS","Lula","Santos",27987.181346707999,1339.9940203333299,36415.489135740798]
[null,"9-LL-20D-RJS","Lula","Santos",27487.742128563001,1406.51624866667,36334.4620945891]
[null,"7-LL-51-RJS","Lula","Santos",26812.046709693001,1509.5668663333299,36306.935481225097]
[null,"9-LL-12D-RJS","Anc_Lula","Santos",28559.225523158901,1150.5815256666699,35796.164709112301]
[null,"7-LL-36A-RJS","Lula","Santos",24497.237916820701,1605.9311520000001,34598.239735981799]
[null,"7-LL-80DB-RJS","Anc_Lula/Lula/Sul De Lula","Santos",27545.125759248502,1072.4335633333301,34290.529110238102]
[null,"7-SLL-5-RJS","Anc_Lula/Lula/Sul De Lula","Santos",27967.523587564901,940.64203999999995,33883.983297177299]
[null,"7-BBG-2D-RJS","Berbigão","Santos",31155.738099558901,412.43886199999997,33749.900178155098]
[null,"7-BUZ-24D-RJS","Búzios/Tambuatá","Santos",26854.6735907043,1055.6404130000001,33494.451216795896]
[null,"8-LL-87D-RJS","Anc_Lula","Santos",27744.116262268399,913.39764466666702,33489.213901669202]
[null,"7-LL-61-RJS","Anc_Lula/Lula/Sul De Lula","Santos",27651.0365047901,917.471360333333,33421.757041728299]
[null,"3-BRSA-1053-RJS","Búzios/Tambuatá","Santos",26731.346350789699,1030.9036676666699,33215.534548716103]
[null,"3-BRSA-1184-RJS","Búzios/Tambuatá","Santos",27054.310692481999,968.02795633333301,33143.022612506997]
[null,"7-LL-73D-RJS","Lula","Santos",24064.892311606,1371.8795176666699,32693.753820621001]
[null,"7-LL-66-RJS","Anc_Lula/Lula/Sul De Lula","Santos",26933.868179576701,883.05821033333302,32488.136541513399]
[null,"7-SLL-2-RJS","Anc_Lula/Lula/Sul De Lula","Santos",26573.975109605599,900.40047233333303,32237.3230044925]
[null,"3-BRSA-1064-RJS","Búzios/Tambuatá","Santos",25109.684473952999,1122.29279066667,32168.692891616101]
[null,"7-SPH-5-SPS","Nordeste De Sapinhoá","Santos",21354.4424729694,1694.86907833333,32014.846950561201]
[null,"9-BBG-1D-RJS","Berbigão","Santos",29416.635406326201,344.06463200000002,31580.736569326102]
[null,"7-LL-70-RJS","Anc_Lula/Lula/Sul De Lula","Santos",25378.5193502494,953.16316966666705,31373.734586450399]
[null,"3-BRSA-830-RJS","Lula","Santos",21772.6136181537,1456.6500026666699,30934.665371426501]
[null,"7-LL-28D-RJS","Anc_Lula/Lula/Sul De Lula","Santos",24587.1601938721,856.18758266666703,29972.417413204701]
[null,"4-BRSA-1047-RJS","Anc_Lula/Lula/Sul De Lula","Santos",24275.7131211741,807.846813666667,29356.916088242899]
[null,"7-LL-83D-RJS","Lula","Santos",22694.800191453302,1046.7920899999999,29278.923547056202]
[null,"7-LL-91-RJS","Anc_Lula/Lula/Sul De Lula","Santos",23887.628493802,846.27032799999995,29210.508065559701]
[null,"7-SPH-14D-SPS","Nordeste De Sapinhoá/Noroeste De Sapinhoa/Sapinhoá/Sudoeste De Sapinhoá","Santos",21044.286920504401,1292.2041953333301,29172.005790354]
[null,"7-LL-110D-RJS","Anc_Lula/Lula/Sul De Lula","Santos",23759.010043475399,786.956143666667,28708.8146654714]
[null,"3-BRSA-883-RJS","Anc_Lula/Lula/Sul De Lula","Santos",20975.250840228,1228.0738060000001,28699.601745944899]
[null,"7-LL-60D-RJS","Anc_Lula/Lula/Sul De Lula","Santos",19281.109197463698,1497.24456366667,28698.493026459899]
[null,"7-LL-59-RJS","Anc_Lula/Lula/Sul De Lula","Santos",22681.143334564102,951.44856266666704,28665.574018510499]
[null,"7-LL-113D-RJS","Anc_Lula/Lula/Sul De Lula","Santos",23813.333889159599,738.40681199999995,28457.772439345299]
[null,"9-LL-7-RJS","Anc_Lula","Santos",22579.351355787701,930.83008299999995,28434.095720141999]
[null,"8-LL-81D-RJS","Anc_Lula","Santos",20719.256621529701,1180.8188563333299,28146.382872283601]
[null,"7-LL-97-RJS","Anc_Lula/Lula/Sul De Lula","Santos",22832.391670049699,829.84813733333306,28051.978782730301]
[null,"6-BRSA-1222A-ESS","Jubarte","Campos",23142.546815773701,759.616578,27920.390764243799]
[null,"7-LL-68-RJS","Anc_Lula/Lula/Sul De Lula","Santos",22925.717572952501,774.57457366666699,27797.6444721468]
[null,"7-LL-67D-RJS","Anc_Lula/Lula/Sul De Lula","Santos",21763.062566827899,958.14276366666695,27789.5985031661]
[null,"9-BUZ-7-RJS","Búzios","Santos",22194.079948671701,868.978972,27659.792576546999]
[null,"7-SLL-3-RJS","Anc_Lula/Lula/Sul De Lula","Santos",21880.655573563301,901.81510600000001,27552.901245433099]
[null,"7-LL-22D-RJS","Anc_Lula/Lula/Sul De Lula","Santos",21963.8106482289,745.36239766666699,26651.9985106967]
[null,"3-BRSA-788-SPS","Nordeste De Sapinhoá/Noroeste De Sapinhoa/Sapinhoá/Sudoeste De Sapinhoá","Santos",21377.369442627602,821.72025966666695,26545.833749081601]
[null,"7-SPH-4D-SPS","Nordeste De Sapinhoá","Santos",21606.038206568701,762.95693733333303,26404.892380577301]
[null,"7-LL-90D-RJS","Anc_Lula/Lula/Sul De Lula","Santos",21196.958675635298,769.83696799999996,26039.086935331401]
[null,"9-BRSA-928-SPS","Nordeste De Sapinhoá","Santos",19056.1282875014,1039.84444933333,25596.5523033627]
[null,"3-BRSA-854-RJS","Anc_Lula/Lula/Sul De Lula","Santos",20653.7128198799,690.85152766666704,24999.037667113]
[null,"7-LL-95D-RJS","Anc_Lula/Lula/Sul De Lula","Santos",20208.945890313498,646.27159200000006,24273.871412391101]
[null,"7-LL-102D-RJS","Anc_Lula/Lula/Sul De Lula","Santos",19276.0117048133,784.99790733333305,24213.499392337599]
[null,"9-BUZ-1-RJS","Búzios","Santos",19464.617108832001,732.55507699999998,24072.249357697401]
[null,"7-LL-100-RJS","Anc_Lula/Lula/Sul De Lula","Santos",18943.095852172199,759.72897633333298,23721.646764803299]
[null,"7-LL-79D-RJS","Anc_Lula/Lula/Sul De Lula","Santos",19408.223309739398,667.05181400000004,23603.852479954799]
[null,"7-LL-34D-RJS","Anc_Lula/Lula/Sul De Lula","Santos",19254.3632312882,663.12680599999999,23425.304846935102]
[null,"3-BRSA-496-RJS","Anc_Lula/Lula/Sul De Lula","Santos",17377.2782442114,901.027598333333,23044.570642484399]
[null,"4-BRSA-711-RJS","Lula","Santos",16158.9776915647,1003.70041766667,22472.0626156086]
[null,"7-SPH-7D-SPS","Nordeste De Sapinhoá","Santos",17987.966753323501,648.79366466666704,22068.7556332805]
[null,"7-LL-63D-RJS","Anc_Lula/Lula/Sul De Lula","Santos",16230.351314732899,923.76695433333305,22040.669941768199]
[null,"7-LL-46-RJS","Anc_Lula/Lula/Sul De Lula","Santos",15636.314614246499,763.32643766666695,20437.492875146701]
[null,"7-SPH-3-SPS","Nordeste De Sapinhoá","Santos",12472.078065616,1238.9331010000001,20264.731873616802]
[null,"7-LL-27-RJS","Lula","Santos",15185.517845107001,743.08719366666696,19859.395106703501]
[null,"7-BUZ-17-RJS","Búzios/Tambuatá","Santos",14648.422163473,801.59720066666705,19690.316252198201]
[null,"7-BFR-7-ESS","Jubarte","Campos",15449.27033478,536.52036033333297,18823.881462408201]
[null,"3-BRSA-861-SPS","Lapa","Santos",14622.75156192,483.71664433333302,17665.237348614199]
[null,"8-LPA-2D-SPS","Lapa","Santos",14089.8956315467,402.572407666667,16621.999587012499]
[null,"7-SPH-6-SPS","Nordeste De Sapinhoá","Santos",12379.694076436899,375.757160666667,14743.1352231698]
[null,"9-BRSA-908D-RJS","Anc_Lula","Santos",10059.283920525,641.26260466666702,14092.703863983401]
[null,"7-JUB-58DPA-ESS","Jubarte","Campos",10754.868754337,365.30597899999998,13052.573954111]
[null,"7-LL-17D-RJS","Anc_Lula/Lula/Sul De Lula","Santos",10627.6678426833,352.179687,12842.8111597728]
[null,"3-BRSA-821-RJS","Anc_Lula/Lula/Sul De Lula","Santos",9589.2321497426692,516.22907499999997,12836.214947968399]
[null,"7-LL-58-RJS","Anc_Lula/Lula/Sul De Lula","Santos",10364.277641873099,388.223655333333,12806.1306714252]
[null,"7-LL-31D-RJS","Lula","Santos",8950.3931305296701,447.46420799999999,11764.8579806501]
[null,"7-LL-11-RJS","Anc_Lula/Lula/Sul De Lula","Santos",9175.2511082521305,337.09176366666702,11295.4942542804]
[null,"7-BAZ-10DA-ESS","Jubarte","Campos",8523.6932587709998,248.86842300000001,10089.028354440599]
[null,"7-LL-45D-RJS","Lula","Santos",6583.7776886113297,322.24755866666698,8610.6536055885208]
[null,"7-LL-85-RJS","Anc_Lula/Lula/Sul De Lula","Santos",5937.0848100844896,394.74818900000002,8419.9759167385801]
[null,"7-BUZ-31D-RJS","Búzios/Tambuatá","Santos",6351.9306794840004,239.81425566666701,7860.3167829187596]
[null,"8-LL-37D-RJS","Lula","Santos",5517.4838107793303,321.91947499999998,7542.2961438290804]
[null,"7-BFR-12PA-ESS","Jubarte","Campos",5930.1563579363301,235.31431833333301,7410.2387105325197]
[null,"7-LL-8H-RJS","Anc_Lula/Lula/Sul De Lula","Santos",5780.9526446975597,225.91257066666699,7201.8997908024603]
[null,"7-BAZ-4-ESS","Jubarte","Campos",5812.4081794916701,196.68102766666701,7049.4944741197396]
[null,"7-JUB-57DPA-ESS","Jubarte","Campos",5577.8594873089996,215.00473600000001,6930.1984258491602]
[null,"7-LL-114D-RJS","Lula","Santos",4912.4986455896696,208.68663000000001,6225.09789782997]
[null,"8-JUB-39-ESS","Jubarte","Campos",4674.0173545346697,184.632563333333,5835.3210977142999]
[null,"6-BRSA-639-ESS","Jubarte","Campos",4500.5672477110002,145.61856,5416.4803225845999]
[null,"6-BRSA-631DB-ESS","Jubarte","Campos",3454.5622003356698,121.123715,4216.4073541798198]
[null,"6-BRSA-770D-RJS","Anc_Brava/Marlim/Voador","Campos",3524.1004527526702,98.290895333333296,4142.3315091292197]
[null,"7-MLL-72-RJS","Marlim Leste","Campos",3169.2482419826702,48.119784000000003,3471.9125405837099]
[null,"7-LL-3D-RJS","Anc_Lula/Lula/Sul De Lula","Santos",2735.72563091251,97.672061333333303,3350.0643390075202]
[null,"7-BAZ-8-ESS","Jubarte","Campos",2662.6958777086702,86.441061000000005,3206.3937275970802]
[null,"7-JUB-44-ESS","Jubarte","Campos",2331.9384614263299,75.435278666666704,2806.41203153672]
[null,"7-MLL-78D-RJS","Marlim Leste","Campos",2223.7363276186702,31.2001873333333,2419.9795779097399]
[null,"7-JUB-55-ESS","Jubarte","Campos",1189.9976677053301,33.392020000000002,1400.0271290215301]
[null,"3-BRSA-1017D-RJS","Marlim Leste","Campos",826.08309868733295,26.417598000000002,992.24477076371295]
[null,"7-BR-69DA-RJS","Barracuda/Caratinga","Campos",791.86422602366702,16.847640999999999,897.83268686187705]
[null,"7-BAZ-9HA-ESS","Jubarte","Campos",724.96035569499998,25.406687000000002,884.76358965447002]
[null,"7-SPH-2D-SPS","Nordeste De Sapinhoá","Santos",626.99753986555004,22.504104999999999,768.54408453559995]
[null,"7-CRT-49-RJS","Barracuda/Caratinga","Campos",241.788682813333,8.0113516666666698,292.17856263984999]
[null,"7-SPH-1-SPS","Nordeste De Sapinhoá/Noroeste De Sapinhoa/Sapinhoá/Sudoeste De Sapinhoá","Santos",5.0804179128199998,0.17493033333333299,6.18069647272333]
[null,"7-LL-69-RJS","Anc_Lula/Lula/Sul De Lula","Santos",0.83736240529999995,2.8001000000000002E-2,1.0134833751100001]
[null,"7-LL-84D-RJS","Anc_Lula/Lula/Sul De Lula","Santos",0.58745148117333301,1.9272333333333301E-2,0.70867079609666705]
[null,"7-LL-48D-RJS","Anc_Lula/Lula/Sul De Lula","Santos",4.360096292E-2,1.5759999999999999E-3,5.3513703480000001E-2]
[null,"Total Geral",null,null,2057067.8073074478,85963.871215000021,2597764.2241142658]

{"sheet":"3. Ranking","index":3,"n_rows":273,"n_cols":7,"rows_kept":273,"cut":false,"hidden":false,"merged":[]}
[]
[null,"3. RANKING"]
[]
[]
[]
[null,"Tabela 12. Os 30 poços com maior produção de petróleo (bbl/d)"]
[]
[null,"Nº","Nome ANP do Poço","Campo","Bacia","Localização","Petróleo (bbl/d)"]
[null,1,"7-BUZ-29D-RJS","Búzios/Tambuatá","Santos","Mar",51700.299680557997]
[null,2,"7-BUZ-12-RJS","Búzios/Tambuatá","Santos","Mar",49437.264410399002]
[null,3,"7-BUZ-10-RJS","Berbigão","Santos","Mar",43143.353454279]
[null,4,"7-BUZ-30-RJS","Búzios/Tambuatá","Santos","Mar",38400.601056064297]
[null,5,"9-BUZ-3-RJS","Búzios/Tambuatá","Santos","Mar",36980.801615783297]
[null,6,"3-BRSA-1305A-RJS","Mero","Santos","Mar",36243.134594312702]
[null,7,"7-BUZ-14DA-RJS","Búzios/Tambuatá","Santos","Mar",34066.330304603704]
[null,8,"7-BUZ-25-RJS","Búzios/Tambuatá","Santos","Mar",32578.5635967833]
[null,9,"7-SPH-20D-SPS","Nordeste De Sapinhoá/Noroeste De Sapinhoa/Sapinhoá/Sudoeste De Sapinhoá","Santos","Mar",32570.566696707101]
[null,10,"9-BUZ-4-RJS","Búzios/Tambuatá","Santos","Mar",32323.0849328447]
[null,11,"7-BBG-2D-RJS","Berbigão","Santos","Mar",31155.738099558901]
[null,12,"7-LL-15D-RJS","Anc_Lula/Lula/Sul De Lula","Santos","Mar",30939.909590667899]
[null,13,"9-BRSA-1191-RJS","Búzios/Tambuatá","Santos","Mar",30897.531155055]
[null,14,"9-BBG-1D-RJS","Berbigão","Santos","Mar",29416.635406326201]
[null,15,"9-LL-12D-RJS","Anc_Lula/Lula/Sul De Lula","Santos","Mar",28559.225523158901]
[null,16,"7-SPH-17-SPS","Nordeste De Sapinhoá/Noroeste De Sapinhoa/Sapinhoá/Sudoeste De Sapinhoá","Santos","Mar",28233.602229283701]
[null,17,"7-LL-103D-RJS","Lula","Santos","Mar",27987.181346707999]
[null,18,"7-SLL-5-RJS","Anc_Lula/Lula/Sul De Lula","Santos","Mar",27967.523587564901]
[null,19,"8-LL-87D-RJS","Anc_Lula/Lula/Sul De Lula","Santos","Mar",27744.116262268399]
[null,20,"7-LL-61-RJS","Anc_Lula/Lula/Sul De Lula","Santos","Mar",27651.0365047901]
[null,21,"7-LL-80DB-RJS","Anc_Lula/Lula/Sul De Lula","Santos","Mar",27545.125759248502]
[null,22,"9-LL-20D-RJS","Lula","Santos","Mar",27487.742128563001]
[null,23,"9-LL-2-RJS","Lula","Santos","Mar",27082.884460670699]
[null,24,"3-BRSA-1184-RJS","Búzios/Tambuatá","Santos","Mar",27054.310692481999]
[null,25,"7-LL-66-RJS","Anc_Lula/Lula/Sul De Lula","Santos","Mar",26933.868179576701]
[null,26,"7-BUZ-24D-RJS","Búzios/Tambuatá","Santos","Mar",26854.6735907043]
[null,27,"7-LL-51-RJS","Lula","Santos","Mar",26812.046709693001]
[null,28,"3-BRSA-1053-RJS","Búzios/Tambuatá","Santos","Mar",26731.346350789699]
[null,29,"7-SLL-2-RJS","Anc_Lula/Lula/Sul De Lula","Santos","Mar",26573.975109605599]
[null,30,"7-LL-70-RJS","Anc_Lula/Lula/Sul De Lula","Santos","Mar",25378.519350249298]
[]
[]
[null,"Tabela 13. Os 30 poços com maior produção de gás natural (Mm³/d)"]
[]
[null,"Nº","Nome ANP do Poço","Campo","Bacia","Localização","Gás Natural (Mm³/d)"]
[null,1,"3-BRSA-1305A-RJS","Mero","Santos","Mar",2444.1591050000002]
[null,2,"9-LL-2-RJS","Lula","Santos","Mar",1905.6314219999999]
[null,3,"7-BUZ-29D-RJS","Búzios/Tambuatá","Santos","Mar",1890.17030833333]
[null,4,"7-MXL-18HA-SPS","Mexilhão","Santos","Mar",1747.52971]
[null,5,"7-BUZ-12-RJS","Búzios/Tambuatá","Santos","Mar",1733.1860526666701]
[null,6,"7-SPH-5-SPS","Nordeste De Sapinhoá/Noroeste De Sapinhoa/Sapinhoá/Sudoeste De Sapinhoá","Santos","Mar",1694.86907833333]
[null,7,"7-LL-36A-RJS","Lula","Santos","Mar",1605.9311520000001]
[null,8,"7-BUZ-10-RJS","Búzios/Tambuatá","Santos","Mar",1604.3584213333299]
[null,9,"7-LL-51-RJS","Lula","Santos","Mar",1509.5668663333299]
[null,10,"7-LL-60D-RJS","Anc_Lula/Lula/Sul De Lula","Santos","Mar",1497.24456366667]
[null,11,"7-MXL-17HPA-SPS","Mexilhão","Santos","Mar",1488.4084210000001]
[null,12,"3-BRSA-830-RJS","Lula","Santos","Mar",1456.6500026666699]
[null,13,"9-LL-20D-RJS","Lula","Santos","Mar",1406.51624866667]
[null,14,"9-BUZ-3-RJS","Búzios/Tambuatá","Santos","Mar",1392.5944973333301]
[null,15,"7-LL-73D-RJS","Lula","Santos","Mar",1371.8795176666699]
[null,16,"7-LL-15D-RJS","Anc_Lula/Lula/Sul De Lula","Santos","Mar",1363.8165573333299]
[null,17,"7-BUZ-30-RJS","Búzios/Tambuatá","Santos","Mar",1350.04886733333]
[null,18,"7-LL-103D-RJS","Lula","Santos","Mar",1339.9940203333299]
[null,19,"7-SPH-17-SPS","Nordeste De Sapinhoá/Noroeste De Sapinhoa/Sapinhoá/Sudoeste De Sapinhoá","Santos","Mar",1335.3424030000001]
[null,20,"7-SPH-14D-SPS","Nordeste De Sapinhoá/Noroeste De Sapinhoa/Sapinhoá/Sudoeste De Sapinhoá","Santos","Mar",1292.2041953333301]
[null,21,"7-BUZ-14DA-RJS","Búzios/Tambuatá","Santos","Mar",1291.1058226666701]
[null,22,"7-RO-111HP-RJS","Roncador","Campos","Mar",1275.14766166667]
[null,23,"7-BUZ-25-RJS","Búzios/Tambuatá","Santos","Mar",1253.68629733333]
[null,24,"7-SPH-3-SPS","Nordeste De Sapinhoá/Noroeste De Sapinhoa/Sapinhoá/Sudoeste De Sapinhoá","Santos","Mar",1238.9331010000001]
[null,25,"3-BRSA-883-RJS","Anc_Lula/Lula/Sul De Lula","Santos","Mar",1228.0738060000001]
[null,26,"7-SPH-20D-SPS","Nordeste De Sapinhoá/Noroeste De Sapinhoa/Sapinhoá/Sudoeste De Sapinhoá","Santos","Mar",1199.248055]
[null,27,"9-BRSA-1191-RJS","Búzios/Tambuatá","Santos","Mar",1182.098761]
[null,28,"8-LL-81D-RJS","Anc_Lula/Lula/Sul De Lula","Santos","Mar",1180.8188563333299]
[null,29,"9-LL-12D-RJS","Anc_Lula/Lula/Sul De Lula","Santos","Mar",1150.5815256666699]
[null,30,"9-BUZ-4-RJS","Búzios/Tambuatá","Santos","Mar",1127.05018466667]
[]
[]
[null,"Tabela 14. Os 30 poços com maior produção total (boe/d)"]
[]
[null,"Nº","Nome ANP do Poço","Campo","Bacia","Localização","Produção (boe/d)"]
[null,1,"7-BUZ-29D-RJS","Búzios/Tambuatá","Santos","Mar",63589.111787616101]
[null,2,"7-BUZ-12-RJS","Búzios/Tambuatá","Santos","Mar",60338.675376322302]
[null,3,"7-BUZ-10-RJS","Búzios/Tambuatá","Santos","Mar",53234.463096365602]
[null,4,"3-BRSA-1305A-RJS","Mero","Santos","Mar",51616.430974532799]
[null,5,"7-BUZ-30-RJS","Búzios/Tambuatá","Santos","Mar",46892.151922306199]
[null,6,"9-BUZ-3-RJS","Búzios/Tambuatá","Santos","Mar",45739.9564110555]
[null,7,"7-BUZ-14DA-RJS","Búzios/Tambuatá","Santos","Mar",42187.140619070698]
[null,8,"7-BUZ-25-RJS","Búzios/Tambuatá","Santos","Mar",40464.012206613501]
[null,9,"7-SPH-20D-SPS","Nordeste De Sapinhoá/Noroeste De Sapinhoa/Sapinhoá/Sudoeste De Sapinhoá","Santos","Mar",40113.609105526601]
[null,10,"7-LL-15D-RJS","Anc_Lula/Lula/Sul De Lula","Santos","Mar",39518.056611148699]
[null,11,"9-BUZ-4-RJS","Búzios/Tambuatá","Santos","Mar",39412.016454862904]
[null,12,"9-LL-2-RJS","Lula","Santos","Mar",39068.944035080502]
[null,13,"9-BRSA-1191-RJS","Búzios/Tambuatá","Santos","Mar",38332.707762980397]
[null,14,"7-SPH-17-SPS","Nordeste De Sapinhoá/Noroeste De Sapinhoa/Sapinhoá/Sudoeste De Sapinhoá","Santos","Mar",36632.652229097199]
[null,15,"7-LL-103D-RJS","Lula","Santos","Mar",36415.489135740798]
[null,16,"9-LL-20D-RJS","Lula","Santos","Mar",36334.4620945891]
[null,17,"7-LL-51-RJS","Lula","Santos","Mar",36306.935481225097]
[null,18,"9-LL-12D-RJS","Anc_Lula/Lula/Sul De Lula","Santos","Mar",35796.164709112301]
[null,19,"7-LL-36A-RJS","Lula","Santos","Mar",34598.239735981799]
[null,20,"7-LL-80DB-RJS","Anc_Lula/Lula/Sul De Lula","Santos","Mar",34290.529110238102]
[null,21,"7-SLL-5-RJS","Anc_Lula/Lula/Sul De Lula","Santos","Mar",33883.983297177198]
[null,22,"7-BBG-2D-RJS","Berbigão","Santos","Mar",33749.900178155098]
[null,23,"7-BUZ-24D-RJS","Búzios/Tambuatá","Santos","Mar",33494.451216795896]
[null,24,"8-LL-87D-RJS","Anc_Lula/Lula/Sul De Lula","Santos","Mar",33489.213901669202]
[null,25,"7-LL-61-RJS","Anc_Lula/Lula/Sul De Lula","Santos","Mar",33421.757041728299]
[null,26,"3-BRSA-1053-RJS","Búzios/Tambuatá","Santos","Mar",33215.534548716103]
[null,27,"3-BRSA-1184-RJS","Búzios/Tambuatá","Santos","Mar",33143.022612506997]
[null,28,"7-LL-73D-RJS","Lula","Santos","Mar",32693.753820621001]
[null,29,"7-LL-66-RJS","Anc_Lula/Lula/Sul De Lula","Santos","Mar",32488.136541513399]
[null,30,"7-SLL-2-RJS","Anc_Lula/Lula/Sul De Lula","Santos","Mar",32237.3230044925]
[]
[]
[null,"Tabela 15. Os 30 poços  terrestres com maior produção de petróleo (bbl/d)"]
[]
[null,"Nº","Nome ANP do Poço","Campo","Bacia","Localização","Petróleo (bbl/d)"]
[null,1,"7-TIE-1D-BA","Tiê","Recôncavo","Terra",1916.40010910507]
[null,2,"1-BRSA-769-AM","Arara Azul","Solimões","Terra",1447.63709103933]
[null,3,"7-LUC-69HP-AM","Leste Do Urucu","Solimões","Terra",810.86448407166904]
[null,4,"9-RUC-75D-AM","Rio Urucu","Solimões","Terra",607.46565659333305]
[null,5,"3-SUC-3-AM","Rio Urucu","Solimões","Terra",580.80126506033298]
[null,6,"7-LUC-38HP-AM","Leste Do Urucu","Solimões","Terra",527.28923886300004]
[null,7,"7-CNC-24-ES","Cancã","Espírito Santo","Terra",500.28960045700001]
[null,8,"4-SMT-3-AM","Araracanga","Solimões","Terra",470.89647968566698]
[null,9,"7-LUC-71HP-AM","Leste Do Urucu","Solimões","Terra",461.30200351166701]
[null,10,"7-LUC-63HP-AM","Leste Do Urucu","Solimões","Terra",455.96677700933299]
[null,11,"7-LUC-67HP-AM","Leste Do Urucu","Solimões","Terra",445.723611764]
[null,12,"7-LUC-25-AM","Leste Do Urucu","Solimões","Terra",428.687871039333]
[null,13,"7-MJ-94D-BA","Mata De São João","Recôncavo","Terra",422.90900327166702]
[null,14,"7-RUC-39HP-AM","Rio Urucu","Solimões","Terra",380.69724972033299]
[null,15,"7-LUC-65HP-AM","Leste Do Urucu","Solimões","Terra",372.75846119866702]
[null,16,"7-LUC-32HA-AM","Leste Do Urucu","Solimões","Terra",355.19919862166699]
[null,17,"7-LUC-57HP-AM","Leste Do Urucu","Solimões","Terra",349.43395877566701]
[null,18,"7-LUC-42HP-AM","Leste Do Urucu","Solimões","Terra",346.35069391366699]
[null,19,"7-RUC-112HPA-AM","Rio Urucu","Solimões","Terra",343.441237468]
[null,20,"7-LUC-80DP-AM","Leste Do Urucu","Solimões","Terra",335.31144838266698]
[null,21,"7-LUC-41HP-AM","Leste Do Urucu","Solimões","Terra",310.03144403066699]
[null,22,"4-LUC-3-AM","Leste Do Urucu","Solimões","Terra",308.68123148400002]
[null,23,"3-RUC-16D-AM","Rio Urucu","Solimões","Terra",288.41756026733299]
[null,24,"7-ANB-7D-AL","Anambé","Alagoas","Terra",288.27310429766698]
[null,25,"9-RUC-97DP-AM","Rio Urucu","Solimões","Terra",287.89655433899998]
[null,26,"7-RUC-67HPA-AM","Rio Urucu","Solimões","Terra",279.54242869699999]
[null,27,"7-LUC-17-AM","Leste Do Urucu","Solimões","Terra",276.48054918899999]
[null,28,"7-ANB-16D-AL","Anambé","Alagoas","Terra",265.21067729133301]
[null,29,"7-RUC-89H-AM","Rio Urucu","Solimões","Terra",264.20682361533301]
[null,30,"7-LUC-59HP-AM","Leste Do Urucu","Solimões","Terra",256.47496984266701]
[]
[]
[null,"Tabela 16. Os 30 poços  terrestres com maior produção de gás natural (Mm³/d)"]
[]
[null,"Nº","Nome ANP do Poço","Campo","Bacia","Localização","Gás Natural (Mm³/d)"]
[null,1,"9-RUC-75D-AM","Rio Urucu","Solimões","Terra",596.66319533333296]
[null,2,"4-SMT-3-AM","Araracanga","Solimões","Terra",503.048947666667]
[null,3,"7-LUC-71HP-AM","Leste Do Urucu","Solimões","Terra",480.19228600000002]
[null,4,"7-LUC-63HP-AM","Leste Do Urucu","Solimões","Terra",432.40271266666701]
[null,5,"3-RUC-16D-AM","Rio Urucu","Solimões","Terra",420.60854833333298]
[null,6,"7-RUC-39HP-AM","Rio Urucu","Solimões","Terra",412.233180333333]
[null,7,"7-LUC-57HP-AM","Leste Do Urucu","Solimões","Terra",403.737752]
[null,8,"7-LUC-65HP-AM","Leste Do Urucu","Solimões","Terra",401.36799366666702]
[null,9,"7-LUC-42HP-AM","Leste Do Urucu","Solimões","Terra",392.678000666667]
[null,10,"7-LUC-80DP-AM","Leste Do Urucu","Solimões","Terra",383.23505633333298]
[null,11,"7-RUC-67HPA-AM","Rio Urucu","Solimões","Terra",380.91466500000001]
[null,12,"7-RUC-56HP-AM","Rio Urucu","Solimões","Terra",359.47615466666701]
[null,13,"7-LUC-38HP-AM","Leste Do Urucu","Solimões","Terra",351.66452566666698]
[null,14,"7-RUC-103DP-AM","Rio Urucu","Solimões","Terra",340.58388500000001]
[null,15,"1-BRSA-769-AM","Arara Azul","Solimões","Terra",328.52216733333302]
[null,16,"7-LUC-17-AM","Leste Do Urucu","Solimões","Terra",309.37899833333302]
[null,17,"3-RUC-8-AM","Rio Urucu","Solimões","Terra",282.06543266666699]
[null,18,"7-LUC-84HP-AM","Leste Do Urucu","Solimões","Terra",276.367233666667]
[null,19,"7-RUC-96HP-AM","Rio Urucu","Solimões","Terra",270.75982199999999]
[null,20,"7-LUC-59HP-AM","Leste Do Urucu","Solimões","Terra",267.03274933333302]
[null,21,"7-LUC-73HP-AM","Leste Do Urucu","Solimões","Terra",259.75840633333303]
[null,22,"9-LUC-91D-AM","Leste Do Urucu","Solimões","Terra",253.006369333333]
[null,23,"3-LUC-8-AM","Leste Do Urucu","Solimões","Terra",251.61448366666701]
[null,24,"9-RUC-104DP-AM","Rio Urucu","Solimões","Terra",249.10366266666699]
[null,25,"7-RUC-18D-AM","Rio Urucu","Solimões","Terra",245.71764366666699]
[null,26,"9-RUC-97DP-AM","Rio Urucu","Solimões","Terra",241.42081999999999]
[null,27,"7-RUC-65DP-AM","Rio Urucu","Solimões","Terra",240.77000733333301]
[null,28,"1-SMT-2-AM","Araracanga","Solimões","Terra",229.29650899999999]
[null,29,"7-LUC-22DP-AM","Leste Do Urucu","Solimões","Terra",226.69769033333299]
[null,30,"7-LUC-41HP-AM","Leste Do Urucu","Solimões","Terra",224.40718000000001]
[]
[]
[null,"Tabela 17. As 30 instalações com maior produção de petróleo (bbl/d)"]
[]
[null,"Instalação","Petróleo (bbl/d)","Gás natural (Mm³/d)","Produção (boe/d)","Nº poços produtores","Campos Produtores"]
[null,"PETROBRAS 75",158555.80110141,5918.0268946666702,195779.06584375299,4,"Búzios/Tambuatá"]
[null,"PETROBRAS 77",147215.26109178999,5178.3130609999998,179785.86636599799,4,"Búzios/Tambuatá"]
[null,"PETROBRAS 69",146730.09956203701,5194.7191293333399,179403.895888909,6,"Anc_Lula/Lula/Sul De Lula"]
[null,"FPSO CIDADE DE SAQUAREMA",138985.90498926301,6139.8760199999997,177604.55857861901,7,"Anc_Lula/Lula/Sul De Lula"]
[null,"FPSO CIDADE DE MARICÁ",137483.50647884401,5176.5201989999996,170042.83499171599,8,"Anc_Lula/Lula/Sul De Lula"]
[null,"FPSO CIDADE DE ITAGUAÍ",136366.58422416999,7555.80728,183891.17641198699,6,"Lula"]
[null,"PETROBRAS 74",134384.92716858699,5397.4670536666599,168333.96941741,5,"Búzios/Tambuatá"]
[null,"FPSO CIDADE DE ILHA BELA",133593.48611888301,5673.06573833333,169275.99173051,6,"Nordeste De Sapinhoá/Noroeste De Sapinhoa/Sapinhoá/Sudoeste De Sapinhoá"]
[null,"FPSO CIDADE DE MANGARATIBA",123341.46327168,7134.2595226666699,168214.60015994401,8,"Lula"]
[null,"PETROBRAS 66",122505.65530276801,5869.75835966667,159425.32013098299,7,"Anc_Lula/Lula/Sul De Lula"]
[null,"PETROBRAS 67",111515.48730370399,3921.2070990000002,136179.134927065,5,"Anc_Lula/Lula/Sul De Lula"]
[null,"FPSO CIDADE DE CAMPOS DOS GOYTACAZES",108711.597557261,1232.5311036666701,116463.98401841499,9,"Tartaruga Verde/Tartaruga Verde Sudoeste"]
[null,"FPSO CIDADE DE PARATY",106883.03153344701,4170.8670633333304,133116.99289707199,6,"Anc_Lula/Lula/Sul De Lula"]
[null,"PETROBRAS 76",77780.905852973301,3150.30253633333,97595.710249028096,4,"Búzios/Tambuatá"]
[null,"FPSO CIDADE DE ANGRA DOS REIS",75570.409640399303,3179.1982410000001,95566.962528623597,6,"Lula/Sul De Lula"]
[null,"FPSO CIDADE DE SÃO PAULO",75120.764990433803,4759.2826013333297,105055.748289126,6,"Nordeste De Sapinhoá/Noroeste De Sapinhoa/Sapinhoá/Sudoeste De Sapinhoá"]
[null,"PETROBRAS 58",74018.563750926696,2518.37927066667,89858.690871358602,11,"Jubarte"]
[null,"PETROBRAS 68",60572.373505885102,756.50349400000005,65330.636747481301,2,"Berbigão"]
[null,"PETROBRAS 57",49806.233680393401,409.35616566666698,52381.006184765203,15,"Jubarte"]
[null,"PETROBRAS 52",49204.894298740001,956.18413233333297,55219.110816131499,12,"Roncador"]
[null,"PETROBRAS 40",47701.298445413297,923.10485366666705,53507.452585054503,13,"Marlim/Marlim Sul"]
[null,"FPSO ESPIRITO SANTO",46344.471322793703,429.57559633333301,49046.420204367103,21,"Argonauta/Ostra"]
[null,"PETROBRAS 55",37866.884889343302,629.07724833333305,41823.661256682797,12,"Roncador"]
[null,"FPSO PIONEIRO DE LIBRA",36243.134594312702,2444.1591050000002,51616.430974532799,1,"Mero"]
[null,"PETROBRAS 50",35634.433606455801,555.12017766666702,39126.034051145398,13,"Albacora/Albacora Leste"]
[null,"PETROBRAS 54",32505.2873102833,494.93053366666697,35618.306330245301,10,"Roncador"]
[null,"PETROBRAS 51",30161.509120173301,501.95301233333299,33318.698196677702,12,"Marlim Sul"]
[null,"PETROJARL 1",29647.700831083301,221.26996666666599,31039.446880123,3,"Atlanta"]
[null,"PETROBRAS 56",29392.18149304,581.82050366666601,33051.7219152076,10,"Marlim Sul"]
[null,"PETROBRAS 19",29359.172360499699,350.423198333333,31563.267697608699,10,"Marlim/Marlim Sul"]
[]
[]
[null,"Tabela 18. As 30 instalações com maior produção de gás natural (Mm³/d)"]
[]
[null,"Instalação","Petróleo (bbl/d)","Gás natural (Mm³/d)","Produção (boe/d)","Nº poços produtores","Campos Produtores"]
[null,"POLO ARARA",8440.2251738073301,7629.0973363333296,56425.797890850103,35,"Arara Azul/Araracanga/Carapanaúba/Cupiúba/Rio Urucu/Sudoeste Urucu"]
[null,"FPSO CIDADE DE ITAGUAÍ",136366.58422416999,7555.80728,183891.17641198699,6,"Lula"]
[null,"FPSO CIDADE DE MANGARATIBA",123341.46327168,7134.2595226666699,168214.60015994401,8,"Lula"]
[null,"FPSO CIDADE DE SAQUAREMA",138985.90498926301,6139.8760199999997,177604.55857861901,7,"Anc_Lula/Lula/Sul De Lula"]
[null,"PLATAFORMA DE MEXILHÃO",4088.0913619466701,5978.4960296666704,41691.695474304397,7,"Mexilhão"]
[null,"PETROBRAS 75 ",158555.80110141,5918.0268946666702,195779.06584375299,4,"Búzios/Tambuatá"]
[null,"PETROBRAS 66",122505.65530276801,5869.75835966667,159425.32013098299,7,"Anc_Lula/Lula/Sul De Lula"]
[null,"FPSO CIDADE DE ILHA BELA",133593.48611888301,5673.06573833333,169275.99173051,6,"Nordeste De Sapinhoá/Noroeste De Sapinhoa/Sapinhoá/Sudoeste De Sapinhoá"]
[null,"PETROBRAS 74",134384.92716858699,5397.4670536666599,168333.96941741,5,"Búzios/Tambuatá"]
[null,"PETROBRAS 69",146730.09956203701,5194.7191293333399,179403.895888909,6,"Anc_Lula/Lula/Sul De Lula"]
[null,"PETROBRAS 77",147215.26109178999,5178.3130609999998,179785.86636599799,4,"Búzios/Tambuatá"]
[null,"FPSO CIDADE DE MARICÁ",137483.50647884401,5176.5201989999996,170042.83499171599,8,"Anc_Lula/Lula/Sul De Lula"]
[null,"FPSO CIDADE DE SÃO PAULO",75120.764990433803,4759.2826013333297,105055.748289126,6,"Nordeste De Sapinhoá/Noroeste De Sapinhoa/Sapinhoá/Sudoeste De Sapinhoá"]
[null,"FPSO CIDADE DE PARATY",106883.03153344701,4170.8670633333304,133116.99289707199,6,"Anc_Lula/Lula/Sul De Lula"]
[null,"PETROBRAS 67",111515.48730370399,3921.2070990000002,136179.134927065,5,"Anc_Lula/Lula/Sul De Lula"]
[null,"FPSO CIDADE DE ANGRA DOS REIS",75570.409640399303,3179.1982410000001,95566.962528623597,6,"Anc_Lula/Lula/Sul De Lula"]
[null,"PETROBRAS 76",77780.905852973301,3150.30253633333,97595.710249028096,4,"Búzios/Tambuatá"]
[null,"PETROBRAS 62",28029.605276516701,2715.0014903333299,45106.448800430197,12,"Roncador"]
[null,"PETROBRAS 58",74018.563750926696,2518.37927066667,89858.690871358602,11,"Jubarte"]
[null,"FPSO PIONEIRO DE LIBRA",36243.134594312702,2444.1591050000002,51616.430974532799,1,"Mero"]
[null,"PONTO DE COLETA ÁREA DO LUC-04",1784.297703667,1544.748466,11500.472052598499,8,"Leste Do Urucu"]
[null,"PONTO DE COLETA ÁREA DO LUC-12",1964.87416522067,1470.2937420000001,11212.7424465897,8,"Leste Do Urucu"]
[null,"FPSO CIDADE DE CAMPOS DOS GOYTACAZES",108711.597557261,1232.5311036666701,116463.98401841499,9,"Tartaruga Verde/Tartaruga Verde Sudoeste"]
[null,"FPSO CIDADE DE SANTOS",5338.1323945533304,1145.8955496666699,12545.597681802201,8,"Tambaú/Uruguá"]
[null,"PONTO DE COLETA ÁREA DO LUC-05",1238.9179229423301,1107.8648103333301,8207.1770856250405,4,"Leste Do Urucu"]
[null,"PONTO DE COLETA ÁREA DO LUC-09",881.82150796433302,1023.592269,7320.0223974432201,3,"Leste Do Urucu"]
[null,"PETROBRAS 52",49204.894298740001,956.18413233333297,55219.110816131499,12,"Roncador"]
[null,"PETROBRAS 40",47701.298445413297,923.10485366666705,53507.452585054503,13,"Marlim/Marlim Sul"]
[null,"FPSO CIDADE DE CARAGUATATUBA",28712.647193466699,886.28905199999997,34287.236935626803,2,"Lapa"]
[null,"PONTO DE COLETA ÁREA DO LUC-43",1024.4052108543301,841.59337000000096,6317.8676054140396,3,"Leste Do Urucu"]
[]
[]
[null,"Tabela 19. Os 20 campos com maior queima este mês"]
[]
[null,"Nº","Campo","Bacia","Localização","Operador","Queima de Gás (Mm³/d)"]
[null,1,"Búzios","Santos","Mar","Petrobras",473.91119099999997]
[null,2,"Lula","Santos","Mar","Petrobras",445.461338333333]
[null,3,"Roncador","Campos","Mar","Petrobras",200.756198333333]
[null,4,"Berbigão","Santos","Mar","Petrobras",159.683066666667]
[null,5,"Sapinhoá","Santos","Mar","Petrobras",155.56661433333301]
[null,6,"Marlim","Campos","Mar","Petrobras",151.48217700000001]
[null,7,"Marlim Sul","Campos","Mar","Petrobras",127.387423]
[null,8,"Leste Do Urucu","Solimões","Terra","Petrobras",108.524699333333]
[null,9,"Rio Urucu","Solimões","Terra","Petrobras",87.064954333333304]
[null,10,"Atlanta","Santos","Mar","Enauta Energia S.A.",79.581699999999998]
[null,11,"Jubarte","Campos","Mar","Petrobras",61.109765666666704]
[null,12,"Marlim Leste","Campos","Mar","Petrobras",39.892399333333302]
[null,13,"Mero","Santos","Mar","Petrobras",35.858266666666701]
[null,14,"Barracuda","Campos","Mar","Petrobras",35.446911666666701]
[null,15,"Albacora Leste","Campos","Mar","Petrobras",34.795739333333302]
[null,16,"Sul De Lula","Santos","Mar","Petrobras",28.033491000000001]
[null,17,"Tiê","Recôncavo","Terra","Maha Energy",24.832636999999998]
[null,18,"Carmópolis","Sergipe","Terra","Petrobras",21.045756333333301]
[null,19,"Caratinga","Campos","Mar","Petrobras",18.744021]
[null,20,"Albacora","Campos","Mar","Petrobras",18.407025999999998]

{"sheet":"4. Pandemia_Covid-19","index":4,"n_rows":129,"n_cols":8,"rows_kept":129,"cut":false,"hidden":false,"merged":[]}
[null,"4. PANDEMIA/COVID-19"]
[]
[]
[null,"Tabela 20. Campos com produção interrompida temporariamente"]
[]
[null,"Campos ","Operador","Bacia","Ambiente","Dada de início da interrupção","Data do fim da interrupção"]
[null,"CAIOBA","Petrobras",{"$f":"VLOOKUP(B7,'[1]SIGEP JAN 2020'!$A$7:$AC$395,3)","v":"Sergipe"},"MAR","2020-03-26","-"]
[null,"CAMORIM","Petrobras",{"$f":"VLOOKUP(B8,'[1]SIGEP JAN 2020'!$A$7:$AC$395,3)","v":"Sergipe"},"MAR","2020-03-26","-"]
[null,"GUARICEMA","Petrobras",{"$f":"VLOOKUP(B9,'[1]SIGEP JAN 2020'!$A$7:$AC$395,3)","v":"Sergipe"},"MAR","2020-03-26","-"]
[null,"GAROUPA","Petrobras",{"$f":"VLOOKUP(B10,'[1]SIGEP JAN 2020'!$A$7:$AC$395,3)","v":"Campos"},"MAR","2020-03-26","-"]
[null,"CHERNE","Petrobras",{"$f":"VLOOKUP(B11,'[1]SIGEP JAN 2020'!$A$7:$AC$395,3)","v":"Campos"},"MAR","2020-03-26","-"]
[null,"NAMORADO","Petrobras",{"$f":"VLOOKUP(B12,'[1]SIGEP JAN 2020'!$A$7:$AC$395,3)","v":"Campos"},"MAR","2020-03-26","-"]
[null,"BAGRE","Petrobras",{"$f":"VLOOKUP(B13,'[1]SIGEP JAN 2020'!$A$7:$AC$395,3)","v":"Campos"},"MAR","2020-03-26","-"]
[null,"BARRACUDA","Petrobras",{"$f":"VLOOKUP(B14,'[1]SIGEP JAN 2020'!$A$7:$AC$395,3)","v":"Campos"},"MAR","2020-04-07","28/04/2020*"]
[null,"CARATINGA","Petrobras",{"$f":"VLOOKUP(B15,'[1]SIGEP JAN 2020'!$A$7:$AC$395,3)","v":"Campos"},"MAR","2020-04-04","2020-04-28"]
[null,"ATUM","Petrobras",{"$f":"VLOOKUP(B16,'[1]SIGEP JAN 2020'!$A$7:$AC$395,3)","v":"Ceará"},"MAR","2020-03-26","-"]
[null,"XARÉU","Petrobras",{"$f":"VLOOKUP(B17,'[1]SIGEP JAN 2020'!$A$7:$AC$395,3)","v":"Ceará"},"MAR","2020-03-26","-"]
[null,"CURIMÃ","Petrobras",{"$f":"VLOOKUP(B18,'[1]SIGEP JAN 2020'!$A$7:$AC$395,3)","v":"Ceará"},"MAR","2020-03-26","-"]
[null,"ESPADA","Petrobras",{"$f":"VLOOKUP(B19,'[1]SIGEP JAN 2020'!$A$7:$AC$395,3)","v":"Ceará"},"MAR","2020-03-26","-"]
[null,"UBARANA","Petrobras",{"$f":"VLOOKUP(B20,'[1]SIGEP JAN 2020'!$A$7:$AC$395,3)","v":"Potiguar"},"MAR","2020-03-26","-"]
[null,"OESTE DE UBARANA","Petrobras",{"$f":"VLOOKUP(B21,'[1]SIGEP JAN 2020'!$A$7:$AC$395,3)","v":"Potiguar"},"MAR","2020-03-26","-"]
[null,"AGULHA","Petrobras",{"$f":"VLOOKUP(B22,'[1]SIGEP JAN 2020'!$A$7:$AC$395,3)","v":"Potiguar"},"MAR","2020-03-26","-"]
[null,"AGUILHADA","Petrobras",{"$f":"VLOOKUP(B23,'[1]SIGEP JAN 2020'!$A$7:$AC$395,3)","v":"Sergipe"},"TERRA","2020-03-26","-"]
[null,"ANGELIM","Petrobras",{"$f":"VLOOKUP(B24,'[1]SIGEP JAN 2020'!$A$7:$AC$395,3)","v":"Sergipe"},"TERRA","2020-03-26","-"]
[null,"ARUARI","Petrobras",{"$f":"VLOOKUP(B25,'[1]SIGEP JAN 2020'!$A$7:$AC$395,3)","v":"Sergipe"},"TERRA","2020-03-26","-"]
[null,"ATALAIA SUL","Petrobras",{"$f":"VLOOKUP(B26,'[1]SIGEP JAN 2020'!$A$7:$AC$395,3)","v":"Sergipe"},"TERRA","2020-03-26","-"]
[null,"BREJO GRANDE","Petrobras",{"$f":"VLOOKUP(B27,'[1]SIGEP JAN 2020'!$A$7:$AC$395,3)","v":"Sergipe"},"TERRA","2020-03-26","-"]
[null,"ILHA PEQUENA","Petrobras",{"$f":"VLOOKUP(B28,'[1]SIGEP JAN 2020'!$A$7:$AC$395,3)","v":"Sergipe"},"TERRA","2020-03-26","-"]
[null,"BARRINHA","Petrobras",{"$f":"VLOOKUP(B29,'[1]SIGEP JAN 2020'!$A$7:$AC$395,3)","v":"Potiguar"},"TERRA","2020-03-26","-"]
[null,"BARRINHA LESTE","Petrobras",{"$f":"VLOOKUP(B30,'[1]SIGEP JAN 2020'!$A$7:$AC$395,3)","v":"Potiguar"},"TERRA","2020-03-26","-"]
[null,"BARRINHA SUDOESTE","Petrobras",{"$f":"VLOOKUP(B31,'[1]SIGEP JAN 2020'!$A$7:$AC$395,3)","v":"Potiguar"},"TERRA","2020-03-26","-"]
[null,"POÇO VERDE","Petrobras",{"$f":"VLOOKUP(B32,'[1]SIGEP JAN 2020'!$A$7:$AC$395,3)","v":"Potiguar"},"TERRA","2020-03-26","-"]
[null,"SERRA DO MEL","Petrobras",{"$f":"VLOOKUP(B33,'[1]SIGEP JAN 2020'!$A$7:$AC$395,3)","v":"Potiguar"},"TERRA","2020-03-26","-"]
[null,"SERRA VERMELHA","Petrobras",{"$f":"VLOOKUP(B34,'[1]SIGEP JAN 2020'!$A$7:$AC$395,3)","v":"Potiguar"},"TERRA","2020-03-26","-"]
[null,"VALE DO QUIRICÓ","Energizzi",{"$f":"VLOOKUP(B35,'[1]SIGEP JAN 2020'!$A$7:$AC$395,3)","v":"Recôncavo"},"TERRA","2020-03-26","-"]
[null,"LAGOA DO PAULO SUL",{"$f":"VLOOKUP(B36,'[1]SIGEP JAN 2020'!$A$7:$AC$395,4)","v":"Recôncavo E&P"},{"$f":"VLOOKUP(B36,'[1]SIGEP JAN 2020'!$A$7:$AC$395,3)","v":"Recôncavo"},"TERRA","2020-03-26","-"]
[null,"JURITI",{"$f":"VLOOKUP(B37,'[1]SIGEP JAN 2020'!$A$7:$AC$395,4)","v":"Recôncavo E&P"},{"$f":"VLOOKUP(B37,'[1]SIGEP JAN 2020'!$A$7:$AC$395,3)","v":"Recôncavo"},"TERRA","2020-03-26","-"]
[null,"BREJINHO",{"$f":"VLOOKUP(B38,'[1]SIGEP JAN 2020'!$A$7:$AC$395,4)","v":"Petrobras"},{"$f":"VLOOKUP(B38,'[1]SIGEP JAN 2020'!$A$7:$AC$395,3)","v":"Recôncavo"},"TERRA","2020-04-16","-"]
[null,"CANABRAVA",{"$f":"VLOOKUP(B39,'[1]SIGEP JAN 2020'!$A$7:$AC$395,4)","v":"Petrobras"},{"$f":"VLOOKUP(B39,'[1]SIGEP JAN 2020'!$A$7:$AC$395,3)","v":"Recôncavo"},"TERRA","2020-04-16","-"]
[null,"MANATI","Petrobras",{"$f":"VLOOKUP(B40,'[1]SIGEP JAN 2020'!$A$7:$AC$395,3)","v":"Camamu"},"MAR","2020-02-22","-"]
[null,"PEROÁ",{"$f":"VLOOKUP(B41,'[1]SIGEP JAN 2020'!$A$7:$AC$395,4)","v":"Petrobras"},{"$f":"VLOOKUP(B41,'[1]SIGEP JAN 2020'!$A$7:$AC$395,3)","v":"Espírito Santo"},"MAR","2020-04-03","-"]
[null,"CANGOÁ",{"$f":"VLOOKUP(B42,'[1]SIGEP JAN 2020'!$A$7:$AC$395,4)","v":"Petrobras"},{"$f":"VLOOKUP(B42,'[1]SIGEP JAN 2020'!$A$7:$AC$395,3)","v":"Espírito Santo"},"MAR","2020-04-03","-"]
[null,"MERLUZA","Petrobras",{"$f":"VLOOKUP(B43,'[1]SIGEP JAN 2020'!$A$7:$AC$395,3)","v":"Santos"},"MAR","2020-03-27","-"]
[null,"LAGOSTA","Petrobras",{"$f":"VLOOKUP(B44,'[1]SIGEP JAN 2020'!$A$7:$AC$395,3)","v":"Santos"},"MAR","2020-03-27","-"]
[]
[]
[null,"TOTAL  DE CAMPOS INTERROMPIDOS",null,38]
[]
[null,"TOTAL DE CAMPOS QUE RETORNARAM A OPERAR",null,2]
[]
[null,"TOTAL DE CAMPOS QUE PERMANECEM COM PRODUÇÃO INTERROMPIDOS",null,{"$f":"D47-D49","v":36}]
[]
[]
[]
[]
[null,"Tabela 21. Plataformas com produção temporariamente interrompida "]
[]
[]
[null,"Plataformas com produção temporariamente interrompidas","Nome da UEP","Campo","Tipo","Ambiente","Dada de início da interrupção","Data do fim da interrupção"]
[null,"PCB-1","PLATAFORMA DE CAIOBA 1","CAIOBA","FIXA","MAR","2020-03-26","-"]
[null,"PCB-2","PLATAFORMA DE CAIOBA 2","CAIOBA","FIXA","MAR","2020-03-26","-"]
[null,"PCB-3","PLATAFORMA DE CAIOBA 3","CAIOBA","FIXA","MAR","2020-03-26","-"]
[null,"PCB-4","PLATAFORMA DE CAIOBA 4","CAIOBA","FIXA","MAR","2020-03-26","-"]
[null,"PCM-1","PLATAFORMA DE CAMORIM 1","CAMORIM","FIXA","MAR","2020-03-26","-"]
[null,"PCM-2","PLATAFORMA DE CAMORIM 2","CAMORIM","FIXA","MAR","2020-03-26","-"]
[null,"PCM-3","PLATAFORMA DE CAMORIM 3","CAMORIM","FIXA","MAR","2020-03-26","-"]
[null,"PCM-4","PLATAFORMA DE CAMORIM 4","CAMORIM","FIXA","MAR","2020-03-26","-"]
[null,"PCM-5","PLATAFORMA DE CAMORIM 5","CAMORIM","FIXA","MAR","2020-03-26","-"]
[null,"PCM-6","PLATAFORMA DE CAMORIM 6","CAMORIM","FIXA","MAR","2020-03-26","-"]
[null,"PCM-7","PLATAFORMA DE CAMORIM 7","CAMORIM","FIXA","MAR","2020-03-26","-"]
[null,"PCM-8","PLATAFORMA DE CAMORIM 8","CAMORIM","FIXA","MAR","2020-03-26","-"]
[null,"PCM-9","PLATAFORMA DE CAMORIM 9","CAMORIM","FIXA","MAR","2020-03-26","-"]
[null,"PCM-10","PLATAFORMA DE CAMORIM 10","CAMORIM","FIXA","MAR","2020-03-26","-"]
[null,"PGA-1","PLATAFORMA DE GUARICEMA 1","GUARICEMA","FIXA","MAR","2020-03-26","-"]
[null,"PGA-2","PLATAFORMA DE GUARICEMA 2","GUARICEMA","FIXA","MAR","2020-03-26","-"]
[null,"PGA-3","PLATAFORMA DE GUARICEMA 3","GUARICEMA","FIXA","MAR","2020-03-26","-"]
[null,"PGA-4","PLATAFORMA DE GUARICEMA 4","GUARICEMA","FIXA","MAR","2020-03-26","-"]
[null,"PGA-5","PLATAFORMA DE GUARICEMA 5","GUARICEMA","FIXA","MAR","2020-03-26","-"]
[null,"PGA-8","PLATAFORMA DE GUARICEMA 8","GUARICEMA","FIXA","MAR","2020-03-26","-"]
[null,"PRB-1","PLATAFORMA DE ROBALO 1","ROBALO","FIXA","MAR","2020-03-26","-"]
[null,"P-09","PETROBRAS P-09","CONGRO, CORVINA E MALHADO","SEMI-SUB","MAR","2020-03-26","-"]
[null,"PGP-1","PLATAFORMA DE GAROUPA 1","GAROUPA","FIXA","MAR","2020-03-26","-"]
[null,"PCH-1","PLATAFORMA DE CHERNE 1","CHERNE","FIXA","MAR","2020-03-26","-"]
[null,"PCH-2","PLATAFORMA DE CHERNE 2","CHERNE","FIXA","MAR","2020-03-26","-"]
[null,"PNA-1","PLATAFORMA DE NAMORADO 1","NAMORADO","FIXA","MAR","2020-03-26","-"]
[null,"PNA-2","PLATAFORMA DE NAMORADO 2","NAMORADO","FIXA","MAR","2020-03-26","-"]
[null,"P-43","PETROBRAS P-43","BARRACUDA","FPSO","MAR","2020-04-07","28/04/2020*"]
[null,"P-48","PETROBRAS P-48","CARATINGA","FPSO","MAR","2020-04-04","2020-04-28"]
[null,"PAT-1","PLATAFORMA DE ATUM 1","ATUM","FIXA","MAR","2020-03-26","-"]
[null,"PAT-2","PLATAFORMA DE ATUM 2","ATUM","FIXA","MAR","2020-03-26","-"]
[null,"PAT-3","PLATAFORMA DE ATUM 3","ATUM","FIXA","MAR","2020-03-26","-"]
[null,"PXA-1","PLATAFORMA DE XARÉU 1","XARÉU","FIXA","MAR","2020-03-26","-"]
[null,"PXA-2","PLATAFORMA DE XARÉU 2","XARÉU","FIXA","MAR","2020-03-26","-"]
[null,"PXA-3","PLATAFORMA DE XARÉU 3","XARÉU","FIXA","MAR","2020-03-26","-"]
[null,"PCR-1","PLATAFORMA DE CURIMÃ 1","CURIMÃ","FIXA","MAR","2020-03-26","-"]
[null,"PCR-2","PLATAFORMA DE CURIMÃ 2","CURIMÃ","FIXA","MAR","2020-03-26","-"]
[null,"PEP-1","PLATAFORMA DE ESPADA 1","ESPADA","FIXA","MAR","2020-03-26","-"]
[null,"PART-2","PLATAFORMA DE ARATUM 2","ARATUM","FIXA","MAR","2020-03-26","-"]
[null,"PCIO-1","PLATAFORMA DE CIOBA 1","CIOBA","FIXA","MAR","2020-03-26","-"]
[null,"PUB-1","PLATAFORMA DE UBARANA 1","UBARANA","FIXA","MAR","2020-03-26","-"]
[null,"PUB-2","PLATAFORMA DE UBARANA 2","UBARANA","FIXA CONCRETO","MAR","2020-03-26","-"]
[null,"PUB-3","PLATAFORMA DE UBARANA 3","UBARANA","FIXA CONCRETO","MAR","2020-03-26","-"]
[null,"PUB-4","PLATAFORMA DE UBARANA 4","UBARANA","FIXA","MAR","2020-03-26","-"]
[null,"PUB-5","PLATAFORMA DE UBARANA 5","UBARANA","FIXA","MAR","2020-03-26","-"]
[null,"PUB-6","PLATAFORMA DE UBARANA 6","UBARANA","FIXA","MAR","2020-03-26","-"]
[null,"PUB-7","PLATAFORMA DE UBARANA 7","UBARANA","FIXA","MAR","2020-03-26","-"]
[null,"PUB-8","PLATAFORMA DE UBARANA 8","UBARANA","FIXA","MAR","2020-03-26","-"]
[null,"PUB-9","PLATAFORMA DE UBARANA 9","UBARANA","FIXA","MAR","2020-03-26","-"]
[null,"PUB-10","PLATAFORMA DE UBARANA 10","UBARANA","FIXA","MAR","2020-03-26","-"]
[null,"PUB-11","PLATAFORMA DE UBARANA 11","UBARANA","FIXA","MAR","2020-03-26","-"]
[null,"PUB-12","PLATAFORMA DE UBARANA 12","UBARANA","FIXA","MAR","2020-03-26","-"]
[null,"PUB-13","PLATAFORMA DE UBARANA 13","UBARANA","FIXA","MAR","2020-03-26","-"]
[null,"PUB-15","PLATAFORMA DE UBARANA 15","UBARANA","FIXA","MAR","2020-03-26","-"]
[null,"POUB-1","PLATAFORMA DE OESTE DE UBARANA 1","OESTE DE UBARANA","FIXA","MAR","2020-03-26","-"]
[null,"POUB-2","PLATAFORMA DE OESTE DE UBARANA 2","OESTE DE UBARANA","FIXA","MAR","2020-03-26","-"]
[null,"PBIQ-1","PLATAFORMA DE BIQUARA 1","BIQUARA","FIXA","MAR","2020-03-26","-"]
[null,"PAG-1","PLATAFORMA DE AGULHA 1","AGULHA","FIXA","MAR","2020-03-26","-"]
[null,"PAG-2","PLATAFORMA DE AGULHA 2","AGULHA","FIXA CONCRETO","MAR","2020-03-26","-"]
[null,"PAG-3","PLATAFORMA DE AGULHA 3","AGULHA","FIXA","MAR","2020-03-26","-"]
[null,"PMNT","PLATAFORMA DE MANATI","MANATI","FIXA","MAR","2020-02-22","-"]
[null,"PPER","PLATAFORMA DE PEROÁ","PEROÁ E CANGOÁ","FIXA","MAR","2020-04-03","-"]
[null,"PMLZ","PLATAFORMA DE MERLUZA","MERLUZA E LAGOSTA","FIXA","MAR","2020-03-27","-"]
[null,"* Antecipou parada programada para reparos. Previsão de retorno na 1ª quinzena de junho."]
[]
[null,"Total de UEPs",63,"Pico de instalações que chegaram a interromper temporariamente suas operações"]
[]
[null,"Unidades que retornaram à operação",2]
[]
[null,"Unidades que permanecem fora de operação",{"$f":"C125-C127","v":61}]