{"text_format":"1","workbook":"xlsx","n_sheets":5,"sheets":["Lista de Tabelas","1. Histórico de Produção","2. Dados de Produção","3. Ranking","4. Pandemia_Covid-19"],"not_rendered":{"charts":0,"images":1,"macros":1,"external_links":1,"defined_names":0,"comments":0,"pivot_tables":0},"unopened":[],"bounds":{"document_bytes":16777216,"sheet_cells":100000,"rows_first":2000,"rows_last":500,"rows_between":2000,"halvings":0,"cell_chars":16384,"cell_head_chars":4096},"cells_cut":0,"cells_raw":0,"read":"whole","date_system":"1900"}

{"sheet":"Lista de Tabelas","index":0,"n_rows":42,"n_cols":8,"rows_kept":42,"cut":false,"hidden":false,"merged":[]}
[]
[]
[]
[]
[]
[]
[]
[""]
[]
[]
[]
[]
[]
[]
[]
[]
[]
[]
[]
[]
[]
[]
[]
[]
[]
[]
[]
[]
[]
[]
[]
[]
[]
[]
[]
[]
[]
[]
[]
[]
[]
[null,null,null,null,"4. EFEITOS DA PANDEMIA/COVID-21","4. EFEITOS DA PANDEMIA/COVID-22","4. EFEITOS DA PANDEMIA/COVID-23","4. EFEITOS DA PANDEMIA/COVID-24"]

{"sheet":"1. Histórico de Produção","index":1,"n_rows":45,"n_cols":15,"rows_kept":45,"cut":false,"hidden":false,"merged":[[21,1,21,14],[38,1,39,14],[5,1,5,14]]}
[]
[null,"1. HISTÓRICO DA PRODUÇÃO NACIONAL"]
[]
[]
[]
[null,"Tabela 1. Histórico de produção de petróleo – óleo e condensado (Mbbl/d)"]
[]
[null,null,"04/2019","05/2019","06/2019","07/2019","08/2019","09/2019","10/2019","11/2019","12/2019","01/2020","02/2020","03/2020","04/2020"]
[null,"Óleo",2591.6598314924399,2718.8742589949702,2545.48592517207,2762.3678568588398,2977.2372416599301,2915.3913044333199,2952.1997505700901,3078.7528596994998,3095.0602741378598,3156.2553179798401,2959.9202597162198,2962.9604393079399,2948.31033924445]
[null,"Condensado",12.242423979875699,12.095033995707499,11.946197886762,12.3342282712185,12.192971139981699,11.883360950970999,11.695286131585,11.7150227530423,11.5383029110117,12.1521975298445,11.7569460209877,10.4251095153462,10.053946004080499]
[null,"Petróleo",2603.9022554723201,2730.9692929906801,2557.4321230588398,2774.7020851300599,2989.4302127999099,2927.2746653842901,2963.8950367016701,3090.4678824525399,3106.5985770488701,3168.4075155096898,2971.67720573721,2973.3855488232798,2958.36428524853]
[]
[]
[null,"Tabela 2. Histórico de produção de gás natural – GASA e GASN (MMm³/d)"]
[]
[null,null,"04/2019","05/2019","06/2019","07/2019","08/2019","09/2019","10/2019","11/2019","12/2019","01/2020","02/2020","03/2020","04/2020"]
[null,"GASA",94.033607283999999,98.511129965806404,92.040305930333304,100.704296007097,107.599664166129,102.903797009333,106.116400765484,110.587249003667,111.927529607097,111.606382977419,105.872977705517,106.97996705322601,110.560868492667]
[null,"GASN",18.894523032999999,19.4282871616129,19.111857668999999,23.452390829032201,25.723139259032301,25.952551918333299,25.478259905161298,26.009605332333301,25.851482608709698,27.146490074516102,23.062257192069001,14.7693720470968,13.444934752]
[null,"Gás Total",112.928130317,117.93941712741901,111.15216359933299,124.156686836129,133.322803425161,128.856348927667,131.594660670645,136.59685433600001,137.77901221580601,138.75287305193501,128.93523489758601,121.749339100323,124.00580324466701]
[]
[]
[null,"Tabela 3. Histórico da movimentação da gás natural (Mm³/d)"]
[]
[null,"Período","Consumo Interno","Queima","Disponível","Injeção","Produção"]
[null,"04/19",12896.915365999999,6040.9068550000002,55334.791292666698,38655.516806666703,112928.130320333]
[null,"05/19",13315.131511612901,4905.8661080645197,58276.358307741903,41442.061203871002,117939.41713129]
[null,"06/19",13104.238265333301,4051.00289433333,54753.025919666703,39243.8965243333,111152.163603667]
[null,"07/19",13767.604833548399,3469.9381019354801,61728.871861935499,45190.272042903198,124156.686840323]
[null,"08/19",14393.587770967701,3323.2558190322602,65534.581229677402,50071.37861,133322.80342967701]
[null,"09/19",14287.933495666701,3275.474287,67163.302139333304,44129.639009333303,128856.34893133301]
[null,"10/19",14284.623305483899,3507.72561419355,66688.775187419393,47113.536567419404,131594.660674516]
[null,"11/19",14345.488343666701,3432.3651483333301,66420.349403666696,52398.651444666699,136596.854340333]
[null,"12/19",14347.483688709701,3679.25316225806,65605.895499032296,54146.412942580602,137779.045292581]
[null,"01/20",14640.6637596774,4033.68644483871,67943.574161290293,52082.822843548398,138700.747209355]
[null,"02/20",14164.818576551699,3643.9892717241401,61364.6023406897,49761.824714482798,128935.234903448]
[null,"03/20",14380.2607874194,3398.0656980645199,47959,56012,121749.339103226]
[null,"2020-04-01",14339.3594793333,2723.6130063333298,50600.745385000002,56342.537527666696,124006.255398333]
[]
[null,"Tabela 4. Histórico de produção de petróleo e gás natural (Mboe/d)"]
[]
[]
[null,null,"04/19","05/19","06/19","07/19","08/19","09/19","10/19","11/19","12/19","01/20","02/20","03/20","04/20"]
[null,"Mar",46364.7033713333,49364.845831612904,43928.537259999997,46958.301902258099,50022.776581935497,50694.940713999997,49800.450652580599,48779.3551526667,48704.694672903199,50051.128851612899,46976.564592758601,38959.710516129002,41382.389392999998]
[null,"Terra",8970.0879213333301,8911.5124761290299,10824.4886596667,14770.569959677399,15511.804647741899,16468.3614253333,16888.324534838699,17640.994251,16901.200826128999,17892.445309677401,14388.037747930999,8971.8033167741905,9218.3559920000007]
[null,"Total",55334.791292666698,58276.358307741903,54753.025919666703,61728.871861935499,65534.581229677402,67163.302139333304,66688.775187419393,66420.349403666696,65605.895499032296,67943.574161290293,61364.6023406897,47931.513832903198,50600.745385000002]

{"sheet":"2. Dados de Produção","index":2,"n_rows":288,"n_cols":11,"rows_kept":288,"cut":false,"hidden":false,"merged":[[146,1,147,1],[146,2,146,3],[146,4,146,5],[146,6,146,7]]}
[]
[null,"2. DADOS DE PRODUÇÃO - DISTRIBUIÇÃO "]
[]
[]
[]
[null,"Tabela 5. Distribuição da produção de petróleo e gás natural por estado"]
[]
[null,"Estado","Petróleo (bbl/d)","Gás Natural (Mm³/d)","Produção Total (boe/d)","Nº Campos produtores"]
[null,"Rio De Janeiro",2394861.5387440599,84389.683856999996,2925656.6161646601,37]
[null,"São Paulo",257665.12304479399,17408.735632333301,367162.76251239999,8]
[null,"Espírito Santo",214642.772110363,4368.1079946666696,242117.34145629799,39]
[null,"Amazonas",16741.629209066701,14238.358261666701,106298.19738688,8]
[null,"Rio Grande Do Norte",32991.580160905098,606.73582099999999,36807.833195189101,74]
[null,"Bahia",25473.847243066801,1675.2962056666699,36011.142070431102,75]
[null,"Sergipe",12607.1119523177,386.49298099999999,15038.0793691413,13]
[null,"Alagoas",2592.9597981875499,872.82422266666697,8082.8583221585704,11]
[null,"Ceará",782.00327156599803,0.98834733333333302,788.21978850667097,2]
[null,"Maranhão",5.7197142012200004,58.579921333333303,374.176289202833,5]
[null,"Total Geral",2958364.2852485301,124005.803244667,3738337.2265548701,272]
[null,"Tabela 6. Distribuição da produção de petróleo e gás natural por bacia"]
[]
[null,"Bacia","Petróleo (bbl/d)","Gás Natural (Mm³/d)","Produção Total (boe/d)","Nº Campos produtores"]
[null,"Santos",2006785.5018917001,89962.8862073333,2572634.9631874501,18]
[null,"Campos",839976.85399923299,15940.805699,940241.49309285998,30]
[null,"Solimões",16734.056277826701,14222.952728333299,106193.726578025,7]
[null,"Potiguar",33773.583432471103,607.72416833333295,37596.052983695801,76]
[null,"Recôncavo",25471.2013296601,1638.2384216666701,35775.4097366434,69]
[null,"Espírito Santo",20407.078008286499,262.83557766666701,22060.263853050099,36]
[null,"Sergipe",12607.1119523177,386.49298099999999,15038.0793691413,13]
[null,"Alagoas",2592.9597981875499,872.82422266666697,8082.8583221585704,11]
[null,"Parnaíba",5.7197142012200004,58.579921333333303,374.176289202833,5]
[null,"Tucano Sul",2.6459134066666699,31.7661506666667,202.44896553137301,5]
[null,"Amazonas",7.57293124,15.405533333333301,104.470808855333,1]
[null,"Camamu",0,5.2916333333333299,33.283368256333297,1]
[null,"Total Geral",2958364.2852485301,124005.803244667,3738337.2265548701,272]
[]
[null,"Tabela 7. Distribuição da produção de petróleo e gás natural por operador"]
[]
[null,"Nº","Operador","Petróleo (bbl/d)","Gás Natural (Mm³/d)","Produção Total (boe/d)"]
[null,1,"Petrobras",2783112.2129195598,121634.260349,3548168.60000531]
[null,2,"Shell Brasil",54373.357139668296,585.88027866666698,58058.432775228699]
[null,3,"Total E&P do Brasil",28712.647193466699,886.28905199999997,34287.236935626803]
[null,4,"Enauta Energia S.A.",29647.700831083301,221.26996666666699,31039.446880123]
[null,5,"Petro Rio Jaguar",19076.809228906699,256.13560000000001,20687.8534871427]
[null,6,"Equinor Brasil",12481.752653003299,18.773,12599.8312561333]
[null,7,"Petro Rio O&G",10628.8002349164,35.806165999999997,10854.014215884899]
[null,8,"Potiguar E&P S.A.",4775.1491904956602,154.31557933333301,5745.7648645422496]
[null,9,"Dommo Energia",5447.0446437167902,15.137326,5542.2555481648496]
[null,10,"Perenco Brasil",4012.8584832839301,18.6653016666667,4130.2596843599504]
[null,11,"Maha Energy",2845.0360753674499,50.179190666666699,3160.6536506145599]
[null,12,"SHB",1563.79069152902,13.3477036666667,1647.7452115286601]
[null,13,"Eneva",13.292645441219999,73.985454666666698,478.64709805816699]
[null,14,"Petrosynergy",367.44762448290999,6.7743643333333301,410.05708901035302]
[null,15,"Nova Petróleo",249.481487348917,2.1690079999999998,263.12413555739698]
[null,16,"Geopark Brasil",239.26646900333299,1.5216133333333299,248.83712776346701]
[null,17,"Imetame",151.91171126335001,11.03243,221.30359980164999]
[null,18,"Partex Brasil",192.925245526667,0.27605400000000002,194.66157273640701]
[null,19,"Petrogal Brasil",159.13704873332,2.3240673333333302,173.75499068719299]
[null,20,"Recôncavo E&P",146.84819407000001,1.0554206666666699,153.486589533407]
[null,21,"Phoenix Óleo & Gás",61.737001073999998,5.2978186666666698,95.059273901786696]
[null,22,"Petroborn",0,9.5598933333333296,60.129912686933302]
[null,23,"Santana",38.0568727936,1.19526333333333,45.574852060233297]
[null,24,"Guto & Cacal",18.953294133333301,5.9483000000000001E-2,19.3274309015633]
[null,25,"EPG Brasil",15.9907936233333,0.369416666666667,18.314354267500001]
[null,26,"Perícia",14.466563000000001,4.5999999999999999E-2,14.75589426]
[null,27,"Vipetro",6.2314866884733302,1.48576666666667E-2,6.3249385888500003]
[null,28,"Alvopetro",4.3053749449999996,5.1487999999999999E-2,4.6292246822800003]
[null,29,"Ubuntu Engenharia",3.87221669633333,6.1563333333333296E-3,3.91093886329667]
[null,30,"Nord",2.0966033333333298,3.27066666666667E-3,2.1171752052400001]
[null,31,"Leros",0.99651556433333299,1.58433333333333E-3,1.0064807199766701]
[null,32,"BGM",0.10881371300000001,8.6333333333333295E-5,0.10935673326333301]
[null,33,"Central Resources",2.09660333333333E-6,3.3333333333333298E-7,4.1932066666666702E-6]
[null,null,"Total Geral",2958364.2852485301,124005.803244667,3738337.2265548701]
[]
[null,"Tabela 8. Distribuição da produção de petróleo e gás natural por concessionário"]
[]
[null,"Nº","Concessionário","Petróleo (bbl/d)","Gás Natural (Mm³/d)","Produção Total (boe/d)"]
[null,1,"Petrobras",2162921.36570998,96147.036630333299,2767667.9581778198]
[null,2,"Shell Brasil",382621.16210384702,15880.154870333299,482504.319008819]
[null,3,"Petrogal Brasil",109975.633025053,4736.4468833333303,139766.98399631199]
{"$rows_left_out":209}
{"sheet":"3. Ranking","index":3,"n_rows":273,"n_cols":7,"rows_kept":273,"cut":false,"hidden":false,"merged":[]}
[]
[null,"3. RANKING"]
[]
[]
[]
[null,"Tabela 12. Os 30 poços com maior produção de petróleo (bbl/d)"]
[]
[null,"Nº","Nome ANP do Poço","Campo","Bacia","Localização","Petróleo (bbl/d)"]
[null,1,"7-BUZ-29D-RJS","Búzios/Tambuatá","Santos","Mar",51700.299680557997]
[null,2,"7-BUZ-12-RJS","Búzios/Tambuatá","Santos","Mar",49437.264410399002]
[null,3,"7-BUZ-10-RJS","Berbigão","Santos","Mar",43143.353454279]
[null,4,"7-BUZ-30-RJS","Búzios/Tambuatá","Santos","Mar",38400.601056064297]
[null,5,"9-BUZ-3-RJS","Búzios/Tambuatá","Santos","Mar",36980.801615783297]
[null,6,"3-BRSA-1305A-RJS","Mero","Santos","Mar",36243.134594312702]
[null,7,"7-BUZ-14DA-RJS","Búzios/Tambuatá","Santos","Mar",34066.330304603704]
[null,8,"7-BUZ-25-RJS","Búzios/Tambuatá","Santos","Mar",32578.5635967833]
[null,9,"7-SPH-20D-SPS","Nordeste De Sapinhoá/Noroeste De Sapinhoa/Sapinhoá/Sudoeste De Sapinhoá","Santos","Mar",32570.566696707101]
[null,10,"9-BUZ-4-RJS","Búzios/Tambuatá","Santos","Mar",32323.0849328447]
[null,11,"7-BBG-2D-RJS","Berbigão","Santos","Mar",31155.738099558901]
[null,12,"7-LL-15D-RJS","Anc_Lula/Lula/Sul De Lula","Santos","Mar",30939.909590667899]
[null,13,"9-BRSA-1191-RJS","Búzios/Tambuatá","Santos","Mar",30897.531155055]
[null,14,"9-BBG-1D-RJS","Berbigão","Santos","Mar",29416.635406326201]
[null,15,"9-LL-12D-RJS","Anc_Lula/Lula/Sul De Lula","Santos","Mar",28559.225523158901]
[null,16,"7-SPH-17-SPS","Nordeste De Sapinhoá/Noroeste De Sapinhoa/Sapinhoá/Sudoeste De Sapinhoá","Santos","Mar",28233.602229283701]
[null,17,"7-LL-103D-RJS","Lula","Santos","Mar",27987.181346707999]
[null,18,"7-SLL-5-RJS","Anc_Lula/Lula/Sul De Lula","Santos","Mar",27967.523587564901]
[null,19,"8-LL-87D-RJS","Anc_Lula/Lula/Sul De Lula","Santos","Mar",27744.116262268399]
[null,20,"7-LL-61-RJS","Anc_Lula/Lula/Sul De Lula","Santos","Mar",27651.0365047901]
[null,21,"7-LL-80DB-RJS","Anc_Lula/Lula/Sul De Lula","Santos","Mar",27545.125759248502]
[null,22,"9-LL-20D-RJS","Lula","Santos","Mar",27487.742128563001]
[null,23,"9-LL-2-RJS","Lula","Santos","Mar",27082.884460670699]
[null,24,"3-BRSA-1184-RJS","Búzios/Tambuatá","Santos","Mar",27054.310692481999]
[null,25,"7-LL-66-RJS","Anc_Lula/Lula/Sul De Lula","Santos","Mar",26933.868179576701]
[null,26,"7-BUZ-24D-RJS","Búzios/Tambuatá","Santos","Mar",26854.6735907043]
[null,27,"7-LL-51-RJS","Lula","Santos","Mar",26812.046709693001]
[null,28,"3-BRSA-1053-RJS","Búzios/Tambuatá","Santos","Mar",26731.346350789699]
[null,29,"7-SLL-2-RJS","Anc_Lula/Lula/Sul De Lula","Santos","Mar",26573.975109605599]
[null,30,"7-LL-70-RJS","Anc_Lula/Lula/Sul De Lula","Santos","Mar",25378.519350249298]
[]
[]
[null,"Tabela 13. Os 30 poços com maior produção de gás natural (Mm³/d)"]
[]
[null,"Nº","Nome ANP do Poço","Campo","Bacia","Localização","Gás Natural (Mm³/d)"]
[null,1,"3-BRSA-1305A-RJS","Mero","Santos","Mar",2444.1591050000002]
[null,2,"9-LL-2-RJS","Lula","Santos","Mar",1905.6314219999999]
[null,3,"7-BUZ-29D-RJS","Búzios/Tambuatá","Santos","Mar",1890.17030833333]
[null,4,"7-MXL-18HA-SPS","Mexilhão","Santos","Mar",1747.52971]
[null,5,"7-BUZ-12-RJS","Búzios/Tambuatá","Santos","Mar",1733.1860526666701]
[null,6,"7-SPH-5-SPS","Nordeste De Sapinhoá/Noroeste De Sapinhoa/Sapinhoá/Sudoeste De Sapinhoá","Santos","Mar",1694.86907833333]
[null,7,"7-LL-36A-RJS","Lula","Santos","Mar",1605.9311520000001]
[null,8,"7-BUZ-10-RJS","Búzios/Tambuatá","Santos","Mar",1604.3584213333299]
[null,9,"7-LL-51-RJS","Lula","Santos","Mar",1509.5668663333299]
[null,10,"7-LL-60D-RJS","Anc_Lula/Lula/Sul De Lula","Santos","Mar",1497.24456366667]
[null,11,"7-MXL-17HPA-SPS","Mexilhão","Santos","Mar",1488.4084210000001]
[null,12,"3-BRSA-830-RJS","Lula","Santos","Mar",1456.6500026666699]
[null,13,"9-LL-20D-RJS","Lula","Santos","Mar",1406.51624866667]
[null,14,"9-BUZ-3-RJS","Búzios/Tambuatá","Santos","Mar",1392.5944973333301]
[null,15,"7-LL-73D-RJS","Lula","Santos","Mar",1371.8795176666699]
[null,16,"7-LL-15D-RJS","Anc_Lula/Lula/Sul De Lula","Santos","Mar",1363.8165573333299]
[null,17,"7-BUZ-30-RJS","Búzios/Tambuatá","Santos","Mar",1350.04886733333]
[null,18,"7-LL-103D-RJS","Lula","Santos","Mar",1339.9940203333299]
[null,19,"7-SPH-17-SPS","Nordeste De Sapinhoá/Noroeste De Sapinhoa/Sapinhoá/Sudoeste De Sapinhoá","Santos","Mar",1335.3424030000001]
[null,20,"7-SPH-14D-SPS","Nordeste De Sapinhoá/Noroeste De Sapinhoa/Sapinhoá/Sudoeste De Sapinhoá","Santos","Mar",1292.2041953333301]
[null,21,"7-BUZ-14DA-RJS","Búzios/Tambuatá","Santos","Mar",1291.1058226666701]
[null,22,"7-RO-111HP-RJS","Roncador","Campos","Mar",1275.14766166667]
[null,23,"7-BUZ-25-RJS","Búzios/Tambuatá","Santos","Mar",1253.68629733333]
[null,24,"7-SPH-3-SPS","Nordeste De Sapinhoá/Noroeste De Sapinhoa/Sapinhoá/Sudoeste De Sapinhoá","Santos","Mar",1238.9331010000001]
[null,25,"3-BRSA-883-RJS","Anc_Lula/Lula/Sul De Lula","Santos","Mar",1228.0738060000001]
[null,26,"7-SPH-20D-SPS","Nordeste De Sapinhoá/Noroeste De Sapinhoa/Sapinhoá/Sudoeste De Sapinhoá","Santos","Mar",1199.248055]
[null,27,"9-BRSA-1191-RJS","Búzios/Tambuatá","Santos","Mar",1182.098761]
[null,28,"8-LL-81D-RJS","Anc_Lula/Lula/Sul De Lula","Santos","Mar",1180.8188563333299]
[null,29,"9-LL-12D-RJS","Anc_Lula/Lula/Sul De Lula","Santos","Mar",1150.5815256666699]
[null,30,"9-BUZ-4-RJS","Búzios/Tambuatá","Santos","Mar",1127.05018466667]
[]
[]
[null,"Tabela 14. Os 30 poços com maior produção total (boe/d)"]
[]
[null,"Nº","Nome ANP do Poço","Campo","Bacia","Localização","Produção (boe/d)"]
[null,1,"7-BUZ-29D-RJS","Búzios/Tambuatá","Santos","Mar",63589.111787616101]
[null,2,"7-BUZ-12-RJS","Búzios/Tambuatá","Santos","Mar",60338.675376322302]
{"$rows_left_out":194}
{"sheet":"4. Pandemia_Covid-19","index":4,"n_rows":129,"n_cols":8,"rows_kept":129,"cut":false,"hidden":false,"merged":[]}
[null,"4. PANDEMIA/COVID-19"]
[]
[]
[null,"Tabela 20. Campos com produção interrompida temporariamente"]
[]
[null,"Campos ","Operador","Bacia","Ambiente","Dada de início da interrupção","Data do fim da interrupção"]
[null,"CAIOBA","Petrobras",{"$f":"VLOOKUP(B7,'[1]SIGEP JAN 2020'!$A$7:$AC$395,3)","v":"Sergipe"},"MAR","2020-03-26","-"]
[null,"CAMORIM","Petrobras",{"$f":"VLOOKUP(B8,'[1]SIGEP JAN 2020'!$A$7:$AC$395,3)","v":"Sergipe"},"MAR","2020-03-26","-"]
[null,"GUARICEMA","Petrobras",{"$f":"VLOOKUP(B9,'[1]SIGEP JAN 2020'!$A$7:$AC$395,3)","v":"Sergipe"},"MAR","2020-03-26","-"]
[null,"GAROUPA","Petrobras",{"$f":"VLOOKUP(B10,'[1]SIGEP JAN 2020'!$A$7:$AC$395,3)","v":"Campos"},"MAR","2020-03-26","-"]
[null,"CHERNE","Petrobras",{"$f":"VLOOKUP(B11,'[1]SIGEP JAN 2020'!$A$7:$AC$395,3)","v":"Campos"},"MAR","2020-03-26","-"]
[null,"NAMORADO","Petrobras",{"$f":"VLOOKUP(B12,'[1]SIGEP JAN 2020'!$A$7:$AC$395,3)","v":"Campos"},"MAR","2020-03-26","-"]
[null,"BAGRE","Petrobras",{"$f":"VLOOKUP(B13,'[1]SIGEP JAN 2020'!$A$7:$AC$395,3)","v":"Campos"},"MAR","2020-03-26","-"]
[null,"BARRACUDA","Petrobras",{"$f":"VLOOKUP(B14,'[1]SIGEP JAN 2020'!$A$7:$AC$395,3)","v":"Campos"},"MAR","2020-04-07","28/04/2020*"]
[null,"CARATINGA","Petrobras",{"$f":"VLOOKUP(B15,'[1]SIGEP JAN 2020'!$A$7:$AC$395,3)","v":"Campos"},"MAR","2020-04-04","2020-04-28"]
[null,"ATUM","Petrobras",{"$f":"VLOOKUP(B16,'[1]SIGEP JAN 2020'!$A$7:$AC$395,3)","v":"Ceará"},"MAR","2020-03-26","-"]
[null,"XARÉU","Petrobras",{"$f":"VLOOKUP(B17,'[1]SIGEP JAN 2020'!$A$7:$AC$395,3)","v":"Ceará"},"MAR","2020-03-26","-"]
[null,"CURIMÃ","Petrobras",{"$f":"VLOOKUP(B18,'[1]SIGEP JAN 2020'!$A$7:$AC$395,3)","v":"Ceará"},"MAR","2020-03-26","-"]
[null,"ESPADA","Petrobras",{"$f":"VLOOKUP(B19,'[1]SIGEP JAN 2020'!$A$7:$AC$395,3)","v":"Ceará"},"MAR","2020-03-26","-"]
[null,"UBARANA","Petrobras",{"$f":"VLOOKUP(B20,'[1]SIGEP JAN 2020'!$A$7:$AC$395,3)","v":"Potiguar"},"MAR","2020-03-26","-"]
[null,"OESTE DE UBARANA","Petrobras",{"$f":"VLOOKUP(B21,'[1]SIGEP JAN 2020'!$A$7:$AC$395,3)","v":"Potiguar"},"MAR","2020-03-26","-"]
[null,"AGULHA","Petrobras",{"$f":"VLOOKUP(B22,'[1]SIGEP JAN 2020'!$A$7:$AC$395,3)","v":"Potiguar"},"MAR","2020-03-26","-"]
[null,"AGUILHADA","Petrobras",{"$f":"VLOOKUP(B23,'[1]SIGEP JAN 2020'!$A$7:$AC$395,3)","v":"Sergipe"},"TERRA","2020-03-26","-"]
[null,"ANGELIM","Petrobras",{"$f":"VLOOKUP(B24,'[1]SIGEP JAN 2020'!$A$7:$AC$395,3)","v":"Sergipe"},"TERRA","2020-03-26","-"]
[null,"ARUARI","Petrobras",{"$f":"VLOOKUP(B25,'[1]SIGEP JAN 2020'!$A$7:$AC$395,3)","v":"Sergipe"},"TERRA","2020-03-26","-"]
[null,"ATALAIA SUL","Petrobras",{"$f":"VLOOKUP(B26,'[1]SIGEP JAN 2020'!$A$7:$AC$395,3)","v":"Sergipe"},"TERRA","2020-03-26","-"]
[null,"BREJO GRANDE","Petrobras",{"$f":"VLOOKUP(B27,'[1]SIGEP JAN 2020'!$A$7:$AC$395,3)","v":"Sergipe"},"TERRA","2020-03-26","-"]
[null,"ILHA PEQUENA","Petrobras",{"$f":"VLOOKUP(B28,'[1]SIGEP JAN 2020'!$A$7:$AC$395,3)","v":"Sergipe"},"TERRA","2020-03-26","-"]
[null,"BARRINHA","Petrobras",{"$f":"VLOOKUP(B29,'[1]SIGEP JAN 2020'!$A$7:$AC$395,3)","v":"Potiguar"},"TERRA","2020-03-26","-"]
[null,"BARRINHA LESTE","Petrobras",{"$f":"VLOOKUP(B30,'[1]SIGEP JAN 2020'!$A$7:$AC$395,3)","v":"Potiguar"},"TERRA","2020-03-26","-"]
[null,"BARRINHA SUDOESTE","Petrobras",{"$f":"VLOOKUP(B31,'[1]SIGEP JAN 2020'!$A$7:$AC$395,3)","v":"Potiguar"},"TERRA","2020-03-26","-"]
[null,"POÇO VERDE","Petrobras",{"$f":"VLOOKUP(B32,'[1]SIGEP JAN 2020'!$A$7:$AC$395,3)","v":"Potiguar"},"TERRA","2020-03-26","-"]
[null,"SERRA DO MEL","Petrobras",{"$f":"VLOOKUP(B33,'[1]SIGEP JAN 2020'!$A$7:$AC$395,3)","v":"Potiguar"},"TERRA","2020-03-26","-"]
[null,"SERRA VERMELHA","Petrobras",{"$f":"VLOOKUP(B34,'[1]SIGEP JAN 2020'!$A$7:$AC$395,3)","v":"Potiguar"},"TERRA","2020-03-26","-"]
[null,"VALE DO QUIRICÓ","Energizzi",{"$f":"VLOOKUP(B35,'[1]SIGEP JAN 2020'!$A$7:$AC$395,3)","v":"Recôncavo"},"TERRA","2020-03-26","-"]
[null,"LAGOA DO PAULO SUL",{"$f":"VLOOKUP(B36,'[1]SIGEP JAN 2020'!$A$7:$AC$395,4)","v":"Recôncavo E&P"},{"$f":"VLOOKUP(B36,'[1]SIGEP JAN 2020'!$A$7:$AC$395,3)","v":"Recôncavo"},"TERRA","2020-03-26","-"]
[null,"JURITI",{"$f":"VLOOKUP(B37,'[1]SIGEP JAN 2020'!$A$7:$AC$395,4)","v":"Recôncavo E&P"},{"$f":"VLOOKUP(B37,'[1]SIGEP JAN 2020'!$A$7:$AC$395,3)","v":"Recôncavo"},"TERRA","2020-03-26","-"]
[null,"BREJINHO",{"$f":"VLOOKUP(B38,'[1]SIGEP JAN 2020'!$A$7:$AC$395,4)","v":"Petrobras"},{"$f":"VLOOKUP(B38,'[1]SIGEP JAN 2020'!$A$7:$AC$395,3)","v":"Recôncavo"},"TERRA","2020-04-16","-"]
[null,"CANABRAVA",{"$f":"VLOOKUP(B39,'[1]SIGEP JAN 2020'!$A$7:$AC$395,4)","v":"Petrobras"},{"$f":"VLOOKUP(B39,'[1]SIGEP JAN 2020'!$A$7:$AC$395,3)","v":"Recôncavo"},"TERRA","2020-04-16","-"]
[null,"MANATI","Petrobras",{"$f":"VLOOKUP(B40,'[1]SIGEP JAN 2020'!$A$7:$AC$395,3)","v":"Camamu"},"MAR","2020-02-22","-"]
[null,"PEROÁ",{"$f":"VLOOKUP(B41,'[1]SIGEP JAN 2020'!$A$7:$AC$395,4)","v":"Petrobras"},{"$f":"VLOOKUP(B41,'[1]SIGEP JAN 2020'!$A$7:$AC$395,3)","v":"Espírito Santo"},"MAR","2020-04-03","-"]
[null,"CANGOÁ",{"$f":"VLOOKUP(B42,'[1]SIGEP JAN 2020'!$A$7:$AC$395,4)","v":"Petrobras"},{"$f":"VLOOKUP(B42,'[1]SIGEP JAN 2020'!$A$7:$AC$395,3)","v":"Espírito Santo"},"MAR","2020-04-03","-"]
[null,"MERLUZA","Petrobras",{"$f":"VLOOKUP(B43,'[1]SIGEP JAN 2020'!$A$7:$AC$395,3)","v":"Santos"},"MAR","2020-03-27","-"]
[null,"LAGOSTA","Petrobras",{"$f":"VLOOKUP(B44,'[1]SIGEP JAN 2020'!$A$7:$AC$395,3)","v":"Santos"},"MAR","2020-03-27","-"]
[]
[]
[null,"TOTAL  DE CAMPOS INTERROMPIDOS",null,38]
[]
[null,"TOTAL DE CAMPOS QUE RETORNARAM A OPERAR",null,2]
[]
[null,"TOTAL DE CAMPOS QUE PERMANECEM COM PRODUÇÃO INTERROMPIDOS",null,{"$f":"D47-D49","v":36}]
[]
[]
[]
[]
[null,"Tabela 21. Plataformas com produção temporariamente interrompida "]
[]
[]
[null,"Plataformas com produção temporariamente interrompidas","Nome da UEP","Campo","Tipo","Ambiente","Dada de início da interrupção","Data do fim da interrupção"]
[null,"PCB-1","PLATAFORMA DE CAIOBA 1","CAIOBA","FIXA","MAR","2020-03-26","-"]
[null,"PCB-2","PLATAFORMA DE CAIOBA 2","CAIOBA","FIXA","MAR","2020-03-26","-"]
[null,"PCB-3","PLATAFORMA DE CAIOBA 3","CAIOBA","FIXA","MAR","2020-03-26","-"]
[null,"PCB-4","PLATAFORMA DE CAIOBA 4","CAIOBA","FIXA","MAR","2020-03-26","-"]
[null,"PCM-1","PLATAFORMA DE CAMORIM 1","CAMORIM","FIXA","MAR","2020-03-26","-"]
[null,"PCM-2","PLATAFORMA DE CAMORIM 2","CAMORIM","FIXA","MAR","2020-03-26","-"]
[null,"PCM-3","PLATAFORMA DE CAMORIM 3","CAMORIM","FIXA","MAR","2020-03-26","-"]
[null,"PCM-4","PLATAFORMA DE CAMORIM 4","CAMORIM","FIXA","MAR","2020-03-26","-"]
[null,"PCM-5","PLATAFORMA DE CAMORIM 5","CAMORIM","FIXA","MAR","2020-03-26","-"]
[null,"PCM-6","PLATAFORMA DE CAMORIM 6","CAMORIM","FIXA","MAR","2020-03-26","-"]
[null,"PCM-7","PLATAFORMA DE CAMORIM 7","CAMORIM","FIXA","MAR","2020-03-26","-"]
[null,"PCM-8","PLATAFORMA DE CAMORIM 8","CAMORIM","FIXA","MAR","2020-03-26","-"]
[null,"PCM-9","PLATAFORMA DE CAMORIM 9","CAMORIM","FIXA","MAR","2020-03-26","-"]
[null,"PCM-10","PLATAFORMA DE CAMORIM 10","CAMORIM","FIXA","MAR","2020-03-26","-"]
[null,"PGA-1","PLATAFORMA DE GUARICEMA 1","GUARICEMA","FIXA","MAR","2020-03-26","-"]
[null,"PGA-2","PLATAFORMA DE GUARICEMA 2","GUARICEMA","FIXA","MAR","2020-03-26","-"]
[null,"PGA-3","PLATAFORMA DE GUARICEMA 3","GUARICEMA","FIXA","MAR","2020-03-26","-"]
[null,"PGA-4","PLATAFORMA DE GUARICEMA 4","GUARICEMA","FIXA","MAR","2020-03-26","-"]
[null,"PGA-5","PLATAFORMA DE GUARICEMA 5","GUARICEMA","FIXA","MAR","2020-03-26","-"]
[null,"PGA-8","PLATAFORMA DE GUARICEMA 8","GUARICEMA","FIXA","MAR","2020-03-26","-"]
[null,"PRB-1","PLATAFORMA DE ROBALO 1","ROBALO","FIXA","MAR","2020-03-26","-"]
{"$rows_left_out":49}