Empresa,TipoDaAutorizacao,TipoDeInstalacao,NomeDaInstalacao,Gasoduto,Trecho,Extensao,Diametro,Capacidade,TipoDoAto,NumeroDoAto,DataDaOutorga,DataDePublicacaoDOU,Observacao
Petróleo Brasileiro S.A - PETROBRAS,Operação (Provisória),Gasoduto de Transporte,Gasoduto Guamaré-Pecém,Gasoduto Guamaré - Pecém,,213,,,Autorização,57,1998-12-23T02:00:00Z,1998-12-24T02:00:00Z,
Transportadora Brasileira Gasoduto Bolívia-Brasil - TBG,Operação,Gasoduto de Transporte,Gasoduto Bolívia - Brasil,Gasoduto Bolívia - Brasil (GASBOL),Corumbá (MT) - Guararema (SP),,,,Autorização,13,1999-02-03T02:00:00Z,1999-02-04T02:00:00Z,
Gasocidente do Mato Grosso,Construção,Gasoduto de Transporte,Gasoduto Lateral Cuiabá,Gasoduto Lateral Cuiabá,,266,18,2.8,Autorização,24,1999-03-17T03:00:00Z,1999-03-18T03:00:00Z,
Transportadora Sulbrasileira de Gás S.A. – TSB,Construção,Gasoduto de Transporte,Gasoduto Uruguaiana-Porto Alegre,Gasoduto Uruguaiana - Porto Alegre,Trecho I: Fronteira Brasil-Argentina/Uruguaiana(RS) ,25,24,12,Autorização,123,1999-11-09T02:00:00Z,1999-11-10T02:00:00Z,
Transportadora Sulbrasileira de Gás S.A. – TSB,Construção,Gasoduto de Transporte,Gasoduto Uruguaiana-Porto Alegre,Gasoduto Uruguaiana - Porto Alegre,Trecho III: Canoas(RS)/Triunfo(RS),25,24,12,Autorização,123,1999-11-09T02:00:00Z,1999-11-10T02:00:00Z,
Transportadora Brasileira Gasoduto Bolívia-Brasil - TBG,Operação,Gasoduto de Transporte,Gasoduto Bolívia - Brasil,Gasoduto Bolívia - Brasil (GASBOL),Paulínia(SP)/Canoas(RS),,,,Autorização,37,2000-03-22T03:00:00Z,2000-03-23T03:00:00Z,
Petrobras Transporte S.A. - TRANSPETRO,Operação,Gasoduto de Transporte,Gasoduto Guamaré-Pecém,Gasoduto Guamaré - Pecém,Trecho I: Guamaré(RN)/Aracati(CE)                                                             ,213,12,,Autorização,45,2000-03-22T03:00:00Z,2000-03-23T03:00:00Z,revogada pela Aut. N° 937/2017
Petrobras Transporte S.A. - TRANSPETRO,Operação,Gasoduto de Transporte,Gasoduto Guamaré-Pecém,Gasoduto Guamaré - Pecém,Trecho III: Aracati(CE)/Pecém(CE),170,10,,Autorização,45,2000-03-22T03:00:00Z,2000-03-23T03:00:00Z,revogada pela Aut. N° 937/2017
Transportadora Sulbrasileira de Gás S.A. – TSB,Operação,Gasoduto de Transporte,Gasoduto Uruguaiana-Porto Alegre,Gasoduto Uruguaiana - Porto Alegre,Trecho I: Fronteira Brasil-Argentina/Uruguaiana(RS) ,25,24,12,Autorização,91,2000-06-06T03:00:00Z,2000-06-07T03:00:00Z,
Transportadora Sulbrasileira de Gás S.A. – TSB,Construção,Gasoduto de Transporte,Gasoduto Uruguaiana-Porto Alegre,Gasoduto Uruguaiana - Porto Alegre,Trecho II: Uruguaiana(RS) - Triunfo (RS),564,24,12,Autorização,115,2000-07-11T03:00:00Z,2000-07-12T03:00:00Z,
Transportadora Sulbrasileira de Gás S.A. – TSB,Operação,Gasoduto de Transporte,Gasoduto Uruguaiana-Porto Alegre,Gasoduto Uruguaiana - Porto Alegre,Trecho III: Canoas(RS)/Triunfo(RS),25,24,12,Autorização,116,2000-07-11T03:00:00Z,2000-07-12T03:00:00Z,
Petróleo Brasileiro S.A - PETROBRAS,Construção,Gasoduto de Transferência,Gasoduto Camaçari - FAFEN (Gasod. de Transferência),Gasoduto Camaçari - FAFEN ,,4,14,2.1,Autorização,77,2001-06-12T03:00:00Z,2001-06-13T03:00:00Z,
Gasocidente do Mato Grosso,Operação,Gasoduto de Transporte,Gasoduto Lateral Cuiabá,Gasoduto Lateral Cuiabá,,267,18,2.8,Autorização,118,2001-07-17T03:00:00Z,2001-07-18T03:00:00Z,
Petróleo Brasileiro S.A - PETROBRAS,Operação,Compressores de Gás,Compressores de Gás,,"Terminal de Cabiúnas, Macaé (RJ)",,,,Autorização,136,2001-08-07T03:00:00Z,2001-08-08T03:00:00Z,
Petróleo Brasileiro S.A - PETROBRAS,Construção,Gasoduto de Transferência,Gasoduto Miranga-Santiago (Gasod. de Transferência),Gasoduto Miranga - Santiago ,,20,12,1.9,Autorização,127,2001-08-01T03:00:00Z,2001-08-08T03:00:00Z,
Petrobras Transporte S.A. - TRANSPETRO,Operação,Gasoduto de Transporte,Gasoduto Pilar-Cabo,Gasoduto Pilar - Cabo (GASALP),,203.6,12,1.7,Autorização,120,2001-07-25T03:00:00Z,2001-08-08T03:00:00Z,
Petrobras Transporte S.A. - TRANSPETRO,Construção,Ponto de Entrega,Ponto de Entrega Mossoró                                         (Gasoduto Guamaré - Pecém),Gasoduto Guamaré - Pecém,,,,,Autorização,135,2001-08-07T03:00:00Z,2001-08-08T03:00:00Z,
Petróleo Brasileiro S.A - PETROBRAS,Construção,Ponto de Entrega,Ponto de Entrega UTE Macaé Merchant,,,,,,Autorização,153,2001-09-04T03:00:00Z,2001-09-05T03:00:00Z,
Petróleo Brasileiro S.A - PETROBRAS,Construção,Ponto de Entrega,Ponto de Entrega UTE Juiz de Fora,,,,,,Autorização,157,2001-09-11T03:00:00Z,2001-09-12T03:00:00Z,
Petróleo Brasileiro S.A - PETROBRAS,Construção,Ponto de Entrega,Ponto de Entrega UTE RioGen Merchant - Japeri (RJ),,,,,,Autorização,161,2001-09-18T03:00:00Z,2001-09-19T03:00:00Z,
Petróleo Brasileiro S.A - PETROBRAS,Operação,Ponto de Entrega,Ponto de Entrega UTE RioGen Merchant - Japeri (RJ),,,,,,Autorização,169,2001-09-24T03:00:00Z,2001-09-25T03:00:00Z,
Petróleo Brasileiro S.A - PETROBRAS,Construção,Sistema de Recompressão,Sistema de Recompressão                                             Gasoduto Lagoa Parda-Vitória (ES),Gasoduto Lagoa Parda - Vitória,,,,,Autorização,167,2001-09-24T03:00:00Z,2001-09-25T03:00:00Z,
Petróleo Brasileiro S.A - PETROBRAS,Operação,Ponto de Entrega,Ponto de Entrega UTE Macaé Merchant,,interligação dos GASDUC I e II em Macaé (RJ),,,,Autorização,194,2001-11-08T02:00:00Z,2001-11-09T02:00:00Z,
Petróleo Brasileiro S.A - PETROBRAS,Operação,Ponto de Entrega,Ponto de Entrega UTE Juiz de Fora,,,,,,Autorização,200,2001-11-21T02:00:00Z,2001-11-26T02:00:00Z,
Petrobras Transporte S.A. - TRANSPETRO,Operação,Ponto de Entrega,Ponto de Entrega Mossoró                                         (Gasoduto Guamaré - Pecém),Gasoduto Guamaré - Pecém,,,,,Autorização,216,2001-12-12T02:00:00Z,2001-12-13T02:00:00Z,
Petróleo Brasileiro S.A - PETROBRAS,Construção,Ramal de Interligação,Ramal de Interligação no Ponto de Entrega de Betim (MG) - UTE Ibirité (MG),,,1.288,12,2.0,Autorização,212,2001-12-12T02:00:00Z,2001-12-13T02:00:00Z,
Petróleo Brasileiro S.A - PETROBRAS,Construção,Estação de Compressão,Estação de Compressão de Mantiqueira   Gasoduto Rio- Belo Horizonte,Gasoduto Rio de Janeiro - Belo Horizonte (GASBEL),,,,,Autorização,19,2002-01-23T02:00:00Z,2002-01-24T02:00:00Z,
Petróleo Brasileiro S.A - PETROBRAS,Operação,Gasoduto de Transferência,Gasoduto Camaçari - FAFEN (Gasod. de Transferência),Gasoduto Camaçari - FAFEN ,,4,14,2.1,Autorização,17,2002-01-23T02:00:00Z,2002-01-24T02:00:00Z,
Petróleo Brasileiro S.A - PETROBRAS,Operação,Sistema de Recompressão,Sistema de Recompressão                                             Gasoduto Lagoa Parda-Vitória (ES),Gasoduto Lagoa Parda - Vitória,,,,,Autorização,18,2002-01-23T02:00:00Z,2002-01-24T02:00:00Z,
Petróleo Brasileiro S.A - PETROBRAS,Construção,Ponto de Entrega,Ponto de Entrega de Guapimirim                                             (Gasoduto Cabiúnas - Reduc / GASDUC),Gasoduto Cabiúnas - REDUC (GASDUC),,,,,Autorização,30,2002-01-30T02:00:00Z,2002-01-31T02:00:00Z,
Petróleo Brasileiro S.A - PETROBRAS,Construção,Ponto de Entrega,Ponto de Entrega de São Bernardo do Campo (Gasoduto GASAN),Gasoduto GASAN,,,,,Autorização,37,2002-02-21T03:00:00Z,2002-02-22T03:00:00Z,
Petróleo Brasileiro S.A - PETROBRAS,Operação,Ramal de Interligação,Ramal de Interligação no Ponto de Entrega de Betim (MG) - UTE Ibirité (MG),,,1.288,12,2.0,Autorização,40,2002-02-27T03:00:00Z,2002-02-28T03:00:00Z,
Transportadora Brasileira Gasoduto Bolívia-Brasil - TBG,Construção,Ponto de Entrega,Ponto de Entrega de Canoas                                       (Gasoduto Bolívia-Brasil),Gasoduto Bolívia - Brasil (GASBOL),,,,,Autorização,46,2002-03-06T03:00:00Z,2002-03-07T03:00:00Z,
Petróleo Brasileiro S.A - PETROBRAS,Construção,Estação de Compressão,Estação de Compressão de Tapinhoã   Gasoduto Rio- Belo Horizonte,Gasoduto Rio de Janeiro - Belo Horizonte (GASBEL),,,,,Autorização,73,2002-04-17T03:00:00Z,2002-04-19T03:00:00Z,
Transportadora Brasileira Gasoduto Bolívia-Brasil - TBG,Construção,Ponto de Entrega,Ponto de Entrega de Três Lagoas (MS)                                       (Gasoduto Bolívia-Brasil),Gasoduto Bolívia - Brasil (GASBOL),,,,,Autorização,91,2002-04-26T03:00:00Z,2002-04-29T03:00:00Z,
Petróleo Brasileiro S.A - PETROBRAS,Operação,Estação de Compressão,Estação de Compressão de Mantiqueira   Gasoduto Rio- Belo Horizonte,Gasoduto Rio de Janeiro - Belo Horizonte (GASBEL),,,,,Autorização,102,2002-05-08T03:00:00Z,2002-05-09T03:00:00Z,
Nova Transportadora do Nordeste,Construção,Gasoduto de Transporte,Gasoduto Candeias - Aratu,Gasoduto Candeias - Aratu,UPGN-S Candeias (BA) - Dow Química (BA),15.4,14,,Autorização,129,2002-06-06T03:00:00Z,2002-06-07T03:00:00Z,
Petróleo Brasileiro S.A - PETROBRAS,Operação,Gasoduto de Transferência,Gasoduto Miranga-Santiago (Gasod. de Transferência),Gasoduto Miranga - Santiago ,Trecho Miranga (BA) - Catu/Santiago (BA),20,12,1.9,Autorização,143,2002-06-12T03:00:00Z,2002-06-13T03:00:00Z,
Transportadora Brasileira Gasoduto Bolívia-Brasil - TBG,Operação,Ponto de Entrega,Ponto de Entrega de Canoas                                       (Gasoduto Bolívia-Brasil),Gasoduto Bolívia - Brasil (GASBOL),,,,,Autorização,145,2002-06-19T03:00:00Z,2002-06-20T03:00:00Z,
Petróleo Brasileiro S.A - PETROBRAS,Construção,Ponto de Entrega,Ponto de Entrega de Duque de Caxias ( TERMORIO)        (Gasodutos GASDUC I e II e GASVOL),"Gasodutos GASDUC I, GASDUC II e GASVOL",,,,,Autorização,155,2002-06-26T03:00:00Z,2002-06-27T03:00:00Z,
Petróleo Brasileiro S.A - PETROBRAS,Construção,Estação de Compressão,Estação de Compressão de Volta Redonda   Gasoduto Rio- São Paulo,Gasoduto Rio de Janeiro - São Paulo (GASPAL),,,,,Autorização,178,2002-07-08T03:00:00Z,2002-07-09T03:00:00Z,
Petróleo Brasileiro S.A - PETROBRAS,Construção,Ponto de Entrega,Ponto de Entrega de Barbacena (MG)                (Gasoduto GASBEL),Gasoduto Rio de Janeiro - Belo Horizonte (GASBEL),,,,,Autorização,190,2002-07-19T03:00:00Z,2002-07-22T03:00:00Z,
Transportadora Brasileira Gasoduto Bolívia-Brasil - TBG,Construção,Estação de Compressão,Estação de Compressão de Atibaia (SP)                                       (Gasoduto Bolívia-Brasil),Gasoduto Bolívia - Brasil (GASBOL),,,,,Autorização,206,2002-08-08T03:00:00Z,2002-08-09T03:00:00Z,
Transportadora Brasileira Gasoduto Bolívia-Brasil - TBG,Construção,Estação de Compressão,Estação de Compressão de Guararema (SP)                                       (Gasoduto Bolívia-Brasil),Gasoduto Bolívia - Brasil (GASBOL),,,,,Autorização,205,2002-08-08T03:00:00Z,2002-08-09T03:00:00Z,
Transportadora Brasileira Gasoduto Bolívia-Brasil - TBG,Operação,Ponto de Entrega,Ponto de Entrega de Três Lagoas (MS)                                       (Gasoduto Bolívia-Brasil),Gasoduto Bolívia - Brasil (GASBOL),,,,,Autorização,209,2002-08-14T03:00:00Z,2002-08-15T03:00:00Z,
Petróleo Brasileiro S.A - PETROBRAS,Operação,Gasoduto de Transferência,Gasoduto Santiago-Camaçari (Gasod. de Transferência),Gasoduto Santiago - Camaçari ,UPGN Catu(Santiago) (BA) - Camaçari (BA),32,10,0.6,Autorização,257,2002-10-18T03:00:00Z,2002-10-21T03:00:00Z,
Petróleo Brasileiro S.A - PETROBRAS,Construção,Ponto de Entrega,Ponto de Entrega de Paracambi (RJ)                (Gasoduto GASVOL),Gasoduto REDUC - Volta Redonda (GASVOL),,,,,Autorização,275,2002-11-18T02:00:00Z,2002-11-19T02:00:00Z,
Petróleo Brasileiro S.A - PETROBRAS,Construção,Ponto de Entrega,Ponto de Entrega de Macaé (RJ)   (Norte Fluminense)             (Gasoduto GASDUC I e II),Gasodutos GASDUC I e GASDUC II,,,,,Autorização,282,2002-11-27T02:00:00Z,2002-11-28T02:00:00Z,
Petróleo Brasileiro S.A - PETROBRAS,Construção,Ponto de Entrega,Ponto de Entrega de Macaé (RJ)   (Macaé Merchant)             (Gasoduto GASDUC I e II),Gasodutos GASDUC I e GASDUC II,,,,,Autorização,298,2002-12-13T02:00:00Z,2002-12-16T02:00:00Z,
Petróleo Brasileiro S.A - PETROBRAS,Operação,Ponto de Entrega,Ponto de Entrega de Barbacena (MG)                (Gasoduto GASBEL),Gasoduto Rio de Janeiro - Belo Horizonte (GASBEL),,,,,Autorização,12,2003-01-06T02:00:00Z,2003-01-07T02:00:00Z,
Petróleo Brasileiro S.A - PETROBRAS,Reclassificação,Gasoduto de Transferência,Gasoduto Aratu-Camaçari                            (transporte para transferência),Gasoduto Aratu - Camaçari,Estação Aratu (BA) - Estação Camaçari (BA),20,10,,Despacho,289,2003-03-21T03:00:00Z,2003-03-24T03:00:00Z,
Transportadora Brasileira Gasoduto Bolívia-Brasil - TBG,Construção,Ponto de Entrega,Ponto de Entrega de Indaiatuba (SP)                                       (Gasoduto Bolívia-Brasil),Gasoduto Bolívia - Brasil (GASBOL),,,,,Autorização,122,2003-06-05T03:00:00Z,2003-06-06T03:00:00Z,
Petróleo Brasileiro S.A - PETROBRAS,Operação,Estação de Compressão,Estação de Compressão de Tapinhoã          (Gasoduto Rio- Belo Horizonte),Gasoduto Rio de Janeiro - Belo Horizonte (GASBEL),,,,,Autorização,147,2003-07-03T03:00:00Z,2003-07-04T03:00:00Z,
Petrobras Transporte S.A. - TRANSPETRO,Construção,Ponto de Entrega,Ponto de Entrega de Aracati (CE) e ramal              (Gasoduto GASFOR),Gasoduto Guamaré - Pecém (GASFOR),,,,,Autorização,144,2003-07-03T03:00:00Z,2003-07-04T03:00:00Z,
Petrobras Transporte S.A. - TRANSPETRO,Construção,Ponto de Entrega,Ponto de Entrega de Caucaia (CE)                           (Gasoduto GASFOR),Gasoduto Guamaré - Pecém (GASFOR),,,,,Autorização,145,2003-07-03T03:00:00Z,2003-07-04T03:00:00Z,
Petrobras Transporte S.A. - TRANSPETRO,Construção,Ponto de Entrega,Ponto de Entrega e ramal  (Termofortaleza)            (Gasoduto GASFOR),Gasoduto Guamaré - Pecém (GASFOR),,,,,Autorização,146,2003-07-03T03:00:00Z,2003-07-04T03:00:00Z,
Petrobras Transporte S.A. - TRANSPETRO,Construção,Ponto de Entrega,Ponto de Entrega e ramal  (Termopernambuco)            (Gasoduto GASALP),Gasoduto Pilar - Cabo (GASALP),,,,,Autorização,148,2003-07-11T03:00:00Z,2003-07-14T03:00:00Z,
Nova Transportadora do Nordeste,Operação,Gasoduto de Transporte,Gasoduto Candeias - Aratu,Gasoduto Candeias - Aratu,UPGN-S Candeias (BA) - Dow Química (BA),15.4,14,,Autorização,161,2003-07-18T03:00:00Z,2003-07-21T03:00:00Z,
Petróleo Brasileiro S.A - PETROBRAS,Operação,Ponto de Entrega,Ponto de Entrega de Macaé (RJ)   (Norte Fluminense)             (Gasoduto GASDUC I e II),Gasodutos GASDUC I e GASDUC II,,,,,Autorização,188,2003-08-25T03:00:00Z,2003-08-26T03:00:00Z,
Petrobras Transporte S.A. - TRANSPETRO,Operação,Ponto de Entrega,Ponto de Entrega e ramal  (Termofortaleza)            (Gasoduto GASFOR),Gasoduto Guamaré - Pecém (GASFOR),,,,,Autorização,190,2003-08-25T03:00:00Z,2003-08-27T03:00:00Z,
Transportadora Brasileira Gasoduto Bolívia-Brasil - TBG,Operação,Estação de Compressão,Estação de Compressão de Atibaia (SP)                                       (Gasoduto Bolívia-Brasil),Gasoduto Bolívia - Brasil (GASBOL),,,,,Autorização,196,2003-08-29T03:00:00Z,2003-09-01T03:00:00Z,"Revogada pelo Despacho N.º 581, de 12/04/10"
Transportadora Brasileira Gasoduto Bolívia-Brasil - TBG,Operação,Estação de Compressão,Estação de Compressão de Guararema (SP)                                       (Gasoduto Bolívia-Brasil),Gasoduto Bolívia - Brasil (GASBOL),,,,,Autorização,197,2003-08-29T03:00:00Z,2003-09-01T03:00:00Z,"Revogada pelo Despacho N.º 581, de 12/04/10"
Petrobras Transporte S.A. - TRANSPETRO,Construção,Estação de Compressão,Estação de Compressão de Aracati (CE)                                       (Gasoduto Guamaré-Pecém   GASFOR),Gasoduto Guamaré - Pecém (GASFOR),,,,,Autorização,203,2003-09-05T03:00:00Z,2003-09-09T03:00:00Z,
Petrobras Transporte S.A. - TRANSPETRO,Construção,Estação de Compressão,"Estação de Compressão de Macaíba (RN)                                       (Gasoduto Guamaré-Cabo   ""Nordestão"")",Gasoduto Guamaré - Cabo (Nordestão),,,,,Autorização,205,2003-09-05T03:00:00Z,2003-09-09T03:00:00Z,
Petrobras Transporte S.A. - TRANSPETRO,Construção,Estação de Compressão,"Estação de Compressão de Santa Rita (PB)                                       (Gasoduto Guamaré-Cabo   ""Nordestão"")",Gasoduto Guamaré - Cabo (Nordestão),,,,,Autorização,204,2003-09-05T03:00:00Z,2003-09-09T03:00:00Z,
Petrobras Transporte S.A. - TRANSPETRO,Construção,Estação de Compressão,Estação de Compressão de RECAP/Mauá (SP)                        (Gasoduto GASAN),Gasoduto GASAN,,,,,Autorização,213,2003-09-17T03:00:00Z,2003-09-18T03:00:00Z,
Petrobras Transporte S.A. - TRANSPETRO,Operação,Ponto de Entrega,Ponto de Entrega e ramal  (Termopernambuco)            (Gasoduto GASALP),Gasoduto Pilar - Cabo (GASALP),,,,,Autorização,250,2003-11-14T02:00:00Z,2003-11-17T02:00:00Z,
Petrobras Transporte S.A. - TRANSPETRO,Construção,Ponto de Entrega,modernização do Ponto de Entrega de Juiz de Fora (MG)            (Gasoduto GASBEL),Gasoduto Rio de Janeiro - Belo Horizonte (GASBEL),,,,,Autorização,256,2003-11-18T02:00:00Z,2003-11-20T02:00:00Z,
Petrobras Transporte S.A. - TRANSPETRO,Construção,Ponto de Entrega,modernização Ponto de Entrega RECAP em Capuava(SP)            (Gasoduto GASPAL),Gasoduto Rio de Janeiro - São Paulo (GASPAL),,,,,Autorização,259,2003-11-27T02:00:00Z,2003-11-28T02:00:00Z,
Transportadora Brasileira Gasoduto Bolívia-Brasil - TBG,Operação,Ponto de Entrega,Ponto de Entrega de Indaiatuba (SP)                                       (Gasoduto Bolívia-Brasil),Gasoduto Bolívia - Brasil (GASBOL),,,,,Autorização,275,2003-12-11T02:00:00Z,2003-12-12T02:00:00Z,
Petrobras Transporte S.A. - TRANSPETRO,Operação,Estação de Compressão,Estação de Compressão de Aracati (CE)                                       (Gasoduto Guamaré-Pecém   GASFOR),Gasoduto Guamaré - Pecém (GASFOR),,,,,Autorização,4,2004-01-06T02:00:00Z,2004-01-08T02:00:00Z,
Petrobras Transporte S.A. - TRANSPETRO,Construção,Ponto de Entrega,modernização Ponto de Entrega em Suzano (SP)            (Gasoduto GASPAL),Gasoduto Rio de Janeiro - São Paulo (GASPAL),,,,,Autorização,7,2004-01-23T02:00:00Z,2004-01-26T02:00:00Z,
Petrobras Transporte S.A. - TRANSPETRO,Construção,Ponto de Entrega,modernização Ponto de Entrega REVAP em São José dos Campos (SP)            (Gasoduto GASPAL),Gasoduto Rio de Janeiro - São Paulo (GASPAL),,,,,Autorização,57,2004-03-18T03:00:00Z,2004-03-22T03:00:00Z,
Consórcio Malhas Sudeste Nordeste,Operação,Ponto de Entrega,Ponto de Entrega de Barbacena (MG)                (Gasoduto GASBEL),Gasoduto Rio de Janeiro - Belo Horizonte (GASBEL),,,,,Autorização,87,2004-04-22T03:00:00Z,2004-04-23T03:00:00Z,
Petrobras Transporte S.A. - TRANSPETRO,Operação,Estação de Compressão,"Estação de Compressão de Macaíba (RN)                                       (Gasoduto Guamaré-Cabo   ""Nordestão"")",Gasoduto Guamaré - Cabo (Nordestão),,,,,Autorização,128,2004-06-16T03:00:00Z,2004-06-18T03:00:00Z,
Petrobras Transporte S.A. - TRANSPETRO,Operação,Estação de Compressão,Estação de Compressão de RECAP/Mauá (SP)                        (Gasoduto GASAN),Gasoduto GASAN,,,,,Autorização,129,2004-06-16T03:00:00Z,2004-06-18T03:00:00Z,
Petrobras Transporte S.A. - TRANSPETRO,Operação,Estação de Compressão,"Estação de Compressão de Santa Rita (PB)                                       (Gasoduto Guamaré-Cabo   ""Nordestão"")",Gasoduto Guamaré - Cabo (Nordestão),,,,,Autorização,127,2004-06-16T03:00:00Z,2004-06-18T03:00:00Z,
Petrobras Transporte S.A. - TRANSPETRO,Construção,Gasoduto de Transporte,Variante do Gasoduto Guamaré - Cabo (Nordestão),Gasoduto Guamaré - Cabo (Nordestão),"em Pernambuco, do km 382,5 ao km 403,3",31.8,12,2.72,Autorização,188,2004-07-14T03:00:00Z,2004-07-19T03:00:00Z,
Consórcio Malhas Sudeste Nordeste,Construção,Gasoduto de Transporte,Gasoduto Campinas-Rio                                            ,Gasoduto Campinas - Rio de Janeiro (GASCAR),Refinaria do Planalto (REPLAN) (SP) / terminal de Japeri (RJ),455,28,5.8,Autorização,230,2004-08-03T03:00:00Z,2004-08-05T03:00:00Z,
Petrobras Transporte S.A. - TRANSPETRO,Construção,Ponto de Entrega,modernização Ponto de Entrega em Barra Mansa (RJ)            (Gasoduto GASPAL),Gasoduto Rio de Janeiro - São Paulo (GASPAL),,,,,Autorização,231,2004-08-03T03:00:00Z,2004-08-05T03:00:00Z,
Petrobras Transporte S.A. - TRANSPETRO,Construção,Ponto de Entrega,modernização Ponto de Entrega em Piraí (RJ)            (Gasoduto GASVOL),Gasoduto REDUC - Volta Redonda (GASVOL),,,,,Autorização,233,2004-08-03T03:00:00Z,2004-08-05T03:00:00Z,
Petrobras Transporte S.A. - TRANSPETRO,Construção,Ponto de Entrega,modernização Ponto de Entrega em Resende (RJ)            (Gasoduto GASPAL),Gasoduto Rio de Janeiro - São Paulo (GASPAL),,,,,Autorização,232,2004-08-03T03:00:00Z,2004-08-05T03:00:00Z,
Petrobras Transporte S.A. - TRANSPETRO,Construção,Ponto de Entrega,modernização Ponto de Entrega em Volta Redonda (RJ)            (Gasoduto GASVOL),Gasoduto REDUC - Volta Redonda (GASVOL),,,,,Autorização,234,2004-08-03T03:00:00Z,2004-08-05T03:00:00Z,
Consórcio Malhas Sudeste Nordeste,Operação,Ponto de Entrega,"Ponto de Entrega em Duque de Caxias (RJ)  -  UTE TermoRio            (Gasodutos GASDUC I, GASDUC II e GASVOL)","Gasodutos GASDUC I, GASDUC II e GASVOL",,,,,Autorização,237,2004-08-03T03:00:00Z,2004-08-05T03:00:00Z,
Consórcio Malhas Sudeste Nordeste,Operação,Ponto de Entrega,Ponto de Entrega em Guapimirim (RJ)            (Gasoduto GASDUC),Gasoduto Cabiúnas - REDUC (GASDUC),,,,,Autorização,235,2004-08-03T03:00:00Z,2004-08-05T03:00:00Z,
Consórcio Malhas Sudeste Nordeste,Operação,Ponto de Entrega,Ponto de Entrega em Macaé (RJ)  -  UTE Macaé Merchant            (Gasodutos GASDUC I e GASDUC II),Gasodutos GASDUC I e GASDUC II,,,,,Autorização,238,2004-08-03T03:00:00Z,2004-08-05T03:00:00Z,
Consórcio Malhas Sudeste Nordeste,Operação,Ponto de Entrega,Ponto de Entrega em Paracambi (RJ)            (Gasoduto GASVOL),Gasoduto REDUC - Volta Redonda (GASVOL),,,,,Autorização,236,2004-08-03T03:00:00Z,2004-08-05T03:00:00Z,
Consórcio Malhas Sudeste Nordeste,Construção,Gasoduto de Transporte,Gasoduto Dow-Aratu-Camaçari                                         ,Gasoduto Dow-Aratu-Camaçari                                         ,"Estação de Caboto, em Candeias (BA) / Pólo Petroquímico de Camaçari (BA)",27,14,2.29,Autorização,261,2004-08-17T03:00:00Z,2004-08-19T03:00:00Z,
Rio Polímeros S.A,Construção,Gasoduto de Transferência,"Dutos de Transferência (etano, propano e gasolina)                                         ",,"Rio Polímeros / Refinaria REDUC, no Município de Duque de Caxias (RJ)",1.8,12,,Autorização,276,2004-08-24T03:00:00Z,2004-08-25T03:00:00Z,
Transportadora Brasileira Gasoduto Bolívia-Brasil - TBG,Construção,Ponto de Entrega,Ponto de Entrega em Campo Largo (PR)            (Gasoduto GASBOL),Gasoduto Bolívia - Brasil (GASBOL),,,,,Autorização,278,2004-08-24T03:00:00Z,2004-08-25T03:00:00Z,
Transportadora Brasileira Gasoduto Bolívia-Brasil - TBG,Construção,Ponto de Entrega,Ponto de Entrega em Porto Feliz (SP)            (Gasoduto GASBOL),Gasoduto Bolívia - Brasil (GASBOL),,,,,Autorização,277,2004-08-24T03:00:00Z,2004-08-25T03:00:00Z,
Consórcio Malhas Sudeste Nordeste,Operação,Ponto de Entrega,Ponto de Entrega e Ramal de Interligação em Aracati (CE) (Gasoduto GASFOR),Gasoduto Guamaré - Pecém (GASFOR),,,,,Autorização,329,2004-09-24T03:00:00Z,2004-09-27T03:00:00Z,
Consórcio Malhas Sudeste Nordeste,Operação,Ponto de Entrega,Ponto de Entrega em Caucaia (CE)                         (Gasoduto GASFOR),Gasoduto Guamaré - Pecém (GASFOR),,,,,Autorização,330,2004-09-24T03:00:00Z,2004-09-27T03:00:00Z,
Consórcio Malhas Sudeste Nordeste,Construção,Gasoduto de Transporte,Gasoduto Atalaia-Itaporanga                                         ,Gasoduto Atalaia - Itaporanga                                         ,"UPGN de Atalaia, em Aracaju (SE) / Itaporanga dAjuda (SE)",29,14,3.0,Autorização,379,2004-10-28T03:00:00Z,2004-10-29T03:00:00Z,
Consórcio Malhas Sudeste Nordeste,Operação,Ponto de Entrega,modernização Ponto de Entrega em Suzano (SP)            (Gasoduto GASPAL),Gasoduto Rio de Janeiro - São Paulo (GASPAL),,,,,Autorização,396,2004-11-18T02:00:00Z,2004-11-19T02:00:00Z,