{"text_format":"1","workbook":"xlsx","n_sheets":12,"sheets":["Relatório Quadrimestral","informacoes_gerais","movimentacao","treinamentos_sgso","reunioes_cso","aiso","ferramentas_de_gso","auditorias","acoes_de_promocao","sistema_de_relatos","Indicadores","Aeródromos Públicos"],"not_rendered":{"charts":0,"images":1,"macros":1,"external_links":0,"defined_names":1,"comments":0,"pivot_tables":0},"unopened":[],"bounds":{"document_bytes":16777216,"sheet_cells":100000,"rows_first":2000,"rows_last":500,"rows_between":2000,"halvings":0,"cell_chars":16384,"cell_head_chars":4096},"cells_cut":0,"cells_raw":0,"read":"whole","date_system":"1900"}

{"sheet":"Relatório Quadrimestral","index":0,"n_rows":3,"n_cols":3,"rows_kept":3,"cut":false,"hidden":false,"merged":[[2,1,2,3],[0,1,0,3],[1,2,1,3]]}
[null,"Versão 2.0 - 01/Maio/2020 "]
[null,null,"RELATÓRIO QUADRIMESTRAL"]
[null,"\nLeia atentamente todos os avisos abaixo antes de prosseguir com o preenchimento do documento:\n\n1) Clique no botão abaixo para preencher o relatório;\n2) Complete todos os formulários disponíveis;\n3) Os relatórios devem ser enviados para a ANAC até o dia 20 dos meses de janeiro, maio e setembro;\n4) O documento deve ser encaminhado via Protocolo Eletrônico;\n5) Consulte o Guia de Preenchimento do Relatório Quadrimestral, disponível no site da ANAC, para mais informações."]

{"sheet":"informacoes_gerais","index":1,"n_rows":1,"n_cols":7,"rows_kept":1,"cut":false,"hidden":false,"merged":[]}
["ICAO","NOME DO AERÓDROMO","CLASSE","NOME DO RESPONSÁVEL PELO PREENCHIMENTO","CARGO DO RESPONSÁVEL PELO PREENCHIMENTO","ANO","QUADRIMESTRE"]

{"sheet":"movimentacao","index":2,"n_rows":1,"n_cols":14,"rows_kept":1,"cut":false,"hidden":false,"merged":[]}
["ICAO","ANO","JANEIRO","FEVEREIRO","MARÇO","ABRIL","MAIO","JUNHO","JULHO","AGOSTO","SETEMBRO","OUTUBRO","NOVEMBRO","DEZEMBRO"]

{"sheet":"treinamentos_sgso","index":3,"n_rows":1,"n_cols":4,"rows_kept":1,"cut":false,"hidden":false,"merged":[]}
["ICAO","DATA DO TREINAMENTO","TIPO DO TREINAMENTO","Nº DE PESSOAS CERTIFICADAS"]

{"sheet":"reunioes_cso","index":4,"n_rows":1,"n_cols":11,"rows_kept":1,"cut":false,"hidden":false,"merged":[]}
["ICAO","DATA DA REUNIÃO DA CSO","TIPO DA REUNIÃO","GESTOR DO AERÓDROMO PARTICIPOU?","GESTOR DE SGSO PARTICIPOU?","GESTOR DE MANUTENÇÃO PARTICIPOU?","GESTOR DE OPERAÇÕES PARTICIPOU?","GESTOR DE RESPOSTA A EMERGENCIA PARTICIPOU?","OUTROS PARTICIPARAM?","DESCRIÇÃO DOS OUTROS PARTICIPANTES","ASSUNTOS TRATADOS NA REUNIÃO"]

{"sheet":"aiso","index":5,"n_rows":1,"n_cols":4,"rows_kept":1,"cut":false,"hidden":false,"merged":[]}
["ICAO","NÚMERO DA AISO","DATA DA AISO","ASSUNTOS TRATADOS NA AISO"]

{"sheet":"ferramentas_de_gso","index":6,"n_rows":1,"n_cols":4,"rows_kept":1,"cut":false,"hidden":false,"merged":[]}
["ICAO","TIPO DA FERRAMENTA DE GSO","DATA","DETALHAMENTO DA AÇÃO"]

{"sheet":"auditorias","index":7,"n_rows":1,"n_cols":4,"rows_kept":1,"cut":false,"hidden":false,"merged":[]}
["ICAO","TIPO DA AUDITORIA","DATA DA AUDITORIA","QUANTIDADE DE ACHADOS NA AUDITORIA"]

{"sheet":"acoes_de_promocao","index":8,"n_rows":1,"n_cols":5,"rows_kept":1,"cut":false,"hidden":false,"merged":[]}
["ICAO","TIPO DA AÇÃO","DESCRIÇÃO DA AÇÃO DO TIPO \"OUTROS\"","DATA DA AÇÃO","DETALHAMENTO DA AÇÃO"]

{"sheet":"sistema_de_relatos","index":9,"n_rows":1,"n_cols":14,"rows_kept":1,"cut":false,"hidden":false,"merged":[]}
["ICAO","N° DE RELATOS EM JANEIRO","N° DE RELATOS EM FEVEREIRO","N° DE RELATOS EM MARÇO","N° DE RELATOS EM ABRIL","N° DE RELATOS EM MAIO","N° DE RELATOS EM JUNHO","N° DE RELATOS EM JULHO","N° DE RELATOS EM AGOSTO","N° DE RELATOS EM SETEMBRO","N° DE RELATOS EM OUTUBRO","N° DE RELATOS EM NOVEMBRO","N° DE RELATOS EM DEZEMBRO","TOTAL DE RELATOS"]

{"sheet":"Indicadores","index":10,"n_rows":45,"n_cols":17,"rows_kept":45,"cut":false,"hidden":false,"merged":[]}
["ICAO","[SIGLA] INDICADOR","Métricas e Indicadores","JAN","FEV","MAR","ABR","MAI","JUN","JUL","AGO","SET","OUT","NOV","DEZ","ANUAL","META"]
[null,"[ReRi] Indicador Incursão em Pista","Métrica quantidade de incursões aeronaves"]
[null,"[ReRi] Indicador Incursão em Pista","Métrica quantidade de incursões veículos e pessoas"]
[null,"[ReRi] Indicador Incursão em Pista","Indicador ReRi - Parcial Aeronaves",{"$f":"IF(ISBLANK(D2),\"-\", (D2)*100/movimentacao!C2)","v":"-"},{"$f":"IF(ISBLANK(E2),\"-\", (E2)*100/movimentacao!D2)","v":"-"},{"$f":"IF(ISBLANK(F2),\"-\", (F2)*100/movimentacao!E2)","v":"-"},{"$f":"IF(ISBLANK(G2),\"-\", (G2)*100/movimentacao!F2)","v":"-"},{"$f":"IF(informacoes_gerais!$G$2=1,\"-\",IF(ISBLANK(H2),\"-\", (H2)*100/movimentacao!G2))","v":"-"},{"$f":"IF(informacoes_gerais!$G$2=1,\"-\",IF(ISBLANK(I2),\"-\", (I2)*100/movimentacao!H2))","v":"-"},{"$f":"IF(informacoes_gerais!$G$2=1,\"-\",IF(ISBLANK(J2),\"-\", (J2)*100/movimentacao!I2))","v":"-"},{"$f":"IF(informacoes_gerais!$G$2=1,\"-\",IF(ISBLANK(K2),\"-\", (K2)*100/movimentacao!J2))","v":"-"},{"$f":"IF(OR((informacoes_gerais!$G$2=1),(informacoes_gerais!$G$2=2)),\"-\",IF(ISBLANK(L2),\"-\", (L2)*100/movimentacao!K2))","v":"-"},{"$f":"IF(OR((informacoes_gerais!$G$2=1),(informacoes_gerais!$G$2=2)),\"-\",IF(ISBLANK(M2),\"-\", (M2)*100/movimentacao!L2))","v":"-"},{"$f":"IF(OR((informacoes_gerais!$G$2=1),(informacoes_gerais!$G$2=2)),\"-\",IF(ISBLANK(N2),\"-\", (N2)*100/movimentacao!M2))","v":"-"},{"$f":"IF(OR((informacoes_gerais!$G$2=1),(informacoes_gerais!$G$2=2)),\"-\",IF(ISBLANK(O2),\"-\", (O2)*100/movimentacao!N2))","v":"-"}]
[null,"[ReRi] Indicador Incursão em Pista","Indicador ReRi - Parcial Veículos e Pessoas",{"$f":"IF(ISBLANK(D3),\"-\", (D3)*100/movimentacao!C2)","v":"-"},{"$f":"IF(ISBLANK(E3),\"-\", (E3)*100/movimentacao!D2)","v":"-"},{"$f":"IF(ISBLANK(F3),\"-\", (F3)*100/movimentacao!E2)","v":"-"},{"$f":"IF(ISBLANK(G3),\"-\", (G3)*100/movimentacao!F2)","v":"-"},{"$f":"IF(informacoes_gerais!$G$2=1,\"-\",IF(ISBLANK(H3),\"-\", (H3)*100/movimentacao!G2))","v":"-"},{"$f":"IF(informacoes_gerais!$G$2=1,\"-\",IF(ISBLANK(I3),\"-\", (I3)*100/movimentacao!H2))","v":"-"},{"$f":"IF(informacoes_gerais!$G$2=1,\"-\",IF(ISBLANK(J3),\"-\", (J3)*100/movimentacao!I2))","v":"-"},{"$f":"IF(informacoes_gerais!$G$2=1,\"-\",IF(ISBLANK(K3),\"-\", (K3)*100/movimentacao!J2))","v":"-"},{"$f":"IF(OR((informacoes_gerais!$G$2=1),(informacoes_gerais!$G$2=2)),\"-\",IF(ISBLANK(L3),\"-\", (L3)*100/movimentacao!K2))","v":"-"},{"$f":"IF(OR((informacoes_gerais!$G$2=1),(informacoes_gerais!$G$2=2)),\"-\",IF(ISBLANK(M3),\"-\", (M3)*100/movimentacao!L2))","v":"-"},{"$f":"IF(OR((informacoes_gerais!$G$2=1),(informacoes_gerais!$G$2=2)),\"-\",IF(ISBLANK(N3),\"-\", (N3)*100/movimentacao!M2))","v":"-"},{"$f":"IF(OR((informacoes_gerais!$G$2=1),(informacoes_gerais!$G$2=2)),\"-\",IF(ISBLANK(O3),\"-\", (O3)*100/movimentacao!N2))","v":"-"}]
[null,"[ReRi] Indicador Incursão em Pista","Indicador ReRi (%)",{"$f":"IF(ISBLANK(D2),\"-\", (D2+D3)*100/movimentacao!C2)","v":"-"},{"$f":"IF(ISBLANK(E2),\"-\", (E2+E3)*100/movimentacao!D2)","v":"-"},{"$f":"IF(ISBLANK(F2),\"-\", (F2+F3)*100/movimentacao!E2)","v":"-"},{"$f":"IF(ISBLANK(G2),\"-\", (G2+G3)*100/movimentacao!F2)","v":"-"},{"$f":"IF(informacoes_gerais!$G$2=1,\"-\",IF(ISBLANK(H2),\"-\", (H2+H3)*100/movimentacao!G2))","v":"-"},{"$f":"IF(informacoes_gerais!$G$2=1,\"-\",IF(ISBLANK(I2),\"-\", (I2+I3)*100/movimentacao!H2))","v":"-"},{"$f":"IF(informacoes_gerais!$G$2=1,\"-\",IF(ISBLANK(J2),\"-\", (J2+J3)*100/movimentacao!I2))","v":"-"},{"$f":"IF(informacoes_gerais!$G$2=1,\"-\",IF(ISBLANK(K2),\"-\", (K2+K3)*100/movimentacao!J2))","v":"-"},{"$f":"IF(OR((informacoes_gerais!$G$2=1),(informacoes_gerais!$G$2=2)),\"-\",IF(ISBLANK(L2),\"-\", (L2+L3)*100/movimentacao!K2))","v":"-"},{"$f":"IF(OR((informacoes_gerais!$G$2=1),(informacoes_gerais!$G$2=2)),\"-\",IF(ISBLANK(M2),\"-\", (M2+M3)*100/movimentacao!L2))","v":"-"},{"$f":"IF(OR((informacoes_gerais!$G$2=1),(informacoes_gerais!$G$2=2)),\"-\",IF(ISBLANK(N2),\"-\", (N2+N3)*100/movimentacao!M2))","v":"-"},{"$f":"IF(OR((informacoes_gerais!$G$2=1),(informacoes_gerais!$G$2=2)),\"-\",IF(ISBLANK(O2),\"-\", (O2+O3)*100/movimentacao!N2))","v":"-"}]
[null,"[PoRi] Indicador Processo Incursão em Pista ","% atendido - nível organizacional"]
[null,"[PoRi] Indicador Processo Incursão em Pista ","% atendido - auxílios  e infraestrutura"]
[null,"[ReAvi] Indicador Resultado Ave ","Métrica quantidade de colisões com aves"]
[null,"[ReAvi] Indicador Resultado Ave ","Indicador ReAvi (%)",{"$f":"IF(ISBLANK(D9),\"-\", (D9)*100/movimentacao!C2)","v":"-"},{"$f":"IF(ISBLANK(E9),\"-\", (E9)*100/movimentacao!D2)","v":"-"},{"$f":"IF(ISBLANK(F9),\"-\", (F9)*100/movimentacao!E2)","v":"-"},{"$f":"IF(ISBLANK(G9),\"-\", (G9)*100/movimentacao!F2)","v":"-"},{"$f":"IF(informacoes_gerais!$G$2=1,\"-\",IF(ISBLANK(H9),\"-\", (H9)*100/movimentacao!G2))","v":"-"},{"$f":"IF(informacoes_gerais!$G$2=1,\"-\",IF(ISBLANK(I9),\"-\", (I9)*100/movimentacao!H2))","v":"-"},{"$f":"IF(informacoes_gerais!$G$2=1,\"-\",IF(ISBLANK(J9),\"-\", (J9)*100/movimentacao!I2))","v":"-"},{"$f":"IF(informacoes_gerais!$G$2=1,\"-\",IF(ISBLANK(K9),\"-\", (K9)*100/movimentacao!J2))","v":"-"},{"$f":"IF(OR((informacoes_gerais!$G$2=1),(informacoes_gerais!$G$2=2)),\"-\",IF(ISBLANK(L9),\"-\", (L9)*100/movimentacao!K2))","v":"-"},{"$f":"IF(OR((informacoes_gerais!$G$2=1),(informacoes_gerais!$G$2=2)),\"-\",IF(ISBLANK(M9),\"-\", (M9)*100/movimentacao!L2))","v":"-"},{"$f":"IF(OR((informacoes_gerais!$G$2=1),(informacoes_gerais!$G$2=2)),\"-\",IF(ISBLANK(N9),\"-\", (N9)*100/movimentacao!M2))","v":"-"},{"$f":"IF(OR((informacoes_gerais!$G$2=1),(informacoes_gerais!$G$2=2)),\"-\",IF(ISBLANK(O9),\"-\", (O9)*100/movimentacao!N2))","v":"-"}]
[null,"[ReASA] Indicador Resultado ASA ","Métrica quantidade de colisões com aves na ASA"]
[null,"[ReASA] Indicador Resultado ASA ","Indicador ReASA (%)",{"$f":"IF(ISBLANK(D11),\"-\", (D11)*100/movimentacao!C2)","v":"-"},{"$f":"IF(ISBLANK(E11),\"-\", (E11)*100/movimentacao!D2)","v":"-"},{"$f":"IF(ISBLANK(F11),\"-\", (F11)*100/movimentacao!E2)","v":"-"},{"$f":"IF(ISBLANK(G11),\"-\", (G11)*100/movimentacao!F2)","v":"-"},{"$f":"IF(informacoes_gerais!$G$2=1,\"-\",IF(ISBLANK(H11),\"-\", (H11)*100/movimentacao!G2))","v":"-"},{"$f":"IF(informacoes_gerais!$G$2=1,\"-\",IF(ISBLANK(I11),\"-\", (I11)*100/movimentacao!H2))","v":"-"},{"$f":"IF(informacoes_gerais!$G$2=1,\"-\",IF(ISBLANK(J11),\"-\", (J11)*100/movimentacao!I2))","v":"-"},{"$f":"IF(informacoes_gerais!$G$2=1,\"-\",IF(ISBLANK(K11),\"-\", (K11)*100/movimentacao!J2))","v":"-"},{"$f":"IF(OR((informacoes_gerais!$G$2=1),(informacoes_gerais!$G$2=2)),\"-\",IF(ISBLANK(L11),\"-\", (L11)*100/movimentacao!K2))","v":"-"},{"$f":"IF(OR((informacoes_gerais!$G$2=1),(informacoes_gerais!$G$2=2)),\"-\",IF(ISBLANK(M11),\"-\", (M11)*100/movimentacao!L2))","v":"-"},{"$f":"IF(OR((informacoes_gerais!$G$2=1),(informacoes_gerais!$G$2=2)),\"-\",IF(ISBLANK(N11),\"-\", (N11)*100/movimentacao!M2))","v":"-"},{"$f":"IF(OR((informacoes_gerais!$G$2=1),(informacoes_gerais!$G$2=2)),\"-\",IF(ISBLANK(O11),\"-\", (O11)*100/movimentacao!N2))","v":"-"}]
[null,"[ReAviD] Indicador Resultado Ave com Dano ","Métrica quantidade de colisões aves com dano"]
[null,"[ReAviD] Indicador Resultado Ave com Dano ","Métrica quantidade de colisões totais"]
[null,"[ReAviD] Indicador Resultado Ave com Dano ","Indicador ReAviD (%)",{"$f":"IF(ISBLANK(D13),\"-\", (D13)*100/(D14))","v":"-"},{"$f":"IF(ISBLANK(E13),\"-\", (E13)*100/(E14))","v":"-"},"-","-",{"$f":"IF(informacoes_gerais!$G$2=1,\"-\",IF(ISBLANK(H13),\"-\", (H13)*100/(H14)))","v":"-"},{"$f":"IF(informacoes_gerais!$G$2=1,\"-\",IF(ISBLANK(I13),\"-\", (I13)*100/(I14)))","v":"-"},{"$f":"IF(informacoes_gerais!$G$2=1,\"-\",IF(ISBLANK(J13),\"-\", (J13)*100/(J14)))","v":"-"},{"$f":"IF(informacoes_gerais!$G$2=1,\"-\",IF(ISBLANK(K13),\"-\", (K13)*100/(K14)))","v":"-"},{"$f":"IF(OR((informacoes_gerais!$G$2=1),(informacoes_gerais!$G$2=2)),\"-\",IF(ISBLANK(L13),\"-\", (L13)*100/(L14)))","v":"-"},{"$f":"IF(OR((informacoes_gerais!$G$2=1),(informacoes_gerais!$G$2=2)),\"-\",IF(ISBLANK(M13),\"-\", (M13)*100/(M14)))","v":"-"},{"$f":"IF(OR((informacoes_gerais!$G$2=1),(informacoes_gerais!$G$2=2)),\"-\",IF(ISBLANK(N13),\"-\", (N13)*100/(N14)))","v":"-"},{"$f":"IF(OR((informacoes_gerais!$G$2=1),(informacoes_gerais!$G$2=2)),\"-\",IF(ISBLANK(O13),\"-\", (O13)*100/(O14)))","v":"-"}]
[null,"[PeAvi] Indicador Precursor Ave","Métrica quantidade de avistamentos ave"]
[null,"[PeAvi] Indicador Precursor Ave","Métrica quantidade de quase-colisões ave"]
[null,"[PeAvi] Indicador Precursor Ave","Indicador PeAvi (%)",{"$f":"IF(ISBLANK(D16),\"-\", ((D16)+(D17))*100/movimentacao!C2)","v":"-"},{"$f":"IF(ISBLANK(E16),\"-\", ((E16)+(E17))*100/movimentacao!D2)","v":"-"},{"$f":"IF(ISBLANK(F16),\"-\", ((F16)+(F17))*100/movimentacao!E2)","v":"-"},{"$f":"IF(ISBLANK(G16),\"-\", ((G16)+(G17))*100/movimentacao!F2)","v":"-"},{"$f":"IF(informacoes_gerais!$G$2=1,\"-\",IF(ISBLANK(H16),\"-\", ((H16)+(H17))*100/movimentacao!G2))","v":"-"},{"$f":"IF(informacoes_gerais!$G$2=1,\"-\",IF(ISBLANK(I16),\"-\", ((I16)+(I17))*100/movimentacao!H2))","v":"-"},{"$f":"IF(informacoes_gerais!$G$2=1,\"-\",IF(ISBLANK(J16),\"-\", ((J16)+(J17))*100/movimentacao!I2))","v":"-"},{"$f":"IF(informacoes_gerais!$G$2=1,\"-\",IF(ISBLANK(K16),\"-\", ((K16)+(K17))*100/movimentacao!J2))","v":"-"},{"$f":"IF(OR((informacoes_gerais!$G$2=1),(informacoes_gerais!$G$2=2)),\"-\",IF(ISBLANK(L16),\"-\", ((L16)+(L17))*100/movimentacao!K2))","v":"-"},{"$f":"IF(OR((informacoes_gerais!$G$2=1),(informacoes_gerais!$G$2=2)),\"-\",IF(ISBLANK(M16),\"-\", ((M16)+(M17))*100/movimentacao!L2))","v":"-"},{"$f":"IF(OR((informacoes_gerais!$G$2=1),(informacoes_gerais!$G$2=2)),\"-\",IF(ISBLANK(N16),\"-\", ((N16)+(N17))*100/movimentacao!M2))","v":"-"},{"$f":"IF(OR((informacoes_gerais!$G$2=1),(informacoes_gerais!$G$2=2)),\"-\",IF(ISBLANK(O16),\"-\", ((O16)+(O17))*100/movimentacao!N2))","v":"-"}]
[null,"[ReFau] Indicador Resultado Fauna","Métrica quantidade de colisões com animais, exceto aves "]
[null,"[ReFau] Indicador Resultado Fauna","Indicador ReFau (%)",{"$f":"IF(ISBLANK(D19),\"-\", (D19)*100/movimentacao!C2)","v":"-"},{"$f":"IF(ISBLANK(E19),\"-\", (E19)*100/movimentacao!D2)","v":"-"},{"$f":"IF(ISBLANK(F19),\"-\", (F19)*100/movimentacao!E2)","v":"-"},{"$f":"IF(ISBLANK(G19),\"-\", (G19)*100/movimentacao!F2)","v":"-"},{"$f":"IF(informacoes_gerais!$G$2=1,\"-\",IF(ISBLANK(H19),\"-\", (H19)*100/movimentacao!G2))","v":"-"},{"$f":"IF(informacoes_gerais!$G$2=1,\"-\",IF(ISBLANK(I19),\"-\", (I19)*100/movimentacao!H2))","v":"-"},{"$f":"IF(informacoes_gerais!$G$2=1,\"-\",IF(ISBLANK(J19),\"-\", (J19)*100/movimentacao!I2))","v":"-"},{"$f":"IF(informacoes_gerais!$G$2=1,\"-\",IF(ISBLANK(K19),\"-\", (K19)*100/movimentacao!J2))","v":"-"},{"$f":"IF(OR((informacoes_gerais!$G$2=1),(informacoes_gerais!$G$2=2)),\"-\",IF(ISBLANK(L19),\"-\", (L19)*100/movimentacao!K2))","v":"-"},{"$f":"IF(OR((informacoes_gerais!$G$2=1),(informacoes_gerais!$G$2=2)),\"-\",IF(ISBLANK(M19),\"-\", (M19)*100/movimentacao!L2))","v":"-"},{"$f":"IF(OR((informacoes_gerais!$G$2=1),(informacoes_gerais!$G$2=2)),\"-\",IF(ISBLANK(N19),\"-\", (N19)*100/movimentacao!M2))","v":"-"},{"$f":"IF(OR((informacoes_gerais!$G$2=1),(informacoes_gerais!$G$2=2)),\"-\",IF(ISBLANK(O19),\"-\", (O19)*100/movimentacao!N2))","v":"-"}]
[null,"[PeFau] Indicador Precursor Fauna","Métrica quantidade de avistamentos de animais, exceto aves "]
[null,"[PeFau] Indicador Precursor Fauna","Indicador PeFau (%)",{"$f":"IF(ISBLANK(D21),\"-\", (D21)*100/movimentacao!C2)","v":"-"},{"$f":"IF(ISBLANK(E21),\"-\", (E21)*100/movimentacao!D2)","v":"-"},{"$f":"IF(ISBLANK(F21),\"-\", (F21)*100/movimentacao!E2)","v":"-"},{"$f":"IF(ISBLANK(G21),\"-\", (G21)*100/movimentacao!F2)","v":"-"},{"$f":"IF(informacoes_gerais!$G$2=1,\"-\",IF(ISBLANK(H21),\"-\", (H21)*100/movimentacao!G2))","v":"-"},{"$f":"IF(informacoes_gerais!$G$2=1,\"-\",IF(ISBLANK(I21),\"-\", (I21)*100/movimentacao!H2))","v":"-"},{"$f":"IF(informacoes_gerais!$G$2=1,\"-\",IF(ISBLANK(J21),\"-\", (J21)*100/movimentacao!I2))","v":"-"},{"$f":"IF(informacoes_gerais!$G$2=1,\"-\",IF(ISBLANK(K21),\"-\", (K21)*100/movimentacao!J2))","v":"-"},{"$f":"IF(OR((informacoes_gerais!$G$2=1),(informacoes_gerais!$G$2=2)),\"-\",IF(ISBLANK(L21),\"-\", (L21)*100/movimentacao!K2))","v":"-"},{"$f":"IF(OR((informacoes_gerais!$G$2=1),(informacoes_gerais!$G$2=2)),\"-\",IF(ISBLANK(M21),\"-\", (M21)*100/movimentacao!L2))","v":"-"},{"$f":"IF(OR((informacoes_gerais!$G$2=1),(informacoes_gerais!$G$2=2)),\"-\",IF(ISBLANK(N21),\"-\", (N21)*100/movimentacao!M2))","v":"-"},{"$f":"IF(OR((informacoes_gerais!$G$2=1),(informacoes_gerais!$G$2=2)),\"-\",IF(ISBLANK(O21),\"-\", (O21)*100/movimentacao!N2))","v":"-"}]
[null,"[ReRe] Indicador Excursão de Pista","Métrica quantidade de saídas laterais"]
[null,"[ReRe] Indicador Excursão de Pista","Métrica quantidade de saídas ao final da pista"]
[null,"[ReRe] Indicador Excursão de Pista","Indicador ReRe - Parcial saídas laterais",{"$f":"IF(ISBLANK(D23),\"-\", (D23)*100/movimentacao!C2)","v":"-"},{"$f":"IF(ISBLANK(E23),\"-\", (E23)*100/movimentacao!D2)","v":"-"},{"$f":"IF(ISBLANK(F23),\"-\", (F23)*100/movimentacao!E2)","v":"-"},{"$f":"IF(ISBLANK(G23),\"-\", (G23)*100/movimentacao!F2)","v":"-"},{"$f":"IF(informacoes_gerais!$G$2=1,\"-\",IF(ISBLANK(H23),\"-\", (H23)*100/movimentacao!G2))","v":"-"},{"$f":"IF(informacoes_gerais!$G$2=1,\"-\",IF(ISBLANK(I23),\"-\", (I23)*100/movimentacao!H2))","v":"-"},{"$f":"IF(informacoes_gerais!$G$2=1,\"-\",IF(ISBLANK(J23),\"-\", (J23)*100/movimentacao!I2))","v":"-"},{"$f":"IF(informacoes_gerais!$G$2=1,\"-\",IF(ISBLANK(K23),\"-\", (K23)*100/movimentacao!J2))","v":"-"},{"$f":"IF(OR((informacoes_gerais!$G$2=1),(informacoes_gerais!$G$2=2)),\"-\",IF(ISBLANK(L23),\"-\", (L23)*100/movimentacao!K2))","v":"-"},{"$f":"IF(OR((informacoes_gerais!$G$2=1),(informacoes_gerais!$G$2=2)),\"-\",IF(ISBLANK(M23),\"-\", (M23)*100/movimentacao!L2))","v":"-"},{"$f":"IF(OR((informacoes_gerais!$G$2=1),(informacoes_gerais!$G$2=2)),\"-\",IF(ISBLANK(N23),\"-\", (N23)*100/movimentacao!M2))","v":"-"},{"$f":"IF(OR((informacoes_gerais!$G$2=1),(informacoes_gerais!$G$2=2)),\"-\",IF(ISBLANK(O23),\"-\", (O23)*100/movimentacao!N2))","v":"-"}]
[null,"[ReRe] Indicador Excursão de Pista","Indicador ReRe - Parcial saídas ao final da pista",{"$f":"IF(ISBLANK(D24),\"-\", (D24)*100/movimentacao!C2)","v":"-"},{"$f":"IF(ISBLANK(E24),\"-\", (E24)*100/movimentacao!D2)","v":"-"},{"$f":"IF(ISBLANK(F24),\"-\", (F24)*100/movimentacao!E2)","v":"-"},{"$f":"IF(ISBLANK(G24),\"-\", (G24)*100/movimentacao!F2)","v":"-"},{"$f":"IF(informacoes_gerais!$G$2=1,\"-\",IF(ISBLANK(H24),\"-\", (H24)*100/movimentacao!G2))","v":"-"},{"$f":"IF(informacoes_gerais!$G$2=1,\"-\",IF(ISBLANK(I24),\"-\", (I24)*100/movimentacao!H2))","v":"-"},{"$f":"IF(informacoes_gerais!$G$2=1,\"-\",IF(ISBLANK(J24),\"-\", (J24)*100/movimentacao!I2))","v":"-"},{"$f":"IF(informacoes_gerais!$G$2=1,\"-\",IF(ISBLANK(K24),\"-\", (K24)*100/movimentacao!J2))","v":"-"},{"$f":"IF(OR((informacoes_gerais!$G$2=1),(informacoes_gerais!$G$2=2)),\"-\",IF(ISBLANK(L24),\"-\", (L24)*100/movimentacao!K2))","v":"-"},{"$f":"IF(OR((informacoes_gerais!$G$2=1),(informacoes_gerais!$G$2=2)),\"-\",IF(ISBLANK(M24),\"-\", (M24)*100/movimentacao!L2))","v":"-"},{"$f":"IF(OR((informacoes_gerais!$G$2=1),(informacoes_gerais!$G$2=2)),\"-\",IF(ISBLANK(N24),\"-\", (N24)*100/movimentacao!M2))","v":"-"},{"$f":"IF(OR((informacoes_gerais!$G$2=1),(informacoes_gerais!$G$2=2)),\"-\",IF(ISBLANK(O24),\"-\", (O24)*100/movimentacao!N2))","v":"-"}]
[null,"[ReRe] Indicador Excursão de Pista","Indicador ReRe (%)",{"$f":"IF(ISBLANK(D23),\"-\", (D23+D24)*100/movimentacao!C2)","v":"-"},{"$f":"IF(ISBLANK(E23),\"-\", (E23+E24)*100/movimentacao!D2)","v":"-"},{"$f":"IF(ISBLANK(F23),\"-\", (F23+F24)*100/movimentacao!E2)","v":"-"},{"$f":"IF(ISBLANK(G23),\"-\", (G23+G24)*100/movimentacao!F2)","v":"-"},{"$f":"IF(informacoes_gerais!$G$2=1,\"-\",IF(ISBLANK(H23),\"-\", (H23+H24)*100/movimentacao!G2))","v":"-"},{"$f":"IF(informacoes_gerais!$G$2=1,\"-\",IF(ISBLANK(I23),\"-\", (I23+I24)*100/movimentacao!H2))","v":"-"},{"$f":"IF(informacoes_gerais!$G$2=1,\"-\",IF(ISBLANK(J23),\"-\", (J23+J24)*100/movimentacao!I2))","v":"-"},{"$f":"IF(informacoes_gerais!$G$2=1,\"-\",IF(ISBLANK(K23),\"-\", (K23+K24)*100/movimentacao!J2))","v":"-"},{"$f":"IF(OR((informacoes_gerais!$G$2=1),(informacoes_gerais!$G$2=2)),\"-\",IF(ISBLANK(L23),\"-\", (L23+L24)*100/movimentacao!K2))","v":"-"},{"$f":"IF(OR((informacoes_gerais!$G$2=1),(informacoes_gerais!$G$2=2)),\"-\",IF(ISBLANK(M23),\"-\", (M23+M24)*100/movimentacao!L2))","v":"-"},{"$f":"IF(OR((informacoes_gerais!$G$2=1),(informacoes_gerais!$G$2=2)),\"-\",IF(ISBLANK(N23),\"-\", (N23+N24)*100/movimentacao!M2))","v":"-"},{"$f":"IF(OR((informacoes_gerais!$G$2=1),(informacoes_gerais!$G$2=2)),\"-\",IF(ISBLANK(O23),\"-\", (O23+O24)*100/movimentacao!N2))","v":"-"}]
[null,"[PeIE] Indicador Interferências externas","Métrica quantidade de avistamento ou detecção de drones"]
[null,"[PeIE] Indicador Interferências externas","Métrica quantidade de avistamento ou detecção de balões"]
[null,"[PeIE] Indicador Interferências externas","Métrica quantidade de avistamento ou detecção de pipas em voo"]
[null,"[PeIE] Indicador Interferências externas","Métrica quantidade de avistamento ou detecção de laser"]
[null,"[PeIE] Indicador Interferências externas","Indicador PeIE (%)",{"$f":"IF(ISBLANK(D28),\"-\", (D28+D29+D30+D31)*100/movimentacao!C2)","v":"-"},{"$f":"IF(ISBLANK(E28),\"-\", (E28+E29+E30+E31)*100/movimentacao!D2)","v":"-"},{"$f":"IF(ISBLANK(F28),\"-\", (F28+F29+F30+F31)*100/movimentacao!E2)","v":"-"},{"$f":"IF(ISBLANK(G28),\"-\", (G28+G29+G30+G31)*100/movimentacao!F2)","v":"-"},{"$f":"IF(informacoes_gerais!$G$2=1,\"-\",IF(ISBLANK(H28),\"-\", (H28+H29+H30+H31)*100/movimentacao!G2))","v":"-"},{"$f":"IF(informacoes_gerais!$G$2=1,\"-\",IF(ISBLANK(I28),\"-\", (I28+I29+I30+I31)*100/movimentacao!H2))","v":"-"},{"$f":"IF(informacoes_gerais!$G$2=1,\"-\",IF(ISBLANK(J28),\"-\", (J28+J29+J30+J31)*100/movimentacao!I2))","v":"-"},{"$f":"IF(informacoes_gerais!$G$2=1,\"-\",IF(ISBLANK(K28),\"-\", (K28+K29+K30+K31)*100/movimentacao!J2))","v":"-"},{"$f":"IF(OR((informacoes_gerais!$G$2=1),(informacoes_gerais!$G$2=2)),\"-\",IF(ISBLANK(L28),\"-\", (L28+L29+L30+L31)*100/movimentacao!K2))","v":"-"},{"$f":"IF(OR((informacoes_gerais!$G$2=1),(informacoes_gerais!$G$2=2)),\"-\",IF(ISBLANK(M28),\"-\", (M28+M29+M30+M31)*100/movimentacao!L2))","v":"-"},{"$f":"IF(OR((informacoes_gerais!$G$2=1),(informacoes_gerais!$G$2=2)),\"-\",IF(ISBLANK(N28),\"-\", (N28+N29+N30+N31)*100/movimentacao!M2))","v":"-"},{"$f":"IF(OR((informacoes_gerais!$G$2=1),(informacoes_gerais!$G$2=2)),\"-\",IF(ISBLANK(O28),\"-\", (O28+O29+O30+O31)*100/movimentacao!N2))","v":"-"}]
[null,"[ReAed] Indicador Ocorrências Aeródromo","Métrica quantidade anual de ocorrências aeródromo"]
[null,"[ReAed] Indicador Ocorrências Aeródromo","Indicador ReAed (%)",{"$f":"IF(ISBLANK(D33),\"-\", (D33)*100/movimentacao!C2)","v":"-"},{"$f":"IF(ISBLANK(E33),\"-\", (E33)*100/movimentacao!D2)","v":"-"},{"$f":"IF(ISBLANK(F33),\"-\", (F33)*100/movimentacao!E2)","v":"-"},{"$f":"IF(ISBLANK(G33),\"-\", (G33)*100/movimentacao!F2)","v":"-"},{"$f":"IF(informacoes_gerais!$G$2=1,\"-\",IF(ISBLANK(H33),\"-\", (H33)*100/movimentacao!G2))","v":"-"},{"$f":"IF(informacoes_gerais!$G$2=1,\"-\",IF(ISBLANK(I33),\"-\", (I33)*100/movimentacao!H2))","v":"-"},{"$f":"IF(informacoes_gerais!$G$2=1,\"-\",IF(ISBLANK(J33),\"-\", (J33)*100/movimentacao!I2))","v":"-"},{"$f":"IF(informacoes_gerais!$G$2=1,\"-\",IF(ISBLANK(K33),\"-\", (K33)*100/movimentacao!J2))","v":"-"},{"$f":"IF(OR((informacoes_gerais!$G$2=1),(informacoes_gerais!$G$2=2)),\"-\",IF(ISBLANK(L33),\"-\", (L33)*100/movimentacao!K2))","v":"-"},{"$f":"IF(OR((informacoes_gerais!$G$2=1),(informacoes_gerais!$G$2=2)),\"-\",IF(ISBLANK(M33),\"-\", (M33)*100/movimentacao!L2))","v":"-"},{"$f":"IF(OR((informacoes_gerais!$G$2=1),(informacoes_gerais!$G$2=2)),\"-\",IF(ISBLANK(N33),\"-\", (N33)*100/movimentacao!M2))","v":"-"},{"$f":"IF(OR((informacoes_gerais!$G$2=1),(informacoes_gerais!$G$2=2)),\"-\",IF(ISBLANK(O33),\"-\", (O33)*100/movimentacao!N2))","v":"-"}]
[null,"[PeFO] Indicador FOD","Métrica quantidade FO nas PPD's"]
[null,"[PeFO] Indicador FOD","Métrica quantidade FO nas Pistas de Táxi"]
[null,"[PeFO] Indicador FOD","Indicador PeFO (%)",{"$f":"IF(ISBLANK(D35),\"-\", ((D35)+(D36))*100/movimentacao!C2)","v":"-"},{"$f":"IF(ISBLANK(E35),\"-\", ((E35)+(E36))*100/movimentacao!D2)","v":"-"},{"$f":"IF(ISBLANK(F35),\"-\", ((F35)+(F36))*100/movimentacao!E2)","v":"-"},{"$f":"IF(ISBLANK(G35),\"-\", ((G35)+(G36))*100/movimentacao!F2)","v":"-"},{"$f":"IF(informacoes_gerais!$G$2=1,\"-\",IF(ISBLANK(H35),\"-\", ((H35)+(H36))*100/movimentacao!G2))","v":"-"},{"$f":"IF(informacoes_gerais!$G$2=1,\"-\",IF(ISBLANK(I35),\"-\", ((I35)+(I36))*100/movimentacao!H2))","v":"-"},{"$f":"IF(informacoes_gerais!$G$2=1,\"-\",IF(ISBLANK(J35),\"-\", ((J35)+(J36))*100/movimentacao!I2))","v":"-"},{"$f":"IF(informacoes_gerais!$G$2=1,\"-\",IF(ISBLANK(K35),\"-\", ((K35)+(K36))*100/movimentacao!J2))","v":"-"},{"$f":"IF(OR((informacoes_gerais!$G$2=1),(informacoes_gerais!$G$2=2)),\"-\",IF(ISBLANK(L35),\"-\", ((L35)+(L36))*100/movimentacao!K2))","v":"-"},{"$f":"IF(OR((informacoes_gerais!$G$2=1),(informacoes_gerais!$G$2=2)),\"-\",IF(ISBLANK(M35),\"-\", ((M35)+(M36))*100/movimentacao!L2))","v":"-"},{"$f":"IF(OR((informacoes_gerais!$G$2=1),(informacoes_gerais!$G$2=2)),\"-\",IF(ISBLANK(N35),\"-\", ((N35)+(N36))*100/movimentacao!M2))","v":"-"},{"$f":"IF(OR((informacoes_gerais!$G$2=1),(informacoes_gerais!$G$2=2)),\"-\",IF(ISBLANK(O35),\"-\", ((O35)+(O36))*100/movimentacao!N2))","v":"-"}]
[null,"[ReOS] Indicador Ocorrências de solo","Métrica quantidade de ocorrências de solo"]
[null,"[ReOS] Indicador Ocorrências de solo","Indicador ReOS (%)",{"$f":"IF(ISBLANK(D38),\"-\", (D38)*100/movimentacao!C2)","v":"-"},{"$f":"IF(ISBLANK(E38),\"-\", (E38)*100/movimentacao!D2)","v":"-"},{"$f":"IF(ISBLANK(F38),\"-\", (F38)*100/movimentacao!E2)","v":"-"},{"$f":"IF(ISBLANK(G38),\"-\", (G38)*100/movimentacao!F2)","v":"-"},{"$f":"IF(informacoes_gerais!$G$2=1,\"-\",IF(ISBLANK(H38),\"-\", (H38)*100/movimentacao!G2))","v":"-"},{"$f":"IF(informacoes_gerais!$G$2=1,\"-\",IF(ISBLANK(I38),\"-\", (I38)*100/movimentacao!H2))","v":"-"},{"$f":"IF(informacoes_gerais!$G$2=1,\"-\",IF(ISBLANK(J38),\"-\", (J38)*100/movimentacao!I2))","v":"-"},{"$f":"IF(informacoes_gerais!$G$2=1,\"-\",IF(ISBLANK(K38),\"-\", (K38)*100/movimentacao!J2))","v":"-"},{"$f":"IF(OR((informacoes_gerais!$G$2=1),(informacoes_gerais!$G$2=2)),\"-\",IF(ISBLANK(L38),\"-\", (L38)*100/movimentacao!K2))","v":"-"},{"$f":"IF(OR((informacoes_gerais!$G$2=1),(informacoes_gerais!$G$2=2)),\"-\",IF(ISBLANK(M38),\"-\", (M38)*100/movimentacao!L2))","v":"-"},{"$f":"IF(OR((informacoes_gerais!$G$2=1),(informacoes_gerais!$G$2=2)),\"-\",IF(ISBLANK(N38),\"-\", (N38)*100/movimentacao!M2))","v":"-"},{"$f":"IF(OR((informacoes_gerais!$G$2=1),(informacoes_gerais!$G$2=2)),\"-\",IF(ISBLANK(O38),\"-\", (O38)*100/movimentacao!N2))","v":"-"}]
[null,"[ReCol] Indicador Colisões de Veíc. e Equipamentos","Métrica quantidade de colisões no atendimento"]
[null,"[ReCol] Indicador Colisões de Veíc. e Equipamentos","Métrica quantidade de colisões fora da área de atendimento"]
[null,"[ReCol] Indicador Colisões de Veíc. e Equipamentos","Indicador ReCol (%)",{"$f":"IF(ISBLANK(D40),\"-\", (D40+D41)*100/movimentacao!C2)","v":"-"},{"$f":"IF(ISBLANK(E40),\"-\", (E40+E41)*100/movimentacao!D2)","v":"-"},{"$f":"IF(ISBLANK(F40),\"-\", (F40+F41)*100/movimentacao!E2)","v":"-"},{"$f":"IF(ISBLANK(G40),\"-\", (G40+G41)*100/movimentacao!F2)","v":"-"},{"$f":"IF(informacoes_gerais!$G$2=1,\"-\",IF(ISBLANK(H40),\"-\", (H40+H41)*100/movimentacao!G2))","v":"-"},{"$f":"IF(informacoes_gerais!$G$2=1,\"-\",IF(ISBLANK(I40),\"-\", (I40+I41)*100/movimentacao!H2))","v":"-"},{"$f":"IF(informacoes_gerais!$G$2=1,\"-\",IF(ISBLANK(J40),\"-\", (J40+J41)*100/movimentacao!I2))","v":"-"},{"$f":"IF(informacoes_gerais!$G$2=1,\"-\",IF(ISBLANK(K40),\"-\", (K40+K41)*100/movimentacao!J2))","v":"-"},{"$f":"IF(OR((informacoes_gerais!$G$2=1),(informacoes_gerais!$G$2=2)),\"-\",IF(ISBLANK(L40),\"-\", (L40+L41)*100/movimentacao!K2))","v":"-"},{"$f":"IF(OR((informacoes_gerais!$G$2=1),(informacoes_gerais!$G$2=2)),\"-\",IF(ISBLANK(M40),\"-\", (M40+M41)*100/movimentacao!L2))","v":"-"},{"$f":"IF(OR((informacoes_gerais!$G$2=1),(informacoes_gerais!$G$2=2)),\"-\",IF(ISBLANK(N40),\"-\", (N40+N41)*100/movimentacao!M2))","v":"-"},{"$f":"IF(OR((informacoes_gerais!$G$2=1),(informacoes_gerais!$G$2=2)),\"-\",IF(ISBLANK(O40),\"-\", (O40+O41)*100/movimentacao!N2))","v":"-"}]
[null,"[PeCom] Indicador Combustível","Métrica quantidade de vazamentos oriundos de aeronave"]
[null,"[PeCom] Indicador Combustível","Métrica quantidade de vazamentos oriundos de veículos ou equip."]
[null,"[PeCom] Indicador Combustível","Indicador PeCom (%)",{"$f":"IF(ISBLANK(D43),\"-\", (D43+D44)*100/movimentacao!C2)","v":"-"},{"$f":"IF(ISBLANK(E43),\"-\", (E43+E44)*100/movimentacao!D2)","v":"-"},{"$f":"IF(ISBLANK(F43),\"-\", (F43+F44)*100/movimentacao!E2)","v":"-"},{"$f":"IF(ISBLANK(G43),\"-\", (G43+G44)*100/movimentacao!F2)","v":"-"},{"$f":"IF(informacoes_gerais!$G$2=1,\"-\",IF(ISBLANK(H43),\"-\", (H43+H44)*100/movimentacao!G2))","v":"-"},{"$f":"IF(informacoes_gerais!$G$2=1,\"-\",IF(ISBLANK(I43),\"-\", (I43+I44)*100/movimentacao!H2))","v":"-"},{"$f":"IF(informacoes_gerais!$G$2=1,\"-\",IF(ISBLANK(J43),\"-\", (J43+J44)*100/movimentacao!I2))","v":"-"},{"$f":"IF(informacoes_gerais!$G$2=1,\"-\",IF(ISBLANK(K43),\"-\", (K43+K44)*100/movimentacao!J2))","v":"-"},{"$f":"IF(OR((informacoes_gerais!$G$2=1),(informacoes_gerais!$G$2=2)),\"-\",IF(ISBLANK(L43),\"-\", (L43+L44)*100/movimentacao!K2))","v":"-"},{"$f":"IF(OR((informacoes_gerais!$G$2=1),(informacoes_gerais!$G$2=2)),\"-\",IF(ISBLANK(M43),\"-\", (M43+M44)*100/movimentacao!L2))","v":"-"},{"$f":"IF(OR((informacoes_gerais!$G$2=1),(informacoes_gerais!$G$2=2)),\"-\",IF(ISBLANK(N43),\"-\", (N43+N44)*100/movimentacao!M2))","v":"-"},{"$f":"IF(OR((informacoes_gerais!$G$2=1),(informacoes_gerais!$G$2=2)),\"-\",IF(ISBLANK(O43),\"-\", (O43+O44)*100/movimentacao!N2))","v":"-"}]

{"sheet":"Aeródromos Públicos","index":11,"n_rows":535,"n_cols":52,"rows_kept":535,"cut":false,"hidden":false,"merged":[[1,24,1,28],[1,0,1,4],[1,5,1,7],[1,9,1,13],[1,14,1,18],[1,19,1,23],[1,33,1,36],[1,40,1,46],[1,47,1,49],[1,50,1,51],[2,33,2,36]]}
[]
["Aeródromo",null,null,null,null,"Geoespacial",null,null,"Operação","Pista 1",null,null,null,null,"Pista 2",null,null,null,null,"Pista 3",null,null,null,null,"Heliponto",null,null,null,null,null,null,null,null,"Atos normativos",null,null,null,"Classe RBAC 107","Classe RBAC 153","Categoria Tarifária","Especificação Operativa",null,null,null,null,null,null,"Medidas Administrativas",null,null,"Outros"]
["CÓDIGO OACI","CIAD","NOME","MUNICÍPIO ATENDIDO","UF","LATITUDE","LONGITUDE","ALTITUDE","OPERAÇÃO","DESIGNAÇÃO","COMPRIMENTO","LARGURA","RESISTÊNCIA","SUPERFÍCIE","DESIGNAÇÃO","COMPRIMENTO","LARGURA","RESISTÊNCIA","SUPERFÍCIE","DESIGNAÇÃO","COMPRIMENTO","LARGURA","RESISTÊNCIA","SUPERFÍCIE","RAMPA(S) DE APROXIMAÇÃO","FORMATO DA ÁREA DE POUSO","DIMENSÕES","RESISTÊNCIA","SUPERFÍCIE","p1","p2","p3","p4","PORTARIAS",null,null,null,{"$f":"HYPERLINK(\"http://pergamum.anac.gov.br/arquivos/PA2020-0708.PDF\",\"PORTARIA Nº 708/2020 E ALTERAÇÕES\")","v":"PORTARIA Nº 708/2020 E ALTERAÇÕES"},{"$f":"HYPERLINK(\"http://pergamum.anac.gov.br/arquivos/PA2020-1540.PDF\",\"PORTARIA Nº 1540/2020\nA Classe I se divide ainda em I-A, sem voo regular e I-B, com voo regular\")","v":"PORTARIA Nº 1540/2020\nA Classe I se divide ainda em I-A, sem voo regular e I-B, com voo regular"},{"$f":"HYPERLINK(\"http://pergamum.anac.gov.br/arquivos/PA2014-2007.pdf\",\"PORTARIA Nº 2007/2014 E ALTERAÇÕES\n(* = REGIME TARIFÁRIO DIFERENCIADO)\")","v":"PORTARIA Nº 2007/2014 E ALTERAÇÕES\n(* = REGIME TARIFÁRIO DIFERENCIADO)"},"AERONAVE CRÍTICA","TIPO DE APROX. (CABECEIRAS)","FREQ. SEMANAL","r1","r2","REFERÊNCIA(S)","RESTRIÇÃO(ÕES)","SITUAÇÃO","r1","REFERÊNCIA","SITUADO NA AMAZÔNIA LEGAL","OBSERVAÇÕES"]
["SBAA","PA0008","CONCEIÇÃO DO ARAGUAIA","CONCEIÇÃO DO ARAGUAIA","PA","8° 20' 55'' S","49° 18' 11'' W","199 m","VFR Diurno/Noturno e IFR Diurno"," 08/26","1800 m","30 m","PCN 47/F/C/X/U","Asfalto","-","-","-","-","-","-","-","-","-","-","-","-","-","-","-","PD1981-0172","PD1993-0516",0,0,{"$f":"IF(AD4<>0,HYPERLINK(\"http://pergamum.anac.gov.br/arquivos/\" & AD4 & \".pdf\",AD4),\"\")","v":"PD1981-0172"},{"$f":"IF(AE4<>0,HYPERLINK(\"http://pergamum.anac.gov.br/arquivos/\" & AE4 & \".pdf\",AE4),\"\")","v":"PD1993-0516"},{"$f":"IF(AF4<>0,HYPERLINK(\"http://pergamum.anac.gov.br/arquivos/\" & AF4 & \".pdf\",AF4),\"\")","v":""},{"$f":"IF(AG4<>0,HYPERLINK(\"http://pergamum.anac.gov.br/arquivos/\" & AG4 & \".pdf\",AG4),\"\")","v":""},"AP-0","Classe I","4ª","-","-","-","-","-",{"$f":"IF(AR4<>0,HYPERLINK(\"http://pergamum.anac.gov.br/arquivos/\" & AR4 & \".pdf\",AR4),\"\")","v":"-"},{"$f":"IF(AS4<>0,HYPERLINK(\"http://pergamum.anac.gov.br/arquivos/\" & AS4 & \".pdf\",AS4),\"\")","v":"-"},"-","-",{"$f":"IF(AW4<>0,HYPERLINK(\"http://pergamum.anac.gov.br/arquivos/\" & AW4 & \".pdf\",AW4),\"\")","v":"-"},"X","-"]
["SBAE","SP0010","BAURU/AREALVA","BAURU E AREALVA","SP","22° 9' 28'' S","49° 4' 6'' W","594 m","VFR Diurno/Noturno e IFR Diurno/Noturno"," 17/35","2010 m","45 m","PCN 42/F/A/X/T","Asfalto","-","-","-","-","-","-","-","-","-","-","-","-","-","-","-","PA2013-0888",0,0,0,{"$f":"IF(AD5<>0,HYPERLINK(\"http://pergamum.anac.gov.br/arquivos/\" & AD5 & \".pdf\",AD5),\"\")","v":"PA2013-0888"},"","","","AP-1","Classe I","3ª","4C","NPA",5,"-","PA2016-0908",{"$f":"IF(AR5<>0,HYPERLINK(\"http://pergamum.anac.gov.br/arquivos/\" & AR5 & \".pdf\",AR5),\"\")","v":"-"},"PA2016-0908","-","-",{"$f":"IF(AW5<>0,HYPERLINK(\"http://pergamum.anac.gov.br/arquivos/\" & AW5 & \".pdf\",AW5),\"\")","v":"-"},"","-"]
["SBAQ","SP0012","BARTOLOMEU DE GUSMÃO","ARARAQUARA","SP","21° 48' 16'' S","48° 8' 25'' W","711 m","VFR Diurno/Noturno e IFR Diurno/Noturno"," 17/35","1800 m","30 m","PCN 40/F/A/X/T","Asfalto","-","-","-","-","-","-","-","-","-","-","-","-","-","-","-","PA2017-2889",0,0,0,"PA2017-2889","","","","AP-1","Classe I","3ª","3C","NPA",11,"-","PA2016-0908","-","PA2016-0908","-","-","-","","-"]
["SBAR","SE0001","SANTA MARIA","ARACAJU","SE","10° 59' 7'' S","37° 4' 24'' W","7 m","VFR Diurno/Noturno e IFR Diurno/Noturno"," 11/29","2200 m","45 m","PCN 48/F/B/X/T","Asfalto","-","-","-","-","-","-","-","-","-","-","-","-","-","-","-","PD1993-0575",0,0,0,"PD1993-0575","","","","AP-2","Classe III","2ª","4C","NPA(11;29)","N/A","PA2020-0406","-","PA2020-0406","-","-","-","-","","-"]
["SBAT","MT0003","PILOTO OSVALDO MARQUES DIAS","ALTA FLORESTA","MT","9° 51' 59'' S","56° 6' 18'' W","289 m","VFR Diurno/Noturno e IFR Diurno/Noturno"," 04/22","2500 m","30 m","PCN 29/F/C/X/U","Asfalto","-","-","-","-","-","-","-","-","-","-","-","-","-","-","-","PA2011-0162",0,0,0,"PA2011-0162","","","","AP-1","Classe I","3ª","4C","NPA",15,"-","PA2016-0908 / PA2018-0389 / PA2018-0390","-","PA2016-0908 / PA2018-0389 / PA2018-0390","-","-","-","X","-"]
["SBAU","SP0009","ESTADUAL DARIO GUARITA","ARAÇATUBA","SP","21° 8' 39'' S","50° 25' 35'' W","415 m","VFR Diurno/Noturno e IFR Diurno/Noturno"," 05/23","2120 m","35 m","PCN 26/F/A/X/T","Asfalto","-","-","-","-","-","-","-","-","-","-","-","-","-","-","-","PD1983-0188","PD1993-0603",0,0,"PD1983-0188","PD1993-0603","","","AP-1","Classe I","3ª","3C","NPA",32,"-","PA2016-0908","-","PA2016-0908","-","-","-","","-"]
["SBAX","MG0008","ROMEU ZEMA","ARAXÁ","MG","19° 33' 38'' S","46° 57' 56'' W","999 m","VFR Diurno/Noturno e IFR Diurno/Noturno"," 15/33","1900 m","30 m","PCN 26/F/B/X/T","Asfalto","-","-","-","-","-","-","-","-","-","-","-","-","-","-","-","PD2005-1273",0,0,0,"PD2005-1273","","","","AP-1","Classe I","3ª","3C","NPA",12,"-","PA2016-0908","-","PA2016-0908","-","-","-","","-"]
["SBBE","PA0001","INTERNACIONAL DE BELÉM/VAL DE CANS/JÚLIO CEZAR RIBEIRO","BELÉM","PA","1° 23' 5'' S","48° 28' 44'' W","17 m","VFR Diurno/Noturno e IFR Diurno/Noturno"," 06/24","2800 m","45 m","PCN 65/F/A/X/T","Asfalto"," 02/20","1830 m","45 m","PCN 50/F/A/X/T","Asfalto","-","-","-","-","-","-","-","-","-","-","PA2016-1883",0,0,0,"PA2016-1883","","","","AP-2","Classe III","1ª","4E","PA1(06) / NPA(24;02;20)","N/A","PA2017-3043","-","PA2017-3043","-","-","-","-","X","-"]
["SBBG","RS0010","COMANDANTE GUSTAVO KRAEMER","BAGÉ","RS","31° 23' 27'' S","54° 6' 35'' W","186 m","VFR Diurno/Noturno e IFR Diurno/Noturno"," 06/24","1500 m","30 m","PCN 18/R/A/Y/T","Concreto"," 14/32","1149 m","45 m","5700 kg / 0,62 MPa","Grama","-","-","-","-","-","-","-","-","-","-","PA2018-2459",0,0,0,"PA2018-2459","","","","AP-1","Classe I","3ª","-","-","-","-","-","-","-","-","-","-","","-"]
["SBBH","MG0003","PAMPULHA - CARLOS DRUMMOND DE ANDRADE","BELO HORIZONTE","MG","19° 51' 7'' S","43° 57' 2'' W","789 m","VFR Diurno/Noturno e IFR Diurno/Noturno"," 13/31","2364 m","45 m","PCN 44/F/B/X/T","Asfalto","-","-","-","-","-","-","-","-","-","-","-","-","-","-","-","PA2017-1295",0,0,0,"PA2017-1295","","","","AP-0","Classe II","2ª","4C","NPA(13)/NINST(31)","N/A","PA2018-2829 / PA2019-1481","-","PA2018-2829 / PA2019-1481","-","-","-","-","","-"]
["SBBI","PR0006","BACACHERI","CURITIBA","PR","25° 24' 12'' S","49° 14' 1'' W","932 m","VFR Diurno/Noturno e IFR Diurno/Noturno"," 18/36","1390 m","31 m","PCN 21/F/B/X/T","Asfalto","-","-","-","-","-","-","-","-","-","-","-","-","-","-","-","PA2016-0533",0,0,0,"PA2016-0533","","","","AP-0","Classe I","3ª","-","-","-","-","-","-","-","-","-","-","","-"]
["SBBP","SP0036","ESTADUAL ARTHUR SIQUEIRA","BRAGANÇA PAULISTA","SP","22° 58' 45'' S","46° 32' 15'' W","893 m","VFR Diurno/Noturno"," 16/34","1200 m","30 m","PCN 16/F/B/X/T","Asfalto","-","-","-","-","-","-","-","-","-","-","-","-","-","-","-","PA2018-3805",0,0,0,"PA2018-3805","","","","AP-0","Classe I","4ª","-","-","-","-","-","-","-","-","-","-","","-"]
["SBBR","DF0001","PRESIDENTE JUSCELINO KUBITSCHEK","BRASÍLIA","DF","15° 52' 16'' S","47° 55' 7'' W","1066 m","VFR Diurno/Noturno e IFR Diurno/Noturno"," 11L/29R","3200 m","45 m","PCN 76/F/B/X/T","Asfalto"," 11R/29L","3300 m","45 m","PCN 68/F/B/W/T","Asfalto","-","-","-","-","-","-","-","-","-","-","PA2012-2422",0,0,0,"PA2012-2422","","","","AP-3","Classe IV","1ª (*)","4E","PA1","N/A","PA2015-2416 / PA2016-0553","-","PA2015-2416 / PA2016-0553","-","-","-","-","","-"]
["SBBU","SP0017","BAURU","BAURU","SP","22° 20' 37'' S","49° 3' 14'' W","617 m","VFR Diurno/Noturno e IFR Diurno/Noturno"," 14/32","1501 m","35 m","PCN 13/F/A/X/T","Asfalto","-","-","-","-","-","-","-","-","-","-","-","-","-","-","-","PA2017-3676",0,0,0,"PA2017-3676","","","","AP-0","Classe I","3ª","-","-","-","-","-","-","-","-","-","-","","-"]
["SBBV","RR0001","ATLAS BRASIL CANTANHEDE","BOA VISTA","RR","2° 50' 29'' N","60° 41' 32'' W","84 m","VFR Diurno/Noturno e IFR Diurno/Noturno"," 08/26","2700 m","45 m","PCN 38/F/A/X/T","Asfalto","-","-","-","-","-","-","-","-","-","-","-","-","-","-","-","PA2018-0273",0,0,0,"PA2018-0273","","","","AP-1","Classe II","1ª","4C","PA1",30,"-","PA2016-0908 / PA2016-2636","-","PA2016-0908 / PA2016-2636","-","-","-","X","-"]
["SBBW","MT0008","BARRA DO GARÇAS","BARRA DO GARÇAS","MT","15° 51' 39'' S","52° 23' 22'' W","350 m","VFR Diurno/Noturno e IFR Diurno/Noturno"," 07/25","1598 m","30 m","PCN 20/F/C/Y/T","Asfalto","-","-","-","-","-","-","-","-","-","-","-","-","-","-","-","PA2016-3033",0,0,0,"PA2016-3033","","","","AP-1","Classe I","-","2C","NPA(07;25)","N/A","PA2018-3446","-","PA2018-3446","-","-","-","-","X","-"]
["SBCA","PR0005","CORONEL ADALBERTO MENDES DA SILVA","CASCAVEL","PR","25° 0' 8'' S","53° 30' 7'' W","759 m","VFR Diurno/Noturno e IFR Diurno/Noturno"," 15/33","1615 m","30 m","PCN 48/F/B/X/T","Asfalto","-","-","-","-","-","-","-","-","-","-","-","-","-","-","-","PA2015-3092",0,0,0,"PA2015-3092","","","","AP-1","Classe I","3ª","3C","NPA",94,"-","PA2016-0908","-","PA2016-0908","-","-","-","","-"]
["SBCB","RJ0003","CABO FRIO","CABO FRIO","RJ","22° 55' 15'' S","42° 4' 17'' W","7 m","VFR Diurno/Noturno e IFR Diurno/Noturno"," 10/28","2550 m","45 m","PCN 76/F/C/X/T","Asfalto","-","-","-","-","-","-","-","-","-","-","-","-","-","-","-","PA2019-2127",0,0,0,"PA2019-2127","","","","AP-1","Classe II","2ª","4E","NPA","N/A","PA2020-1309","-","PA2020-1309","-","-","-","-","","-"]
["SBCD","SC0006","CARLOS ALBERTO DA COSTA NEVES","CAÇADOR","SC","26° 47' 23'' S","50° 56' 23'' W","1029 m","VFR Diurno/Noturno e IFR Diurno/Noturno"," 02/20","1625 m","30 m","PCN 25/F/A/X/T","Asfalto","-","-","-","-","-","-","-","-","-","-","-","-","-","-","-","PD2005-0406","PA2013-3195",0,0,"PD2005-0406","PA2013-3195","","","AP-0","Classe I","-","-","-","-","-","-","-","-","-","-","-","","-"]
["SBCF","MG0001","TANCREDO NEVES","CONFINS","MG","19° 37' 28'' S","43° 58' 19'' W","827 m","VFR Diurno/Noturno e IFR Diurno/Noturno"," 16/34","3000 m","45 m","PCN 83/F/B/W/T","Asfalto","-","-","-","-","-","-","-","-","-","-","-","-","-","-","-","PA2018-2457",0,0,0,"PA2018-2457","","","","AP-3","Classe IV","1ª (*)","4E","PA1(16) / NPA(34)","N/A","PA2015-2165","-","PA2015-2165","-","-","-","-","","-"]
["SBCG","MS0001","CAMPO GRANDE","CAMPO GRANDE","MS","20° 28' 10'' S","54° 40' 13'' W","559 m","VFR Diurno/Noturno e IFR Diurno/Noturno"," 06/24","2600 m","45 m","PCN 48/F/B/X/T","Asfalto","-","-","-","-","-","-","-","-","-","-","-","-","-","-","-","PA2016-1884",0,0,0,"PA2016-1884","","","","AP-2","Classe III","2ª","4C","PA1(06) / NPA(24)","N/A","PA2016-1802","-","PA2016-1802","-","-","-","-","","-"]
["SBCH","SC0003","SERAFIN ENOSS BERTASO","CHAPECÓ","SC","27° 8' 2'' S","52° 39' 43'' W","654 m","VFR Diurno/Noturno e IFR Diurno/Noturno"," 11/29","2063 m","45 m","PCN 45/F/B/X/T","Asfalto","-","-","-","-","-","-","-","-","-","-","-","-","-","-","-","PD1997-0587","PA2012-1357",0,0,"PD1997-0587","PA2012-1357","","","AP-1","Classe II","2ª","4C","NPA",20,"-","PA2016-0908","-","PA2016-0908","-","-","-","","-"]
["SBCI","MA0003","BRIGADEIRO LYSIAS AUGUSTO RODRIGUES","CAROLINA","MA","7° 19' 14'' S","47° 27' 31'' W","172 m","VFR Diurno/Noturno e IFR Diurno/Noturno"," 11/29","1800 m","45 m","PCN 18/F/C/Y/U","Asfalto","-","-","-","-","-","-","-","-","-","-","-","-","-","-","-","PA2006-0233",0,0,0,"PA2006-0233","","","","AP-0","Classe I","4ª","-","-","-","-","-","-","-","-","-","-","X","-"]
["SBCJ","PA0006","CARAJÁS","PARAUAPEBAS","PA","6° 6' 55'' S","50° 0' 5'' W","629 m","VFR Diurno/Noturno e IFR Diurno/Noturno"," 10/28","2000 m","45 m","PCN 41/F/B/X/T","Asfalto","-","-","-","-","-","-","-","-","-","-","-","-","-","-","-","PA2013-3204",0,0,0,"PA2013-3204","","","","AP-1","Classe I","2ª","4C","PA1",35,"-","PA2016-0908 / PA2018-0389 / PA2018-0390","-","PA2016-0908 / PA2018-0389 / PA2018-0390","-","-","-","X","-"]
["SSIM","SC0009","FORQUILHINHA/CRICIÚMA (SBCM*)","FORQUILHINHA","SC","28° 43' 28'' S","49° 25' 17'' W","28 m","VFR Diurno/Noturno e IFR Diurno/Noturno"," 09/27","1491 m","30 m","PCN 22/F/C/X/U","Asfalto","-","-","-","-","-","-","-","-","-","-","-","-","-","-","-","PA2019-1479",0,0,0,"PA2019-1479","","","","AP-0","Classe I","2ª","3C","NPA",19,"-","PA2016-0908 / PA2018-0389 / PA2018-0390","-","PA2016-0908 / PA2018-0389 / PA2018-0390","-","-","-","","-"]
["SBCN","GO0003","NELSON RODRIGUES GUIMARÃES","CALDAS NOVAS","GO","17° 43' 29'' S","48° 36' 36'' W","685 m","VFR Diurno/Noturno e IFR Diurno/Noturno"," 09/27","2100 m","30 m","PCN 35/F/A/X/T","Asfalto","-","-","-","-","-","-","-","-","-","-","-","-","-","-","-","PA2007-1408",0,0,0,"PA2007-1408","","","","AP-1","Classe I","2ª","4C","NPA",14,"-","PA2016-0908 / PA2018-0389 / PA2018-0390","-","PA2016-0908 / PA2018-0389 / PA2018-0390","-","-","-","","-"]
["SBCP","RJ0006","BARTOLOMEU LISANDRO","CAMPOS DOS GOYTACAZES","RJ","21° 42' 4'' S","41° 18' 28'' W","17 m","VFR Diurno/Noturno e IFR Diurno/Noturno"," 07/25","1544 m","45 m","PCN 29/F/A/X/T","Asfalto","-","-","-","-","-","-","-","-","-","-","-","-","-","-","-","PA2018-2768",0,0,0,"PA2018-2768","","","","AP-1","Classe I","2ª","3C","NPA",28,"-","PA2016-0908 / PA2018-0389 / PA2018-0390","-","PA2016-0908 / PA2018-0389 / PA2018-0390","-","-","-","","-"]
["SBCR","MS0009","CORUMBÁ","CORUMBÁ","MS","19° 0' 43'' S","57° 40' 17'' W","141 m","VFR Diurno/Noturno e IFR Diurno/Noturno"," 09/27","1500 m","45 m","PCN 71/F/C/X/T","Asfalto","-","-","-","-","-","-","-","-","-","-","-","-","-","-","-","PA2016-0668",0,0,0,"PA2016-0668","","","","AP-1","Classe I","2ª","4C","NPA",6,"-","PA2016-0908 / PA2018-0389 / PA2018-0390","-","PA2016-0908 / PA2018-0389 / PA2018-0390","-","-","-","","-"]
["SBCT","PR0001","AFONSO PENA","CURITIBA","PR","25° 31' 54'' S","49° 10' 34'' W","911 m","VFR Diurno/Noturno e IFR Diurno/Noturno"," 15/33","2218 m","45 m","PCN 42/F/A/X/T","Asfalto"," 11/29","1798 m","45 m","PCN 33/F/A/X/T","Asfalto","-","-","-","-","-","-","-","-","-","-","PA2013-3007",0,0,0,"PA2013-3007","","","","AP-3","Classe IV","1ª","4E","PA2(15) / PA1(33)/ NPA(11;29)","N/A","PA2016-1576","-","PA2016-1576","-","-","-","-","","-"]
["SSCV","BA0012","CARAVELAS","CARAVELAS","BA","17° 39' 2'' S","39° 15' 16'' W","11 m","VFR Diurno"," 06/24","1530 m","45 m","PCN 32/F/C/X/U","Asfalto"," 18/36","1150 m","45 m","PCN 32/F/C/X/U","Asfalto","-","-","-","-","-","-","-","-","-","-","PA2019-0507",0,0,0,"PA2019-0507","","","","AP-0","Classe I","-","-","-","-","-","-","-","-","-","-","-","","-"]
["SBCX","RS0007","HUGO CANTERGIANI","CAXIAS DO SUL","RS","29° 11' 44'' S","51° 11' 23'' W","754 m","VFR Diurno/Noturno e IFR Diurno/Noturno"," 15/33","1670 m","30 m","PCN 45/F/A/X/T","Asfalto","-","-","-","-","-","-","-","-","-","-","-","-","-","-","-","PA2017-3509",0,0,0,"PA2017-3509","","","","AP-1","Classe I","3ª","4C","NPA",31,"-","PA2016-0908 / PA2018-0389 / PA2018-0390","-","PA2016-0908 / PA2018-0389 / PA2018-0390","-","-","-","","-"]
["SBCY","MT0001","MARECHAL RONDON","VÁRZEA GRANDE","MT","15° 39' 0'' S","56° 7' 3'' W","188 m","VFR Diurno/Noturno e IFR Diurno/Noturno"," 17/35","2300 m","45 m","PCN 46/F/B/X/U","Asfalto","-","-","-","-","-","-","-","-","-","-","-","-","-","-","-","PA2018-2575",0,0,0,"PA2018-2575","","","","AP-2","Classe III","1ª","4C","PA1(35) / NPA(17)","Ver Portaria","-","PA2016-1044","-","PA2016-1044","-","-","-","X","-"]
["SSCL","MS0018","CASSILÂNDIA","CASSILÂNDIA","MS","19° 8' 49'' S","51° 40' 35'' W","481 m","VFR Diurno"," 13/31","1081 m","18 m","PCN 10/F/B/Y/T","Asfalto","-","-","-","-","-","-","-","-","-","-","-","-","-","-","-","PA2017-1340",0,0,0,"PA2017-1340","","","","AP-0","Classe I","-","-","-","-","-","-","-","-","-","-","-","","-"]
["SBDB","MS0004","BONITO","BONITO","MS","21° 14' 50'' S","56° 27' 9'' W","334 m","VFR Diurno/Noturno"," 18/36","2000 m","30 m","PCN 48/F/A/X/T","Asfalto","-","-","-","-","-","-","-","-","-","-","-","-","-","-","-","PA2015-1122",0,0,0,"PA2015-1122","","","","AP-1","Classe I","3ª","4C","NINST",5,"-","PA2016-0908 / PA2018-0389 / PA2018-0390","-","PA2016-0908 / PA2018-0389 / PA2018-0390","-","-","-","","-"]
["SBDN","SP0005","PRESIDENTE PRUDENTE","PRESIDENTE PRUDENTE","SP","22° 10' 42'' S","51° 25' 8'' W","452 m","VFR Diurno/Noturno e IFR Diurno/Noturno"," 12/30","2100 m","35 m","PCN 38/F/A/X/T","Asfalto","-","-","-","-","-","-","-","-","-","-","-","-","-","-","-","PA2016-1108",0,0,0,"PA2016-1108","","","","AP-1","Classe II","3ª","4C","NPA",19,"-","PA2016-0908 / PA2018-0389 / PA2018-0390","-","PA2016-0908 / PA2018-0389 / PA2018-0390","-","-","-","","-"]
["SBDO","MS0008","DOURADOS","DOURADOS","MS","22° 12' 2'' S","54° 55' 32'' W","458 m","VFR Diurno/Noturno e IFR Diurno/Noturno"," 06/24","1950 m","30 m","PCN 28/F/B/X/T","Asfalto","-","-","-","-","-","-","-","-","-","-","-","-","-","-","-","PA2013-3397",0,0,0,"PA2013-3397","","","","AP-1","Classe I","2ª","3C","NPA",42,"-","PA2016-0908 / PA2018-0389 / PA2018-0390","-","PA2016-0908 / PA2018-0389 / PA2018-0390","-","-","-","","-"]
["SBEG","AM0001","EDUARDO GOMES","MANAUS","AM","3° 2' 28'' S","60° 3' 2'' W","80 m","VFR Diurno/Noturno e IFR Diurno/Noturno"," 11/29","2700 m","45 m","PCN 71/F/C/X/T","Asfalto","-","-","-","-","-","-","-","-","-","-","-","-","-","-","-","PA2012-1425",0,0,0,"PA2012-1425","","","","AP-2","Classe III","1ª","4E","PA1(10) / NPA(28)","N/A","PA2015-0125","-","PA2015-0125","-","-","-","-","X","-"]
["SBEK","PA0011","JACAREACANGA","JACAREACANGA","PA","6° 14' 7'' S","57° 46' 33'' W","99 m","VFR Diurno e IFR Diurno"," 08/26","1600 m","30 m","PCN 36/F/B/Y/U","Asfalto","-","-","-","-","-","-","-","-","-","-","-","-","-","-","-","PA2020-2419",0,0,0,"PA2020-2419","","","","AP-0","Classe I","-","-","-","-","-","-","-","-","-","-","-","X","-"]
["SBFI","PR0002","CATARATAS","FOZ DO IGUAÇU","PR","25° 36' 1'' S","54° 29' 6'' W","240 m","VFR Diurno/Noturno e IFR Diurno/Noturno"," 15/33","2195 m","45 m","PCN 51/F/B/X/T","Asfalto","-","-","-","-","-","-","-","-","-","-","-","-","-","-","-","PA2014-1182",0,0,0,"PA2014-1182","","","","AP-2","Classe III","2ª","4C","PA1(15)/NPA(33)","N/A","PA2019-1616","-","PA2019-1616","-","-","-","-","","-"]
["SBFL","SC0001","HERCÍLIO LUZ","FLORIANÓPOLIS","SC","27° 40' 13'' S","48° 33' 9'' W","5 m","VFR Diurno/Noturno e IFR Diurno/Noturno"," 14/32","2400 m","45 m","PCN 78/F/A/X/T","Asfalto"," 03/21","1320 m","45 m","PCN 26/R/B/X/T","Concreto","-","-","-","-","-","-","-","-","-","-","PA2017-3540",0,0,0,"PA2017-3540","","","","AP-2","Classe III","1ª","4E(14/32); 2B(03/21)"," PA1(14)/ NPA(32)/NINST(03;21)","N/A","PA2018-3994","-","PA2018-3994","-","-","-","-","","-"]
["SBFN","PE0003","FERNANDO DE NORONHA","FERNANDO DE NORONHA","PE","3° 51' 17'' S","32° 25' 42'' W","58 m","VFR Diurno/Noturno e IFR Diurno/Noturno"," 12/30","1845 m","45 m","PCN 30/F/C/X/U","Asfalto","-","-","-","-","-","-","-","-","-","-","-","-","-","-","-","PA2018-2251",0,0,0,"PA2018-2251","","","","AP-1","Classe II","2ª","4C","NPA",37,"-","PA2016-0908 / PA2018-0389 / PA2018-0390","-","PA2016-0908 / PA2018-0389 / PA2018-0390","-","-","-","","-"]
["SBFZ","CE0001","PINTO MARTINS","FORTALEZA","CE","3° 46' 33'' S","38° 31' 56'' W","25 m","VFR Diurno/Noturno e IFR Diurno/Noturno"," 13/31","2545 m","45 m","PCN 66/F/A/X/T","Asfalto","-","-","-","-","-","-","-","-","-","-","-","-","-","-","-","PA2018-3262",0,0,0,"PA2018-3262","","","","AP-3","Classe IV","1ª","4E","PA1(13) / NPA(31)","N/A","PA2018-3869 / PA2020-2509","-","PA2018-3869 / PA2020-2509","-","-","-","-","","-"]
["SBGL","RJ0001","AEROPORTO INTERNACIONAL DO RIO DE JANEIRO/GALEÃO – ANTONIO CARLOS JOBIM","RIO DE JANEIRO","RJ","22° 48' 36'' S","43° 15' 2'' W","9 m","VFR Diurno/Noturno e IFR Diurno/Noturno"," 10/28","4000 m","45 m","PCN 78/R/A/W/T","Concreto"," 15/33","3180 m","47 m","PCN 73/F/B/X/T","Asfalto","-","-","-","-","-","-","-","-","-","-","PA2012-1398",0,0,0,"PA2012-1398","","","","AP-3","Classe IV","1ª (*)","4E","PA2(10) / PA1(28;15) / NPA(33)","N/A","PA2015-2166","-","PA2015-2166","-","-","-","-","","-"]
["SBGM","RO0006","GUAJARÁ-MIRIM","GUAJARÁ-MIRIM","RO","10° 47' 18'' S","65° 16' 54'' W","146 m","VFR Diurno/Noturno"," 17/35","1795 m","45 m","PCN 30/F/C/X/U","Asfalto","-","-","-","-","-","-","-","-","-","-","-","-","-","-","-","PA2020-0974",0,0,0,"PA2020-0974","","","","AP-0","Classe I","-","-","-","-","-","-","-","-","Interditado","PA2020-0882","PA2020-0882","X","-"]
["SBGO","GO0001","SANTA GENOVEVA/GOIÂNIA","GOIÂNIA","GO","16° 37' 57'' S","49° 13' 16'' W","747 m","VFR Diurno/Noturno e IFR Diurno/Noturno"," 14/32","2286 m","45 m","PCN 67/F/B/X/T","Asfalto","-","-","-","-","-","-","-","-","-","-","-","-","-","-","-","PA2017-3371",0,0,0,"PA2017-3371","","","","AP-2","Classe III","1ª","4C","NPA(14;32)","N/A","PA2016-1671","-","PA2016-1671","-","-","-","-","","-"]
["SBGR","SP0002","GUARULHOS - GOVERNADOR ANDRÉ FRANCO MONTORO","GUARULHOS","SP","23° 26' 8'' S","46° 28' 23'' W","750 m","VFR Diurno/Noturno e IFR Diurno/Noturno"," 9L/27R","3700 m","45 m","PCN 77/F/B/W/T","Asfalto"," 9R/27L","3000 m","45 m","PCN 77/F/B/W/T","Asfalto","-","-","-","-","-","-","-","-","-","-","PA2019-3642",0,0,0,"PA2019-3642","","","","AP-3","Classe IV","1ª (*)","4E","PA3-A(09R)/ PA2(09L)/ PA1(27L;27R)","N/A","PA2013-2987","-","PA2013-2987","-","-","-","-","","-"]
["SSGG","PR0009","TANCREDO THOMAS DE FARIA","GUARAPUAVA","PR","25° 23' 18'' S","51° 31' 25'' W","1065 m","VFR Diurno/Noturno e IFR Diurno/Noturno"," 08/26","1365 m","30 m","PCN 23/F/C/X/T","Asfalto","-","-","-","-","-","-","-","-","-","-","-","-","-","-","-","PA2019-3943",0,0,0,"PA2019-3943","","","","AP-1","Classe I","4ª","2C","NPA","N/A","PA2019-3944 / PA2020-3765","-","PA2019-3944 / PA2020-3765","-","-","-","-","","-"]
["SBGV","MG0032","CORONEL ALTINO MACHADO","GOVERNADOR VALADARES","MG","18° 53' 49'' S","41° 59' 10'' W","171 m","VFR Diurno/Noturno e IFR Diurno/Noturno"," 07/25","1701 m","30 m","PCN 31/F/B/X/T","Asfalto","-","-","-","-","-","-","-","-","-","-","-","-","-","-","-","PA2015-0908",0,0,0,"PA2015-0908","","","","AP-1","Classe I","3ª","2C","NPA","N/A","PA2019-1077","-","PA2019-1077","-","-","-","-","","-"]
["SBGW","SP0076","GUARATINGUETÁ","GUARATINGUETÁ","SP","22° 47' 30'' S","45° 12' 16'' W","537 m","VFR Diurno/Noturno e IFR Diurno/Noturno"," 02/20","1551 m","30 m","PCN 15/F/C/Y/U","Asfalto","-","-","-","-","-","-","-","-","-","-","-","-","-","-","-","PA2020-1020",0,0,0,"PA2020-1020","","","","AP-0","Classe I","-","-","-","-","-","-","-","-","-","-","-","","-"]
["SBHT","PA0003","ALTAMIRA","ALTAMIRA","PA","3° 15' 3'' S","52° 15' 8'' W","112 m","VFR Diurno/Noturno e IFR Diurno/Noturno"," 07/25","2003 m","30 m","PCN 36/F/A/X/T","Asfalto","-","-","-","-","-","-","-","-","-","-","-","-","-","-","-","PA2017-2887",0,0,0,"PA2017-2887","","","","AP-1","Classe I","2ª","4C","NPA",95,"-","PA2016-0908 / PA2018-0389 / PA2018-0390","-","PA2016-0908 / PA2018-0389 / PA2018-0390","-","-","-","X","-"]
["SBIC","AM0012","ITACOATIARA","ITACOATIARA","AM","3° 7' 35'' S","58° 28' 54'' W","43 m","VFR Diurno e IFR Diurno"," 14/32","1515 m","30 m","PCN 8/F/C/Y/U","Asfalto","-","-","-","-","-","-","-","-","-","-","-","-","-","-","-","PA2018-2359",0,0,0,"PA2018-2359","","","","AP-0","Classe I","-","-","-","-","-","-","-","-","-","-","-","X","-"]
["SBIH","PA0010","ITAITUBA","ITAITUBA","PA","4° 14' 32'' S","56° 0' 3'' W","33 m","VFR Diurno/Noturno e IFR Diurno/Noturno"," 05/23","1605 m","30 m","PCN 26/F/B/X/T","Asfalto","-","-","-","-","-","-","-","-","-","-","-","-","-","-","-","PA2020-1747",0,0,0,"PA2020-1747","","","","AP-1","Classe I","3ª","3C","NPA",29,"-","PA2016-0908","-","PA2016-0908","-","-","-","X","-"]
["SBIL","BA0004","BAHIA - JORGE AMADO","ILHÉUS","BA","14° 48' 54'' S","39° 2' 0'' W","4 m","VFR Diurno/Noturno e IFR Diurno/Noturno"," 11/29","1577 m","45 m","PCN 35/F/B/X/T","Asfalto","-","-","-","-","-","-","-","-","-","-","-","-","-","-","-","PA2020-2422",0,0,0,"PA2020-2422","","","","AP-1","Classe II","2ª","4C","NPA",23,"-","PA2016-0908","-","PA2016-0908","-","-","-","","-"]
["SBIP","MG0007","USIMINAS","SANTANA DO PARAÍSO","MG","19° 28' 14'' S","42° 29' 17'' W","239 m","VFR Diurno e IFR Diurno/Noturno"," 05/23","2005 m","45 m","PCN 33/F/B/X/T","Asfalto","-","-","-","-","-","-","-","-","-","-","-","-","-","-","-","PD2001-1629",0,0,0,"PD2001-1629","","","","AP-1","Classe I","3ª","3C","NPA",32,"-","PA2016-0908","-","PA2016-0908","-","-","-","","-"]
["SBIZ","MA0002","PREFEITO RENATO MOREIRA","IMPERATRIZ","MA","5° 31' 50'' S","47° 27' 30'' W","131 m","VFR Diurno/Noturno e IFR Diurno/Noturno"," 07/25","1798 m","45 m","PCN 50/F/A/X/T","Asfalto","-","-","-","-","-","-","-","-","-","-","-","-","-","-","-","PA2018-2252",0,0,0,"PA2018-2252","","","","AP-1","Classe II","2ª","4C","NPA",46,"-","PA2016-0908","-","PA2016-0908","-","-","-","X","-"]
["SBJC","PA0005","BELÉM/BRIGADEIRO PROTÁSIO DE OLIVEIRA","BELÉM","PA","1° 24' 54'' S","48° 27' 32'' W","16 m","VFR Diurno"," 16/34","1106 m","30 m","PCN 34/F/C/X/U","Asfalto","-","-","-","-","-","-","-","-","-","-","-","-","-","-","-","PA2011-0161",0,0,0,"PA2011-0161","","","","AP-0","Classe I","3ª","-","-","-","-","-","-","-","-","-","-","X","-"]
["SBJD","SP0031","COMANDANTE ROLIM ADOLFO AMARO","JUNDIAÍ","SP","23° 10' 54'' S","46° 56' 37'' W","753 m","VFR Diurno/Noturno e IFR Diurno/Noturno"," 18/36","1400 m","30 m","PCN 21/F/A/X/T","Asfalto","-","-","-","-","-","-","-","-","-","-","-","-","-","-","-","PA2018-3807",0,0,0,"PA2018-3807","","","","AP-0","Classe I","3ª","-","NPA","-","-","-","-","-","-","-","-","","-"]
["SBJF","MG0016","FRANCISCO DE ASSIS","JUIZ DE FORA","MG","21° 47' 35'' S","43° 23' 8'' W","911 m","VFR Diurno/Noturno e IFR Diurno/Noturno"," 03/21","1535 m","30 m","PCN 32/F/A/Y/T","Asfalto","-","-","-","-","-","-","-","-","-","-","-","-","-","-","-","PA2020-1921",0,0,0,"PA2020-1921","","","","AP-0","Classe I","3ª","3C","NPA",29,"-","PA2016-0908","-","PA2016-0908","-","-","-","","-"]
["SBJI","RO0005","JI-PARANÁ","JI-PARANÁ","RO","10° 52' 14'' S","61° 50' 48'' W","182 m","VFR Diurno/Noturno"," 03/21","1800 m","45 m","PCN 30/F/C/X/U","Asfalto","-","-","-","-","-","-","-","-","-","-","-","-","-","-","-","PA2006-0234","PA2013-1452",0,0,"PA2006-0234","PA2013-1452","","","AP-1","Classe I","3ª","3C","NINST",15,"-","PA2016-0908","-","PA2016-0908","-","-","-","X","-"]
["SBJP","PB0001","PRESIDENTE CASTRO PINTO","JOÃO PESSOA","PB","7° 8' 54'' S","34° 57' 1'' W","66 m","VFR Diurno/Noturno e IFR Diurno/Noturno"," 16/34","2515 m","45 m","PCN 52/F/B/X/T","Asfalto","-","-","-","-","-","-","-","-","-","-","-","-","-","-","-","PA2015-1203",0,0,0,"PA2015-1203","","","","AP-2","Classe III","2ª","4C","NPA","N/A","PA2020-0405","-","PA2020-0405","-","-","-","-","","-"]
["SBJR","RJ0005","JACAREPAGUÁ/RJ - Roberto Marinho","RIO DE JANEIRO","RJ","22° 59' 15'' S","43° 22' 12'' W","3 m","VFR Diurno/Noturno"," 03/21","900 m","30 m","PCN 10/F/C/Y/U","Asfalto","-","-","-","-","-","-","-","-","-","-","-","-","-","-","-","PA2017-1808",0,0,0,"PA2017-1808","","","","AP-1","Classe II","2ª","-","-","-","-","-","-","-","-","-","-","","-"]
["SBJU","CE0002","ORLANDO BEZERRA DE MENEZES","JUAZEIRO DO NORTE","CE","7° 13' 9'' S","39° 16' 10'' W","409 m","VFR Diurno/Noturno e IFR Diurno/Noturno"," 13/31","1940 m","45 m","PCN 45/F/A/X/T","Asfalto","-","-","-","-","-","-","-","-","-","-","-","-","-","-","-","PA2019-0624",0,0,0,"PA2019-0624","","","","AP-1","Classe II","2ª","4C","NPA",42,"-","PA2016-0908","-","PA2016-0908","-","-","-","","-"]
["SBJV","SC0004","LAURO CARNEIRO DE LOYOLA","JOINVILLE","SC","26° 13' 23'' S","48° 47' 52'' W","5 m","VFR Diurno/Noturno e IFR Diurno/Noturno"," 15/33","1540 m","45 m","PCN 51/F/A/W/T","Asfalto","-","-","-","-","-","-","-","-","-","-","-","-","-","-","-","PA2020-1029",0,0,0,"PA2020-1029","","","","AP-1","Classe II","1ª","4C","PA1(33) / NPA(15)",34,"-","PA2016-0908","-","PA2016-0908","-","-","-","","-"]
["SBKG","PB0003","PRESIDENTE JOÃO SUASSUNA","CAMPINA GRANDE","PB","7° 16' 9'' S","35° 53' 42'' W","502 m","VFR Diurno/Noturno e IFR Diurno/Noturno"," 15/33","1600 m","42 m","PCN 50/F/A/X/T","Asfalto","-","-","-","-","-","-","-","-","-","-","-","-","-","-","-","PA2016-0575",0,0,0,"PA2016-0575","","","","AP-1","Classe I","2ª","4C","NPA",16,"-","PA2016-0908","-","PA2016-0908","-","-","-","","-"]
["SBKP","SP0003","VIRACOPOS","CAMPINAS","SP","23° 0' 25'' S","47° 8' 4'' W","661 m","VFR Diurno/Noturno e IFR Diurno/Noturno"," 15/33","3240 m","45 m","PCN 56/F/B/X/T","Asfalto","-","-","-","-","-","-","-","-","-","-","-","-","-","-","-","PA2018-3677",0,0,0,"PA2018-3677","","",{"$f":"IF(AG68<>0,HYPERLINK(\"http://pergamum.anac.gov.br/arquivos/\" & AG68 & \".pdf\",AG68),\"\")","v":""},"AP-3","Classe IV","1ª (*)","4E","PA1(15) / NPA(33)","N/A","PA2014-1388 / PA2018-3198 / PA2020-0552","-","PA2014-1388 / PA2018-3198 / PA2020-0552","-","-","-","-","","-"]
["SBLE","BA0006","HORÁCIO DE MATTOS","LENÇÓIS","BA","12° 28' 56'' S","41° 16' 37'' W","506 m","VFR Diurno/Noturno"," 14/32","2082 m","30 m","PCN 44/R/A/W/T","Asfalto","-","-","-","-","-","-","-","-","-","-","-","-","-","-","-","PA2015-2870",0,0,0,{"$f":"IF(AD69<>0,HYPERLINK(\"http://pergamum.anac.gov.br/arquivos/\" & AD69 & \".pdf\",AD69),\"\")","v":"PA2015-2870"},"","","","AP-1","Classe I","3ª","3C","NINST",7,"-","PA2016-0908",{"$f":"IF(AR69<>0,HYPERLINK(\"http://pergamum.anac.gov.br/arquivos/\" & AR69 & \".pdf\",AR69),\"\")","v":"-"},"PA2016-0908","-","-",{"$f":"IF(AW69<>0,HYPERLINK(\"http://pergamum.anac.gov.br/arquivos/\" & AW69 & \".pdf\",AW69),\"\")","v":"-"},"","-"]
["SBLJ","SC0007","LAGES","LAGES","SC","27° 46' 56'' S","50° 16' 54'' W","934 m","VFR Diurno/Noturno e IFR Diurno/Noturno"," 17/35","1532 m","30 m","PCN 17/F/C/Y/U","Asfalto","-","-","-","-","-","-","-","-","-","-","-","-","-","-","-","PA2016-1562",0,0,0,"PA2016-1562","","","","AP-0","Classe I","4ª","2C","NPA(17;35)","N/A","PA2019-1828","-","PA2019-1828","-","-","-","-","","-"]
["SBLO","PR0003","GOVERNADOR JOSÉ RICHA","LONDRINA","PR","23° 19' 49'' S","51° 8' 12'' W","569 m","VFR Diurno/Noturno e IFR Diurno/Noturno"," 13/31","2100 m","45 m","PCN 43/F/B/X/T","Asfalto","-","-","-","-","-","-","-","-","-","-","-","-","-","-","-","PA2018-1601",0,0,0,"PA2018-1601","","","","AP-2","Classe II","2ª","4C","NPA","N/A","PA2020-3206","-","PA2020-3206","-","-","-","-","","-"]
["SBLP","BA0037","BOM JESUS DA LAPA","BOM JESUS DA LAPA","BA","13° 15' 41'' S","43° 24' 27'' W","443 m","VFR Diurno/Noturno e IFR Diurno"," 18/36","1211 m","30 m","PCN 9/F/C/Y/U","Asfalto","-","-","-","-","-","-","-","-","-","-","-","-","-","-","-",0,0,0,0,"","","","","AP-0","Classe I","4ª","-","-","-","-","-","-","-","-","-","-","","-"]
["SBMA","PA0004","JOÃO CORREA DA ROCHA","MARABÁ","PA","5° 22' 5'' S","49° 8' 17'' W","109 m","VFR Diurno/Noturno e IFR Diurno/Noturno"," 07/25","2000 m","45 m","PCN 40/F/C/X/U","Asfalto","-","-","-","-","-","-","-","-","-","-","-","-","-","-","-","PA2018-1179",0,0,0,"PA2018-1179","","","","AP-1","Classe II","2ª","4C","NPA",35,"-","PA2016-0908","-","PA2016-0908","-","-","-","X","-"]
["SBMD","PA0009","MONTE DOURADO","ALMEIRIM","PA","0° 53' 23'' S","52° 36' 8'' W","206 m","VFR Diurno/Noturno e IFR Diurno/Noturno"," 08/26","1800 m","30 m","PCN 25/F/B/X/U","Asfalto","-","-","-","-","-","-","-","-","-","-","-","-","-","-","-","PA2020-1922",0,0,0,"PA2020-1922","","","","AP-1","Classe I","3ª","3C","NPA",8,"-","PA2016-0908","-","PA2016-0908","-","-","-","X","-"]
["SBME","RJ0004","MACAÉ","MACAÉ","RJ","22° 20' 34'' S","41° 45' 50'' W","2 m","VFR Diurno/Noturno e IFR Diurno/Noturno"," 06/24","1200 m","30 m","PCN 19/F/C/W/T","Asfalto","-","-","-","-","-","-","-","-","-","-","-","-","-","-","-","PA2019-3922",0,0,0,"PA2019-3922","","","","AP-1","Classe I","2ª","2C","NPA","N/A","PA2019-3813 / PA2020-3766","-","PA2019-3813 / PA2020-3766","-","-","-","-","","-"]
["SBMG","PR0004","SÍLVIO NAME JÚNIOR","MARINGÁ","PR","23° 28' 46'' S","52° 0' 44'' W","545 m","VFR Diurno/Noturno e IFR Diurno/Noturno"," 10/28","2100 m","45 m","PCN 41/F/A/X/T","Asfalto","-","-","-","-","-","-","-","-","-","-","-","-","-","-","-","PA2011-0606",0,0,0,"PA2011-0606","","","","AP-2","Classe II","2ª","4C","NPA",56,"-","PA2016-0908","-","PA2016-0908","-","-","-","","-"]
["SBMK","MG0004","MÁRIO RIBEIRO","MONTES CLAROS","MG","16° 42' 22'' S","43° 49' 19'' W","668 m","VFR Diurno/Noturno e IFR Diurno/Noturno"," 12/30","2100 m","45 m","PCN 34/F/B/X/T","Asfalto","-","-","-","-","-","-","-","-","-","-","-","-","-","-","-","PA2014-1719",0,0,0,"PA2014-1719","","","","AP-1","Classe II","2ª","4C","NPA",6,"-","PA2016-0908","-","PA2016-0908","-","-","-","","-"]
["SBML","SP0014","FRANK MILOYE MILENKOVICH","MARÍLIA","SP","22° 11' 44'' S","49° 55' 37'' W","650 m","VFR Diurno/Noturno e IFR Diurno/Noturno"," 03/21","1700 m","35 m","PCN 35/F/B/X/T","Asfalto","-","-","-","-","-","-","-","-","-","-","-","-","-","-","-","PA2017-1580",0,0,0,"PA2017-1580","","","","AP-1","Classe I","3ª","3C","NPA",20,"-","PA2016-0908","-","PA2016-0908","-","-","-","","-"]
["SBMO","AL0001","ZUMBI DOS PALMARES","MACEIÓ","AL","9° 31' 2'' S","35° 47' 1'' W","118 m","VFR Diurno/Noturno e IFR Diurno/Noturno"," 12/30","2602 m","45 m","PCN 46/F/A/X/T","Asfalto","-","-","-","-","-","-","-","-","-","-","-","-","-","-","-","PD2006-0362",0,0,0,"PD2006-0362","","","","AP-2","Classe III","1ª","4C","PA1(12) / NPA(30)","N/A","PA2020-0328","-","PA2020-0328","-","-","-","-","","-"]
["SBMQ","AP0001","ALBERTO ALCOLUMBRE","MACAPÁ","AP","0° 3' 3'' N","51° 4' 13'' W","17 m","VFR Diurno/Noturno e IFR Diurno/Noturno"," 08/26","1800 m","45 m","PCN 48/F/C/X/T","Asfalto","-","-","-","-","-","-","-","-","-","-","-","-","-","-","-","PA2017-3680",0,0,0,"PA2017-3680","","","","AP-1","Classe II","2ª","4C","NPA",50,"-","PA2016-0908","-","PA2016-0908","-","-","-","X","-"]
["SBMS","RN0002","DIX-SEPT ROSADO","MOSSORÓ","RN","5° 11' 45'' S","37° 21' 42'' W","23 m","VFR Diurno e IFR Diurno/Noturno"," 05/23","2000 m","30 m","PCN 31/F/B/X/T","Asfalto","-","-","-","-","-","-","-","-","-","-","-","-","-","-","-","PA2011-0163",0,0,0,"PA2011-0163","","","","AP-0","Classe I","4ª","2C","NPA","N/A","PA2019-0759","-","PA2019-0759","-","-","-","-","","-"]
["SBMT","SP0007","CAMPO DE MARTE","SÃO PAULO","SP","23° 30' 24'' S","46° 38' 2'' W","722 m","VFR Diurno/Noturno"," 12/30","1600 m","45 m","PCN 16/F/C/Y/U","Asfalto","-","-","-","-","-","-","-","-","-","-","11  28","quadrado","25 m x25 m","4 t","Paralelepípedo","PA2015-2143",0,0,0,"PA2015-2143","","","","AP-0","Classe I","3ª","-","-","-","-","-","-","-","-","-","-","","-"]
["SBMY","AM0015","MANICORÉ","MANICORÉ","AM","5° 49' 1'' S","61° 17' 2'' W","53 m","VFR Diurno"," 05/23","1265 m","30 m","PCN 12/F/C/Y/U","Asfalto","-","-","-","-","-","-","-","-","-","-","-","-","-","-","-","PA2011-1706",0,0,0,"PA2011-1706","","","","AP-1","Classe I","-","2C","NINST",7,"-","PA2016-0908","-","PA2016-0908","-","-","-","X","-"]
["SBNF","SC0002","MINISTRO VICTOR KONDER","NAVEGANTES","SC","26° 52' 43'' S","48° 39' 3'' W","5 m","VFR Diurno/Noturno e IFR Diurno/Noturno"," 07/25","1701 m","45 m","PCN 33/F/A/X/T","Asfalto","-","-","-","-","-","-","-","-","-","-","-","-","-","-","-","PA2013-3372",0,0,0,"PA2013-3372","","","","AP-2","Classe III","2ª","4C","NPA","N/A","PA2019-3803","-","PA2019-3803","-","-","-","-","","-"]
["SBNM","RS0008","SANTO ÂNGELO","SANTO ÂNGELO","RS","28° 16' 54'' S","54° 10' 6'' W","322 m","VFR Diurno/Noturno e IFR Diurno/Noturno"," 12/30","1625 m","30 m","PCN 35/F/A/X/T","Asfalto","-","-","-","-","-","-","-","-","-","-","-","-","-","-","-","PA2019-3072",0,0,0,"PA2019-3072","","","","AP-1","Classe I","4ª","2C","NPA","N/A","PA2019-0746","-","PA2019-0746","-","-","-","-","","-"]
["SBOI","AP0002","OIAPOQUE","OIAPOQUE","AP","3° 51' 41'' N","51° 47' 46'' W","19 m","VFR Diurno e IFR Diurno"," 03/21","1200 m","30 m","PCN 10/F/B/Y/U","Asfalto","-","-","-","-","-","-","-","-","-","-","-","-","-","-","-","PD1984-0039","PD1993-0516","PD1993-0602",0,"PD1984-0039","PD1993-0516","PD1993-0602","","AP-0","Classe I","-","-","-","-","-","-","-","-","-","-","-","X","-"]
["SBPA","RS0001","SALGADO FILHO","PORTO ALEGRE","RS","29° 59' 41'' S","51° 10' 16'' W","4 m","VFR Diurno/Noturno e IFR Diurno/Noturno"," 11/29","2280 m","45 m","PCN 74/F/A/X/T","Asfalto","-","-","-","-","-","-","-","-","-","-","-","-","-","-","-","PA2014-1446",0,0,0,"PA2014-1446","","","","AP-3","Classe IV","1ª","4E","PA2(11) / NPA(29)","N/A","PA2018-3651 / PA2019-3338","-","PA2018-3651 / PA2019-3338","-","-","-","-","","-"]
["SBPB","PI0002","AEROPORTO INTERNACIONAL DE PARNAÍBA / PREFEITO DOUTOR JOÃO SILVA FILHO","PARNAÍBA","PI","2° 53' 38'' S","41° 43' 49'' W","5 m","VFR Diurno/Noturno"," 10/28","2500 m","45 m","PCN 52/F/C/X/T","Asfalto","-","-","-","-","-","-","-","-","-","-","-","-","-","-","-","PA2013-1946",0,0,0,"PA2013-1946","","","","AP-1","Classe I","3ª","3C","NINST",9,"-","PA2016-0908 / PA2018-0389 / PA2018-0390","-","PA2016-0908 / PA2018-0389 / PA2018-0390","-","-","-","","-"]
["SBPC","MG0018","EMBAIXADOR WALTHER MOREIRA SALLES","POÇOS DE CALDAS","MG","21° 50' 16'' S","46° 33' 58'' W","1261 m","VFR Diurno e IFR Diurno"," 09/27","1515 m","30 m","PCN 14/F/C/Y/U","Asfalto","-","-","-","-","-","-","-","-","-","-","-","-","-","-","-","PA2019-0534",0,0,0,"PA2019-0534","","","","AP-0","Classe I","4ª","-","-","-","-","-","-","-","-","-","-","","-"]
["SBPF","RS0006","LAURO KURTZ","PASSO FUNDO","RS","28° 14' 43'' S","52° 19' 43'' W","724 m","VFR Diurno/Noturno e IFR Diurno/Noturno"," 08/26","1700 m","30 m","PCN 29/F/A/X/T","Asfalto","-","-","-","-","-","-","-","-","-","-","-","-","-","-","-","PA2013-3197",0,0,0,"PA2013-3197","","","","AP-1","Classe I","4ª","4C","NPA",43,"-","PA2016-0908 / PA2018-0389 / PA2018-0390","-","PA2016-0908 / PA2018-0389 / PA2018-0390","-","-","-","","Restrição imposta pela PA2019-2371 foi suspensa pela PA2019-2427"]
["SBPJ","TO0001","BRIGADEIRO LYSIAS RODRIGUES","PALMAS","TO","10° 17' 24'' S","48° 21' 28'' W","236 m","VFR Diurno/Noturno e IFR Diurno/Noturno"," 14/32","2500 m","45 m","PCN 48/F/B/X/T","Asfalto","-","-","-","-","-","-","-","-","-","-","-","-","-","-","-","PA2011-0232",0,0,0,"PA2011-0232","","","","AP-2","Classe II","2ª","4C","NPA",38,"-","PA2016-0908","-","PA2016-0908","-","-","-","X","-"]
["SBPK","RS0005","JOÃO SIMÕES LOPES NETO","PELOTAS","RS","31° 42' 58'' S","52° 19' 52'' W","18 m","VFR Diurno/Noturno e IFR Diurno/Noturno"," 06/24","1980 m","42 m","PCN 35/R/B/W/T","Concreto"," 15/33","1230 m","38 m","5700 kg / 0,62 MPa","Terra","-","-","-","-","-","-","-","-","-","-","PA2017-3710",0,0,0,"PA2017-3710","","","","AP-1","Classe I","2ª","3C","NPA",13,"-","PA2016-0908","-","PA2016-0908","-","-","-","","-"]
["SBPL","PE0002","SENADOR NILO COELHO","PETROLINA","PE","9° 22' 3'' S","40° 33' 49'' W","384 m","VFR Diurno/Noturno e IFR Diurno/Noturno"," 13/31","3250 m","45 m","PCN 80/F/C/X/T","Asfalto","-","-","-","-","-","-","-","-","-","-","-","-","-","-","-","PA2011-1907",0,0,0,"PA2011-1907","","","","AP-1","Classe II","2ª","4E","NPA","N/A","PA2017-3172","-","PA2017-3172","-","-","-","-","","-"]
["SDPE","TO0003","PORTO NACIONAL","PORTO NACIONAL","TO","10° 43' 1'' S","48° 24' 1'' W","265 m","VFR Diurno"," 05/23","1700 m","30 m","PCN 27/F/B/X/T","Asfalto","-","-","-","-","-","-","-","-","-","-","-","-","-","-","-","PA2019-0535",0,0,0,"PA2019-0535","","","","AP-0","Classe I","4ª","-","-","-","-","-","-","-","-","-","-","X","-"]
["SBPP","MS0005","PONTA PORÃ","PONTA PORÃ","MS","22° 32' 59'' S","55° 42' 9'' W","657 m","VFR Diurno e IFR Diurno/Noturno"," 04/22","2000 m","45 m","PCN 31/F/A/X/T","Asfalto","-","-","-","-","-","-","-","-","-","-","-","-","-","-","-","PA2013-1185",0,0,0,"PA2013-1185","","","","AP-0","Classe I","3ª","-","-","-","-","-","-","-","-","-","-","","-"]
["SBPR","MG0005","CARLOS PRATES","BELO HORIZONTE","MG","19° 54' 33'' S","43° 59' 21'' W","928 m","VFR Diurno"," 09/27","868 m","18 m","PCN 10/F/C/Y/U","Asfalto","-","-","-","-","-","-","-","-","-","-","-","-","-","-","-","PA2014-2499",0,0,0,"PA2014-2499","","","","AP-0","Classe I","4ª","-","-","-","-","-","-","-","-","-","-","","-"]
["SBPS","BA0002","PORTO SEGURO","PORTO SEGURO","BA","16° 26' 17'' S","39° 4' 40'' W","51 m","VFR Diurno/Noturno e IFR Diurno/Noturno"," 10/28","2000 m","45 m","PCN 44/R/B/X/T","Asfalto","-","-","-","-","-","-","-","-","-","-","-","-","-","-","-","PD1993-0152","PD1994-0015","PD1998-0299",0,"PD1993-0152","PD1994-0015","PD1998-0299","","AP-2","Classe III","2ª","4C","NPA(10;28)","N/A","PA2017-2276","-","PA2017-2276","-","-","-","-","","-"]
["SBPV","RO0001","GOVERNADOR JORGE TEIXEIRA DE OLIVEIRA","PORTO VELHO","RO","8° 42' 49'' S","63° 54' 10'' W","88 m","VFR Diurno/Noturno e IFR Diurno/Noturno"," 18/36","2400 m","45 m","PCN 41/F/B/X/T","Asfalto","-","-","-","-","-","-","-","-","-","-","-","-","-","-","-","PD1985-0080","PD1985-0091",0,0,"PD1985-0080","PD1985-0091","","","AP-2","Classe II","2ª","4D","NPA",5,"-","PA2016-0908","-","PA2016-0908","-","-","-","X","-"]
["SBRB","AC0001","PLÁCIDO DE CASTRO","RIO BRANCO","AC","9° 52' 6'' S","67° 53' 53'' W","193 m","VFR Diurno/Noturno e IFR Diurno/Noturno"," 06/24","2158 m","45 m","PCN 78/F/D/X/T","Asfalto","-","-","-","-","-","-","-","-","-","-","-","-","-","-","-","PA2018-2577",0,0,0,"PA2018-2577","","","","AP-1","Classe II","2ª","4C","PA1",37,"-","PA2016-0908","-","PA2016-0908","-","-","-","X","-"]
["SBRD","MT0004","RONDONÓPOLIS - MAESTRO MARINHO FRANCO (*SWRD)","RONDONÓPOLIS","MT","16° 35' 17'' S","54° 43' 18'' W","447 m","VFR Diurno/Noturno e IFR Diurno/Noturno"," 02/20","1850 m","30 m","PCN 28/F/B/X/U","Asfalto","-","-","-","-","-","-","-","-","-","-","-","-","-","-","-","PA2018-3190",0,0,0,"PA2018-3190","","","","AP-1","Classe I","3ª","3C","NPA","N/A","PA2019-3643 / PA2020-3226","-","PA2019-3643 / PA2020-3226","-","-","-","-","X","-"]
["SBRF","PE0001","GUARARAPES - GILBERTO FREYRE","RECIFE","PE","8° 7' 35'' S","34° 55' 22'' W","10 m","VFR Diurno/Noturno e IFR Diurno/Noturno"," 18/36","3007 m","45 m","PCN 63/F/B/X/T","Asfalto","-","-","-","-","-","-","-","-","-","-","-","-","-","-","-","PA2013-1297",0,0,0,"PA2013-1297","","","","AP-3","Classe IV","1ª","4E","PA1(18) / NPA(36)","N/A","PA2020-0404","-","PA2020-0404","-","-","-","-","","-"]
["SBRJ","RJ0002","SANTOS DUMONT","RIO DE JANEIRO","RJ","22° 54' 36'' S","43° 9' 45'' W","3 m","VFR Diurno/Noturno e IFR Diurno/Noturno"," 2R/20L","1323 m","42 m","PCN 65/F/B/X/T","Asfalto"," 2L/20R","1260 m","30 m","PCN 39/F/B/X/T","Asfalto","-","-","-","-","-","-","-","-","-","-","PA2014-1562",0,0,0,"PA2014-1562","","","","AP-3","Classe IV","1ª","4C","-","Ver Portaria","-","PA2016-1046","-","PA2016-1046","-","-","-","","-"]
["SBRP","SP0004","LEITE LOPES","RIBEIRÃO PRETO","SP","21° 8' 11'' S","47° 46' 36'' W","550 m","VFR Diurno/Noturno e IFR Diurno/Noturno"," 18/36","2100 m","45 m","PCN 26/F/B/X/T","Asfalto","-","-","-","-","-","-","-","-","-","-","-","-","-","-","-","PD1983-0028","PD1991-0240",0,0,"PD1983-0028","PD1991-0240","","","AP-2","Classe II","2ª","4C","-","Ver Portaria","-","PA2017-0447","-","PA2017-0447","-","-","-","","-"]
["SBSG","RN0001","GOVERNADOR ALUIZIO ALVES","SÃO GONÇALO DO AMARANTE","RN","5° 46' 8'' S","35° 21' 59'' W","83 m","VFR Diurno/Noturno e IFR Diurno/Noturno"," 12/30","3000 m","60 m","PCN 70/F/A/X/T","Asfalto","-","-","-","-","-","-","-","-","-","-","-","-","-","-","-","PA2014-1256",0,0,0,"PA2014-1256","","","","AP-2","Classe III","1ª (*)","4E","PA1(12) / NPA(30)","N/A","PA2016-0554","-","PA2016-0554","-","-","-","-","","-"]
["SBSJ","SP0008","PROFESSOR URBANO ERNESTO STUMPF","SÃO JOSÉ DOS CAMPOS","SP","23° 13' 44'' S","45° 52' 16'' W","647 m","VFR Diurno/Noturno e IFR Diurno/Noturno"," 16/34","2676 m","45 m","PCN 71/F/A/X/T","Asfalto","-","-","-","-","-","-","-","-","-","-","-","-","-","-","-","PA2018-3263",0,0,0,"PA2018-3263","","","","AP-1","Classe I","2ª","4C","PA1",13,"-","PA2016-0908","-","PA2016-0908","-","-","-","","-"]
["SBSL","MA0001","MARECHAL CUNHA MACHADO","SÃO LUÍS","MA","2° 35' 13'' S","44° 14' 10'' W","54 m","VFR Diurno/Noturno e IFR Diurno/Noturno"," 06/24","2385 m","45 m","PCN 52/F/B/X/T","Asfalto"," 09/27","1464 m","45 m","PCN 39/F/B/X/T","Asfalto","-","-","-","-","-","-","-","-","-","-","PA2015-2239",0,0,0,"PA2015-2239","","","","AP-2","Classe III","1ª","4D(06/24); 4C(09/27)","PA1(06) / NPA(24) / NINST(09;27)","N/A","PA2019-1614","-","PA2019-1614","-","-","-","-","X","-"]
["SBSM","RS0003","SANTA MARIA","SANTA MARIA","RS","29° 42' 39'' S","53° 41' 32'' W","88 m","VFR Diurno/Noturno e IFR Diurno/Noturno"," 11/29","2700 m","45 m","PCN 20/R/B/X/T","Concreto"," 02/20","1400 m","30 m","PCN 10/F/C/Y/U","Asfalto","-","-","-","-","-","-","-","-","-","-","PD1981-0204",0,0,0,"PD1981-0204","","","","AP-1","Classe I","2ª","3C","PA1",23,"-","PA2016-0908","-","PA2016-0908","-","-","-","","-"]
["SBSN","PA0002","MAESTRO WILSON FONSECA","SANTARÉM","PA","2° 25' 29'' S","54° 47' 9'' W","60 m","VFR Diurno/Noturno e IFR Diurno/Noturno"," 10/28","2400 m","45 m","PCN 48/F/A/W/T","Asfalto","-","-","-","-","-","-","-","-","-","-","-","-","-","-","-","PA2020-2416","PD1992-0245","PD1993-0516",0,"PA2020-2416","PD1992-0245","PD1993-0516","","AP-1","Classe II","2ª","4C","PA1",57,"-","PA2016-0908","-","PA2016-0908","-","-","-","X","-"]
["SBSP","SP0001","CONGONHAS","SÃO PAULO","SP","23° 37' 34'' S","46° 39' 23'' W","802 m","VFR Diurno/Noturno e IFR Diurno/Noturno"," 17R/35L","1940 m","45 m","PCN 50/F/B/X/T","Asfalto"," 17L/35R","1495 m","45 m","PCN 38/F/B/X/U","Asfalto","-","-","-","-","-","-","-","-","-","-","PA2014-2980",0,0,0,"PA2014-2980","","","","AP-3","Classe IV","1ª","4C","-","Ver Portaria","-","PA2016-1047","-","PA2016-1047","-","-","-","","-"]
["SBSR","SP0006","PROFESSOR ERIBERTO MANOEL REINO","SÃO JOSÉ DO RIO PRETO","SP","20° 48' 58'' S","49° 24' 17'' W","544 m","VFR Diurno/Noturno e IFR Diurno/Noturno"," 07/25","1640 m","35 m","PCN 35/F/B/X/T","Asfalto","-","-","-","-","-","-","-","-","-","-","-","-","-","-","-","PA2018-1262",0,0,0,"PA2018-1262","","","","AP-2","Classe II","2ª","4C","NPA",46,"-","PA2016-0908","-","PA2016-0908","-","-","-","","-"]
["SBSV","BA0001","DEPUTADO LUÍS EDUARDO MAGALHÃES","SALVADOR","BA","12° 54' 31'' S","38° 19' 21'' W","20 m","VFR Diurno/Noturno e IFR Diurno/Noturno"," 10/28","3003 m","45 m","PCN 73/F/A/W/T","Asfalto"," 17/35","1518 m","45 m","PCN 41/F/B/X/T","Asfalto","-","-","-","-","-","-","-","-","-","-","PA2014-1258",0,0,0,"PA2014-1258","","","","AP-3","Classe IV","1ª","4E","PA1(10;28) / NINST(17;35)","N/A","PA2018-3870 / PA2019-2206 / PA2020-1815","-","PA2018-3870 / PA2019-2206 / PA2020-1815","-","-","-","-","","-"]
["SBTB","PA0012","TROMBETAS","TROMBETAS","PA","1° 29' 4'' S","56° 23' 57'' W","87 m","VFR Diurno/Noturno e IFR Diurno/Noturno"," 09/27","1600 m","30 m","PCN 26/F/A/X/T","Asfalto","-","-","-","-","-","-","-","-","-","-","-","-","-","-","-","PD1989-0025","PD1989-0029",0,0,"PD1989-0025","PD1989-0029","","","AP-1","Classe I","-","3C","NPA",7,"-","PA2016-0908","-","PA2016-0908","-","-","-","X","-"]
["SBTD","PR0008","LUIZ DALCANALE FILHO","TOLEDO","PR","24° 41' 7'' S","53° 41' 47'' W","562 m","VFR Diurno/Noturno e IFR Diurno/Noturno"," 02/20","1670 m","30 m","PCN 33/F/C/X/U","Asfalto","-","-","-","-","-","-","-","-","-","-","-","-","-","-","-","PA2018-3681",0,0,0,"PA2018-3681","","","","AP-1","Classe I","4ª","2C","NPA","N/A","PA2019-3975","-","PA2019-3975","-","-","-","-","","-"]
["SBTE","PI0001","SENADOR PETRÔNIO PORTELLA","TERESINA","PI","5° 3' 38'' S","42° 49' 28'' W","67 m","VFR Diurno/Noturno e IFR Diurno/Noturno"," 02/20","2200 m","45 m","PCN 46/F/A/X/T","Asfalto","-","-","-","-","-","-","-","-","-","-","-","-","-","-","-","PA2015-0532",0,0,0,"PA2015-0532","","","","AP-2","Classe III","2ª","4C","NPA","N/A","PA2019-0012","-","PA2019-0012","-","-","-","-","","-"]
["SBTF","AM0004","TEFÉ","TEFÉ","AM","3° 22' 49'' S","64° 43' 31'' W","57 m","VFR Diurno/Noturno e IFR Diurno/Noturno"," 15/33","2200 m","45 m","PCN 29/F/C/X/U","Asfalto","-","-","-","-","-","-","-","-","-","-","-","-","-","-","-","PA2017-3681",0,0,0,"PA2017-3681","","","","AP-1","Classe I","2ª","4C","NPA",11,"-","PA2016-0908 / PA2018-0389 / PA2018-0390","-","PA2016-0908 / PA2018-0389 / PA2018-0390","-","-","-","X","-"]
["SBTG","MS0006","TRÊS LAGOAS","TRÊS LAGOAS","MS","20° 45' 5'' S","51° 40' 49'' W","323 m","VFR Diurno/Noturno"," 07/25","2000 m","30 m","PCN 33/F/B/X/T","Asfalto","-","-","-","-","-","-","-","-","-","-","-","-","-","-","-","PA2019-2140",0,0,0,"PA2019-2140","","","","AP-1","Classe I","3ª","3C","NINST",37,"-","PA2016-0908","-","PA2016-0908","-","-","-","","-"]
["SBTK","AC0004","TARAUACÁ","TARAUACÁ","AC","8° 9' 17'' S","70° 46' 58'' W","197 m","VFR Diurno"," 14/32","1130 m","14 m","5700 kg / 0,5 MPa","Asfalto","-","-","-","-","-","-","-","-","-","-","-","-","-","-","-","PA2006-0657",0,0,0,"PA2006-0657","","","","AP-0","Classe I","-","-","-","-","-","-","-","-","-","-","-","X","-"]
["SSTE","RS0011","TORRES","TORRES","RS","29° 24' 54'' S","49° 48' 36'' W","9 m","VFR Diurno/Noturno"," 06/24","1507 m","30 m","PCN 32/F/B/X/T","Asfalto","-","-","-","-","-","-","-","-","-","-","-","-","-","-","-","PA2020-2977",0,0,0,"PA2020-2977","","","","AP-0","Classe I","-","-","-","-","-","-","-","-","-","-","-","","-"]
["SBTT","AM0005","TABATINGA","TABATINGA","AM","4° 15' 2'' S","69° 56' 16'' W","85 m","VFR Diurno/Noturno e IFR Diurno/Noturno"," 12/30","2150 m","45 m","PCN 33/F/D/X/U","Asfalto","-","-","-","-","-","-","-","-","-","-","-","-","-","-","-","PD1985-0203","PD1990-0325",0,0,"PD1985-0203","PD1990-0325","","","AP-1","Classe I","2ª","4C","NPA",21,"-","PA2016-0908 / PA2018-0389 / PA2018-0390","-","PA2016-0908 / PA2018-0389 / PA2018-0390","-","-","-","X","-"]
["SBTU","PA0007","TUCURUÍ","TUCURUÍ","PA","3° 46' 37'' S","49° 43' 11'' W","253 m","VFR Diurno/Noturno e IFR Diurno/Noturno"," 02/20","2000 m","45 m","PCN 33/F/C/X/U","Asfalto","-","-","-","-","-","-","-","-","-","-","-","-","-","-","-","PA2016-1885",0,0,0,"PA2016-1885","","","","AP-0","Classe I","-","3C","NPA",8,"-","PA2016-0908","-","PA2016-0908","-","-","-","X","-"]
["SBUA","AM0003","SÃO GABRIEL DA CACHOEIRA","SÃO GABRIEL DA CACHOEIRA","AM","0° 8' 53'' S","66° 59' 9'' W","76 m","VFR Diurno e IFR Diurno"," 05/23","2600 m","45 m","PCN 47/F/C/X/U","Asfalto","-","-","-","-","-","-","-","-","-","-","-","-","-","-","-","PA2020-1183",0,0,0,"PA2020-1183","","","","AP-1","Classe I","-","2C","NPA","N/A","PA2020-1269 / PA2020-1964","-","PA2020-1269 / PA2020-1964","-","-","-","-","X","-"]
["SBUF","BA0007","PAULO AFONSO","PAULO AFONSO","BA","9° 24' 4'' S","38° 15' 4'' W","269 m","VFR Diurno/Noturno"," 14/32","1800 m","45 m","PCN 35/F/C/X/U","Asfalto","-","-","-","-","-","-","-","-","-","-","-","-","-","-","-","PA2015-2868",0,0,0,"PA2015-2868","","","","AP-1","Classe I","3ª","3C","NINST",7,"-","PA2016-0908 / PA2018-0389 / PA2018-0390","-","PA2016-0908 / PA2018-0389 / PA2018-0390","-","-","-","","-"]
["SBUG","RS0012","RUBEM BERTA","URUGUAIANA","RS","29° 47' 0'' S","57° 2' 13'' W","78 m","VFR Diurno/Noturno e IFR Diurno/Noturno"," 09/27","1500 m","30 m","PCN 18/F/C/Y/T","Asfalto","-","-","-","-","-","-","-","-","-","-","-","-","-","-","-","PA2015-0388",0,0,0,"PA2015-0388","","","","AP-1","Classe I","2ª","3C","NPA",6,"-","PA2016-0908 / PA2016-2636","-","PA2016-0908 / PA2016-2636","-","-","-","","-"]
["SBUL","MG0002","TEN CEL AVIADOR CÉSAR BOMBONATO","UBERLÂNDIA","MG","18° 53' 1'' S","48° 13' 31'' W","943 m","VFR Diurno/Noturno e IFR Diurno/Noturno"," 04/22","2100 m","45 m","PCN 43/F/A/X/T","Asfalto","-","-","-","-","-","-","-","-","-","-","-","-","-","-","-","PA2014-0465",0,0,0,"PA2014-0465","","","","AP-2","Classe III","2ª","4C","PA1(04) / NPA(22)",63,"-","PA2019-3823","-","PA2019-3823","-","-","-","","-"]
["SBUR","MG0009","MARIO DE ALMEIDA FRANCO","UBERABA","MG","19° 45' 53'' S","47° 57' 58'' W","809 m","VFR Diurno/Noturno e IFR Diurno/Noturno"," 17/35","1759 m","45 m","PCN 32/F/A/X/T","Asfalto","-","-","-","-","-","-","-","-","-","-","-","-","-","-","-","PA2015-1597",0,0,0,"PA2015-1597","","","","AP-1","Classe I","2ª","3C","NPA",54,"-","PA2016-0908","-","PA2016-0908","-","-","-","","-"]
["SBVG","MG0019","MAJOR BRIGADEIRO TROMPOWSKY","VARGINHA","MG","21° 35' 20'' S","45° 28' 24'' W","922 m","VFR Diurno e IFR Diurno/Noturno"," 04/22","2100 m","30 m","PCN 26/F/A/Y/T","Asfalto","-","-","-","-","-","-","-","-","-","-","-","-","-","-","-","PA2017-3825",0,0,0,"PA2017-3825","","","","AP-1","Classe I","4ª","2C","NPA",11,"-","PA2016-0908","-","PA2016-0908","-","-","-","","-"]
["SBVH","RO0003","VILHENA","VILHENA","RO","12° 41' 39'' S","60° 5' 50'' W","615 m","VFR Diurno/Noturno e IFR Diurno/Noturno"," 03/21","2600 m","30 m","PCN 30/F/A/X/T","Asfalto","-","-","-","-","-","-","-","-","-","-","-","-","-","-","-","PA2015-0819",0,0,0,"PA2015-0819","","","","AP-1","Classe I","4ª","3C","NPA",12,"-","PA2016-0908","-","PA2016-0908","-","-","-","X","-"]
["SBVT","ES0001","EURICO DE AGUIAR SALLES","VITÓRIA","ES","20° 15' 29'' S","40° 17' 11'' W","3 m","VFR Diurno/Noturno e IFR Diurno/Noturno"," 06/24","1750 m","45 m","PCN 45/F/B/X/T","Asfalto"," 02/20","2058 m","45 m","PCN 86/F/B/X/T","ASPH","-","-","-","-","-","-","-","-","-","-","PA2014-1002",0,0,0,"PA2014-1002","","","","AP-2","Classe III","2ª","4D","NPA(02;20;06) / PA1(24)","N/A","PA2019-3987","-","PA2019-3987","-","-","-","-","","-"]
["SBZM","MG0006","PRESIDENTE ITAMAR FRANCO","GOIANÁ","MG","21° 30' 47'' S","43° 10' 23'' W","412 m","VFR Diurno e IFR Diurno/Noturno"," 08/26","2525 m","45 m","PCN 66/F/B/X/T","Asfalto","-","-","-","-","-","-","-","-","-","-","-","-","-","-","-","PA2017-2564",0,0,0,"PA2017-2564","","","","AP-1","Classe I","2ª","4C","NPA","N/A","PA2018-1225 / PA2020-1188","-","PA2018-1225 / PA2020-1188","-","-","-","-","","-"]
["SDAA","SP0045","ARARAS","ARARAS","SP","22° 20' 13'' S","47° 21' 30'' W","685 m","VFR Diurno"," 12/30","1150 m","30 m","PCN 6/F/C/Y/U","Asfalto","-","-","-","-","-","-","-","-","-","-","-","-","-","-","-","PA2020-1744",0,0,0,"PA2020-1744","","","","AP-0","Classe I","-","-","-","-","-","-","-","-","-","-","-","","-"]
["SDAD","SP0046","EVERALDO MORAES BARRETO","ADAMANTINA","SP","21° 41' 46'' S","51° 5' 47'' W","425 m","VFR Diurno"," 09/27","1240 m","18 m","5000 kg / 0,5 MPa","Asfalto","-","-","-","-","-","-","-","-","-","-","-","-","-","-","-","PA2020-1086",0,0,0,"PA2020-1086","","","","AP-0","Classe I","-","-","-","-","-","-","-","-","-","-","-","","-"]
["SDAE","SP0053","SÃO PEDRO","SÃO PEDRO","SP","22° 35' 1'' S","47° 53' 46'' W","566 m","VFR Diurno"," 14/32","1000 m","25 m","5600 kg / 0,5 MPa","Terra","-","-","-","-","-","-","-","-","-","-","-","-","-","-","-","PA2020-1021",0,0,0,"PA2020-1021","","","","AP-0","Classe I","-","-","-","-","-","-","-","-","-","-","-","","-"]
["SDAG","RJ0010","ANGRA DOS REIS","ANGRA DOS REIS","RJ","22° 58' 31'' S","44° 18' 26'' W","3 m","VFR Diurno"," 10/28","913 m","30 m","PCN 14/F/B/Y/T","Asfalto","-","-","-","-","-","-","-","-","-","-","-","-","-","-","-","PA2018-2842",0,0,0,{"$f":"IF(AD133<>0,HYPERLINK(\"http://pergamum.anac.gov.br/arquivos/\" & AD133 & \".pdf\",AD133),\"\")","v":"PA2018-2842"},"","","","AP-0","Classe I","4ª","-","-","-","-","-",{"$f":"IF(AR133<>0,HYPERLINK(\"http://pergamum.anac.gov.br/arquivos/\" & AR133 & \".pdf\",AR133),\"\")","v":"-"},"-","-","-",{"$f":"IF(AW133<>0,HYPERLINK(\"http://pergamum.anac.gov.br/arquivos/\" & AW133 & \".pdf\",AW133),\"\")","v":"-"},"","-"]
["SDAI","SP0047","AMERICANA","AMERICANA","SP","22° 45' 19'' S","47° 16' 5'' W","611 m","VFR Diurno/Noturno"," 12/30","1100 m","18 m","PCN 9/F/B/X/T","Asfalto","-","-","-","-","-","-","-","-","-","-","-","-","-","-","-","PA2017-0097",0,0,0,"PA2017-0097","","","","AP-0","Classe I","-","-","-","-","-","-","-","-","-","-","-","","-"]
["SDAM","SP0037","ESTADUAL DE CAMPOS DOS AMARAIS - PREFEITO FRANCISCO AMARAL","CAMPINAS","SP","22° 51' 33'' S","47° 6' 29'' W","612 m","VFR Diurno/Noturno"," 16/34","1200 m","30 m","PCN 25/F/A/X/T","Asfalto","-","-","-","-","-","-","-","-","-","-","-","-","-","-","-","PA2018-3803",0,0,0,"PA2018-3803","","","","AP-0","Classe I","4ª","-","-","-","-","-","-","-","-","-","-","","-"]
["SDBA","SP0063","BATATAIS","BATATAIS","SP","20° 52' 37'' S","47° 35' 9'' W","881 m","VFR Diurno"," 13/31","720 m","30 m","5700 kg / 0,5 MPa","Terra","-","-","-","-","-","-","-","-","-","-","-","-","-","-","-","PA2018-1240",0,0,0,"PA2018-1240","","","","AP-0","Classe I","-","-","-","-","-","-","-","-","-","-","-","","-"]
["SDBB","SP0018","BEBEDOURO","BEBEDOURO","SP","20° 54' 1'' S","48° 28' 25'' W","592 m","VFR Diurno"," 13/31","1500 m","23 m","PCN 15/F/A/X/T","Asfalto","-","-","-","-","-","-","-","-","-","-","-","-","-","-","-","PA2014-0924",0,0,0,"PA2014-0924","","","","AP-0","Classe I","-","-","-","-","-","-","-","-","-","-","-","","-"]
["SDBK","SP0019","TANCREDO DE ALMEIDA NEVES","BOTUCATU","SP","22° 56' 12'' S","48° 28' 3'' W","918 m","VFR Diurno/Noturno"," 01/19","1500 m","30 m","PCN 40/F/A/X/T","Asfalto","-","-","-","-","-","-","-","-","-","-","-","-","-","-","-","PA2012-2536",0,0,0,"PA2012-2536","","","","AP-0","Classe I","4ª","-","-","-","-","-","-","-","-","-","-","","-"]
["SDBY","SP0032","BARIRI","BARIRI","SP","22° 4' 9'' S","48° 42' 23'' W","493 m","VFR Diurno"," 11/29","1470 m","30 m","5600 kg / 0,5 MPa","Terra","-","-","-","-","-","-","-","-","-","-","-","-","-","-","-","PA2020-1303",0,0,0,"PA2020-1303","","","","AP-0","Classe I","-","-","-","-","-","-","-","-","-","-","-","","-"]
["SDCA","SP0051","CAPÃO BONITO","CAPÃO BONITO","SP","24° 2' 1'' S","48° 21' 25'' W","714 m","VFR Diurno"," 16/34","1075 m","20 m","PCN 10/F/C/Y/U","Asfalto","-","-","-","-","-","-","-","-","-","-","-","-","-","-","-","PA2018-2893",0,0,0,"PA2018-2893","","","","AP-0","Classe I","-","-","-","-","-","-","-","-","Interditado","PA2020-3485","PA2020-3485","","-"]
["SDCG","AM0016","SENADORA EUNICE MICHILES","SÃO PAULO DE OLIVENÇA","AM","3° 28' 14'' S","68° 55' 27'' W","102 m","VFR Diurno"," 04/22","1200 m","23 m","PCN 6/R/B/Y/T","Concreto","-","-","-","-","-","-","-","-","-","-","-","-","-","-","-","PA2018-1632",0,0,0,"PA2018-1632","","","","AP-0","Classe I","-","2C","NINST",7,"-","PA2016-0908","-","PA2016-0908","Interditado","PA2018-0557","PA2018-0557","X","-"]
["SDCO","SP0027","SOROCABA","SOROCABA","SP","23° 28' 59'' S","47° 29' 11'' W","633 m","VFR Diurno/Noturno"," 18/36","1480 m","30 m","PCN 36/F/B/X/T","Asfalto","-","-","-","-","-","-","-","-","-","-","-","-","-","-","-","PD2006-0287",0,0,0,"PD2006-0287","","","","AP-0","Classe I","3ª","-","-","-","-","-","-","-","-","-","-","","-"]
["SDDN","SP0020","PAULINO RIBEIRO DE ANDRADE","ANDRADINA","SP","20° 55' 33'' S","51° 23' 2'' W","380 m","VFR Diurno/Noturno"," 11/29","1500 m","30 m","PCN 12/F/B/Y/T","Asfalto","-","-","-","-","-","-","-","-","-","-","-","-","-","-","-","PA2015-3120",0,0,0,"PA2015-3120","","","","AP-0","Classe I","4ª","-","-","-","-","-","-","-","-","-","-","","-"]
["SDDR","SP0021","DRACENA","DRACENA","SP","21° 27' 38'' S","51° 36' 25'' W","372 m","VFR Diurno/Noturno"," 09/27","1500 m","30 m","PCN 14/F/A/X/T","Asfalto","-","-","-","-","-","-","-","-","-","-","-","-","-","-","-","PA2014-0904",0,0,0,"PA2014-0904","","","","AP-0","Classe I","4ª","-","-","-","-","-","-","-","-","-","-","","-"]
["SDEP","SP0052","GERALDO MOACIR BORDON","PRESIDENTE EPITÁCIO","SP","21° 46' 30'' S","52° 8' 37'' W","297 m","VFR Diurno"," 05/23","1010 m","18 m","PCN 8/F/C/Y/U","Asfalto","-","-","-","-","-","-","-","-","-","-","-","-","-","-","-","PA2020-2971",0,0,0,"PA2020-2971","","","","AP-0","Classe I","-","-","-","-","-","-","-","-","-","-","-","","-"]
["SDET","SP0067","TIETÊ","TIETÊ","SP","23° 6' 17'' S","47° 43' 28'' W","501 m","VFR Diurno"," 02/20","850 m","30 m","5000 kg / 0,5 MPa","Terra","-","-","-","-","-","-","-","-","-","-","-","-","-","-","-","PA2020-2412",0,0,0,"PA2020-2412","","","","AP-0","Classe I","-","-","-","-","-","-","-","-","-","-","-","","-"]
["SDFD","SP0054","CORONEL AVIADOR CARLOS ORLEANS GUIMARÃES","FERNANDÓPOLIS","SP","20° 16' 36'' S","50° 12' 50'' W","500 m","VFR Diurno"," 08/26","1000 m","25 m","PCN 16/F/A/X/T","Asfalto","-","-","-","-","-","-","-","-","-","-","-","-","-","-","-","PA2018-1338",0,0,0,"PA2018-1338","","","","AP-0","Classe I","-","-","-","-","-","-","-","-","-","-","-","","-"]
["SDFX","BA0054","CASA NOVA","CASA NOVA","BA","9° 9' 27'' S","40° 56' 15'' W","405 m","VFR Diurno"," 12/30","1100 m","20 m","PCN 10/F/B/Y/U","Asfalto","-","-","-","-","-","-","-","-","-","-","-","-","-","-","-","PA2016-0532",0,0,0,"PA2016-0532","","","","AP-0","Classe I","-","-","-","-","-","-","-","-","-","-","-","","-"]
["SDGC","SP0055","GARÇA","GARÇA","SP","22° 11' 1'' S","49° 39' 22'' W","664 m","VFR Diurno"," 01/19","1000 m","30 m","PCN 8/F/C/Y/U","Terra","-","-","-","-","-","-","-","-","-","-","-","-","-","-","-","PA2020-1027",0,0,0,"PA2020-1027","","","","AP-0","Classe I","-","-","-","-","-","-","-","-","-","-","-","","-"]
["SDIG","SP0038","IBITINGA","IBITINGA","SP","21° 44' 50'' S","48° 51' 21'' W","542 m","VFR Diurno"," 13/31","1200 m","18 m","5600 kg / 0,5 MPa","Asfalto","-","-","-","-","-","-","-","-","-","-","-","-","-","-","-","PA2020-1074",0,0,0,"PA2020-1074","","","","AP-0","Classe I","-","-","-","-","-","-","-","-","-","-","-","","-"]
["SDIM","SP0033","DR. ANTONIO RIBEIRO NOGUEIRA JÚNIOR","ITANHAÉM","SP","24° 9' 53'' S","46° 47' 8'' W","4 m","VFR Diurno/Noturno"," 15/33","1350 m","30 m","PCN 31/F/C/X/T","Asfalto","-","-","-","-","-","-","-","-","-","-","-","-","-","-","-","PA2020-2423",0,0,0,"PA2020-2423","","","","AP-0","Classe I","4ª","-","-","-","-","-","-","-","-","-","-","","-"]
["SDIV","SP0056","ITUVERAVA","ITUVERAVA","SP","20° 22' 31'' S","47° 46' 7'' W","623 m","VFR Diurno"," 17/35","1350 m","23 m","5200 kg / 0,5 MPa","Asfalto","-","-","-","-","-","-","-","-","-","-","-","-","-","-","-","PA2020-0970",0,0,0,"PA2020-0970","","","","AP-0","Classe I","-","-","-","-","-","-","-","-","-","-","-","","-"]
["SDJC","SP0064","JABOTICABAL","JABOTICABAL","SP","21° 13' 51'' S","48° 17' 8'' W","625 m","VFR Diurno"," 07/25","960 m","23 m","5600 kg / 0,5 MPa","Terra","-","-","-","-","-","-","-","-","-","-","-","-","-","-","-","PA2018-1754",0,0,0,"PA2018-1754","","","","AP-0","Classe I","-","-","-","-","-","-","-","-","-","-","-","","-"]
["SDJO","SP0057","SÃO JOAQUIM DA BARRA","SÃO JOAQUIM DA BARRA","SP","20° 35' 36'' S","47° 50' 32'' W","651 m","VFR Diurno"," 14/32","1000 m","30 m","5600 kg / 0,5 MPa","Terra","-","-","-","-","-","-","-","-","-","-","-","-","-","-","-","PD1992-0338",0,0,0,"PD1992-0338","","","","AP-0","Classe I","-","-","-","-","-","-","-","-","-","-","-","","-"]
["SDJV","SP0035","MUNICIPAL DE SÃO JOÃO DA BOA VISTA","SÃO JOÃO DA BOA VISTA","SP","22° 1' 0'' S","46° 50' 26'' W","762 m","VFR Diurno/Noturno"," 04/22","1250 m","30 m","PCN 20/F/B/Y/T","Asfalto","-","-","-","-","-","-","-","-","-","-","-","-","-","-","-","PA2016-1715",0,0,0,"PA2016-1715","","","","AP-0","Classe I","-","-","-","-","-","-","-","-","-","-","-","","-"]
["SDKF","BA0027","JUAZEIRO","CURAÇÁ","BA","9° 9' 19'' S","40° 5' 30'' W","392 m","VFR Diurno"," 18/36","1300 m","22 m","PCN 12/F/B/Y/U","Asfalto","-","-","-","-","-","-","-","-","-","-","-","-","-","-","-","PD2001-0614",0,0,0,"PD2001-0614","","","","AP-0","Classe I","-","-","-","-","-","-","-","-","-","-","-","","-"]
["SDKJ","BA0025","FORMOSA DO RIO PRETO","FORMOSA DO RIO PRETO","BA","11° 1' 16'' S","45° 11' 14'' W","511 m","VFR Diurno"," 13/31","1320 m","18,5 m","PCN 10/F/B/Y/U","Asfalto","-","-","-","-","-","-","-","-","-","-","-","-","-","-","-","PD2001-0616",0,0,0,"PD2001-0616","","","","AP-0","Classe I","-","-","-","-","-","-","-","-","-","-","-","","-"]
["SDKK","SP0058","MOCOCA","MOCOCA","SP","21° 29' 14'' S","47° 2' 2'' W","651 m","VFR Diurno"," 04/22","1000 m","30 m","PCN 8/F/C/Y/U","Terra","-","-","-","-","-","-","-","-","-","-","-","-","-","-","-","PA2013-2824",0,0,0,"PA2013-2824","","","","AP-0","Classe I","-","-","-","-","-","-","-","-","-","-","-","","-"]
["SDLC","SP0039","LUCÉLIA","LUCÉLIA","SP","21° 44' 58'' S","51° 1' 6'' W","450 m","VFR Diurno"," 09/27","1032 m","36 m","5600 kg / 0,62 MPa","Grama","-","-","-","-","-","-","-","-","-","-","-","-","-","-","-","PA2020-0971",0,0,0,"PA2020-0971","","","","AP-0","Classe I","-","-","-","-","-","-","-","-","-","-","-","","-"]
["SDLE","BA0038","RIO DE CONTAS","RIO DE CONTAS","BA","13° 34' 59'' S","41° 47' 27'' W","1146 m","VFR Diurno"," 15/33","1200 m","41 m","5700 kg / 0,5 MPa","Piçarra","-","-","-","-","-","-","-","-","-","-","-","-","-","-","-","PA2014-1387",0,0,0,"PA2014-1387","","","","AP-0","Classe I","-","-","-","-","-","-","-","-","Interditado","PA2020-3535 / PA2019-3187","PA2020-3535 / PA2019-3187","","-"]
["SDLK","BA0040","CACULÉ","CACULÉ","BA","14° 28' 52'' S","42° 15' 53'' W","662 m","VFR Diurno"," 13/31","1200 m","20 m","PCN 8/F/B/Y/U","Asfalto","-","-","-","-","-","-","-","-","-","-","-","-","-","-","-","PA2016-0240",0,0,0,"PA2016-0240","","","","AP-0","Classe I","-","-","-","-","-","-","-","-","Interditado","PA2019-3191","PA2019-3191","","-"]
["SDLL","SP0048","YOLANDA PENTEADO","LEME","SP","22° 13' 37'' S","47° 22' 56'' W","617 m","VFR Diurno"," 08/26","1150 m","18 m","PCN 7/F/B/X/U","Asfalto","-","-","-","-","-","-","-","-","-","-","-","-","-","-","-","PA2019-1196",0,0,0,"PA2019-1196","","","","AP-0","Classe I","-","-","-","-","-","-","-","-","-","-","-","","-"]
["SDLP","SP0034","MUNICIPAL JOSÉ BOSO","LENÇÓIS PAULISTA","SP","22° 34' 42'' S","48° 46' 28'' W","621 m","VFR Diurno/Noturno"," 07/25","1264 m","20 m","PCN 13/F/C/Y/T","Asfalto","-","-","-","-","-","-","-","-","-","-","-","-","-","-","-","PA2018-2894",0,0,0,"PA2018-2894","","","","AP-0","Classe I","-","-","-","-","-","-","-","-","-","-","-","","-"]
["SDLY","SP0071","ARMANDO NATALI","MATÃO","SP","21° 37' 27'' S","48° 21' 3'' W","635 m","VFR Diurno"," 16/34","750 m","23 m","PCN 8/F/C/Y/U","Terra","-","-","-","-","-","-","-","-","-","-","-","-","-","-","-","PA2020-1919",0,0,0,"PA2020-1919","","","","AP-0","Classe I","-","-","-","-","-","-","-","-","-","-","-","","-"]
["SBMI","RJ0009","MARICÁ","MARICÁ","RJ","22° 55' 5'' S","42° 49' 44'' W","0 m","VFR Diurno/Noturno"," 09/27","1190 m","30 m","PCN 13/F/A/X/T","Asfalto","-","-","-","-","-","-","-","-","-","-","-","-","-","-","-","PA2019-0538",0,0,0,"PA2019-0538","","","","AP-0","Classe I","-","-","-","-","-","-","-","-","-","-","-","","-"]
["SDMH","SP0059","MIRASSOL","MIRASSOL","SP","20° 48' 26'' S","49° 29' 10'' W","584 m","VFR Diurno"," 06/24","1000 m","30 m","PCN 8/F/C/Y/U","Terra","-","-","-","-","-","-","-","-","-","-","-","-","-","-","-","PD1992-0074","PA2014-0905","PA2014-3150",0,"PD1992-0074","PA2014-0905","PA2014-3150","","AP-0","Classe I","-","-","-","-","-","-","-","-","-","-","-","","Suspensos os efeitos da Portaria 905/SIA, de 10/04/2014, pela decisão liminar deferida pelo juízo da 3ª Vara Federal de São José do Rio Preto - SP, nos autos do Processo judicial n.º 0002612-13.2014.4.03.6106,  proposta pela Associação Pró-Aeroporto de Mirassol (APROAMI), em face da União e outros."]
["SDMJ","SP0022","MOGI MIRIM","MOGI MIRIM","SP","22° 24' 36'' S","46° 54' 17'' W","693 m","VFR Diurno"," 12/30","1500 m","30 m","5600 kg / 0,5 MPa","Terra","-","-","-","-","-","-","-","-","-","-","-","-","-","-","-","PD1995-0484",0,0,0,"PD1995-0484","","","","AP-0","Classe I","-","-","-","-","-","-","-","-","-","-","-","","-"]
["SDMO","SP0068","MONTE ALTO","MONTE ALTO","SP","21° 15' 29'' S","48° 31' 27'' W","750 m","VFR Diurno"," 17/35","850 m","20 m","5600 kg / 0,5 MPa","Terra","-","-","-","-","-","-","-","-","-","-","-","-","-","-","-","PA2020-3475",0,0,0,"PA2020-3475","","","","AP-0","Classe I","-","-","-","-","-","-","-","-","-","-","-","","-"]
["SDNH","SP0060","NOVO HORIZONTE","NOVO HORIZONTE","SP","21° 29' 52'' S","49° 14' 4'' W","465 m","VFR Diurno"," 13/31","1000 m","20 m","5700 kg / 0,5 MPa","Cascalho","-","-","-","-","-","-","-","-","-","-","-","-","-","-","-","PA2016-1523",0,0,0,"PA2016-1523","","","","AP-0","Classe I","-","-","-","-","-","-","-","-","-","-","-","","-"]
["SDNM","MT0047","BRIGADEIRO EDUARDO GOMES","NOVA MUTUM","MT","13° 49' 16'' S","56° 2' 19'' W","430 m","VFR Diurno"," 05/23","1541 m","24 m","PCN 18/F/B/Y/U","Asfalto","-","-","-","-","-","-","-","-","-","-","-","-","-","-","-","PA2019-3023",0,0,0,"PA2019-3023","","","","AP-1","Classe I","-","-","-","-","-","-","-","-","-","-","-","X","-"]
["SDNO","SP0061","NELSON GARÓFALO","SÃO MANUEL","SP","22° 41' 46'' S","48° 34' 34'' W","730 m","VFR Diurno/Noturno"," 14/32","1000 m","20 m","PCN 13/F/C/Y/U","Asfalto","-","-","-","-","-","-","-","-","-","-","-","-","-","-","-","PA2020-2976",0,0,0,"PA2020-2976","","","","AP-0","Classe I","4ª","-","-","-","-","-","-","-","-","-","-","","-"]
["SDOU","SP0023","JORNALISTA BENEDITO PIMENTEL","OURINHOS","SP","22° 58' 25'' S","49° 54' 41'' W","462 m","VFR Diurno/Noturno"," 16/34","1500 m","30 m","PCN 15/F/B/X/T","Asfalto","-","-","-","-","-","-","-","-","-","-","-","-","-","-","-","PA2020-0978",0,0,0,"PA2020-0978","","","","AP-0","Classe I","4ª","-","-","-","-","-","-","-","-","-","-","","-"]
["SDOV","GO0005","MOZARLÂNDIA","MOZARLÂNDIA","GO","14° 46' 8'' S","50° 33' 54'' W","328 m","VFR Diurno"," 17/35","1500 m","30 m","PCN 20/F/B/Y/T","Asfalto","-","-","-","-","-","-","-","-","-","-","-","-","-","-","-","PA2020-0972",0,0,0,"PA2020-0972","","","","AP-0","Classe I","-","-","-","-","-","-","-","-","Interditado","PA2020-0927","PA2020-0927","","-"]
["SDOW","PA0021","OURILÂNDIA DO NORTE","OURILÂNDIA DO NORTE","PA","6° 45' 44'' S","51° 3' 0'' W","229 m","VFR Diurno/Noturno"," 14/32","1200 m","30 m","PCN 11/F/B/Y/T","Asfalto","-","-","-","-","-","-","-","-","-","-","-","-","-","-","-","PA2015-0909",0,0,0,"PA2015-0909","","","","AP-0","Classe I","-","-","-","-","-","-","-","-","Proibição de operações de pouso de aeronaves de asa fixa com motor à reação (turbojato).","PA2020-1041","PA2020-1041","X","-"]
["SDPD","SP0072","PINDAMONHANGABA","PINDAMONHANGABA","SP","22° 56' 38'' S","45° 25' 55'' W","574 m","VFR Diurno"," 06/24","750 m","30 m","5600 kg / 0,5 MPa","Terra","-","-","-","-","-","-","-","-","-","-","-","-","-","-","-","PA2020-2410",0,0,0,"PA2020-2410","","","","AP-0","Classe I","-","-","-","-","-","-","-","-","-","-","-","","-"]
["SDPN","SP0024","PENÁPOLIS","PENÁPOLIS","SP","21° 24' 37'' S","50° 1' 55'' W","418 m","VFR Diurno/Noturno"," 15/33","1500 m","30 m","PCN 27/F/A/X/T","Asfalto","-","-","-","-","-","-","-","-","-","-","-","-","-","-","-","PA2014-0233",0,0,0,"PA2014-0233","","","","AP-0","Classe I","4ª","-","-","-","-","-","-","-","-","-","-","","-"]
["SDPV","SP0040","PRESIDENTE VENCESLAU","PRESIDENTE VENCESLAU","SP","21° 53' 36'' S","51° 53' 4'' W","445 m","VFR Diurno"," 14/32","1200 m","30 m","5700 kg / 0,5 MPa","Terra","-","-","-","-","-","-","-","-","-","-","-","-","-","-","-","PA2020-1924",0,0,0,"PA2020-1924","","","","AP-0","Classe I","-","-","-","-","-","-","-","-","-","-","-","","-"]
["SDPW","SP0041","PEDRO MORGANTI","PIRACICABA","SP","22° 42' 38'' S","47° 37' 10'' W","584 m","VFR Diurno/Noturno"," 17/35","1200 m","30 m","PCN 21/F/A/X/T","Asfalto","-","-","-","-","-","-","-","-","-","-","-","-","-","-","-","PA2018-2356",0,0,0,"PA2018-2356","","","","AP-0","Classe I","4ª","-","-","-","-","-","-","-","-","-","-","","-"]
["SDPY","SP0066","PIRASSUNUNGA","PIRASSUNUNGA","SP","22° 1' 40'' S","47° 25' 18'' W","683 m","VFR Diurno"," 02/20","860 m","30 m","PCN 8/F/C/Y/U","Terra","-","-","-","-","-","-","-","-","-","-","-","-","-","-","-","PD1953-0021","PA2020-1565",0,0,"PD1953-0021","PA2020-1565","","","AP-0","Classe I","-","-","-","-","-","-","-","-","-","-","-","","-"]
["SDRK","SP0049","RIO CLARO","RIO CLARO","SP","22° 25' 54'' S","47° 33' 45'' W","600 m","VFR Diurno"," 03/21","1047 m","40 m","5600 kg / 0,5 MPa","Terra","-","-","-","-","-","-","-","-","-","-","4  -","quadrado","21 m x21 m","4,5 t","Grama","PA2018-1635",0,0,0,"PA2018-1635","","","","AP-0","Classe I","-","-","-","-","-","-","-","-","-","-","-","","-"]
["SDRR","SP0028","AVARÉ-ARANDU","AVARÉ","SP","23° 5' 35'' S","48° 59' 3'' W","810 m","VFR Diurno/Noturno"," 15/33","1480 m","30 m","PCN 26/F/A/X/T","Asfalto","-","-","-","-","-","-","-","-","-","-","-","-","-","-","-","PD1993-0288","PD1994-0024","PA2015-2649",0,"PD1993-0288","PD1994-0024","PA2015-2649","","AP-0","Classe I","4ª","-","-","-","-","-","-","-","-","-","-","","-"]
["SDRS","RJ0007","RESENDE","RESENDE","RJ","22° 28' 43'' S","44° 28' 54'' W","402 m","VFR Diurno"," 08/26","1300 m","30 m","PCN 13/F/C/Y/U","Asfalto","-","-","-","-","-","-","-","-","-","-","-","-","-","-","-","PA2020-0973",0,0,0,"PA2020-0973","","","","AP-0","Classe I","4ª","2C","NINST",7,"-","PA2016-0908","-","PA2016-0908","-","-","-","","-"]
["SDSC","SP0029","MÁRIO PEREIRA LOPES","SÃO CARLOS","SP","21° 52' 35'' S","47° 54' 12'' W","807 m","VFR Diurno/Noturno"," 02/20","1620 m","45 m","PCN 47/F/A/X/T","Asfalto","-","-","-","-","-","-","-","-","-","-","-","-","-","-","-","PA2018-2564",0,0,0,"PA2018-2564","","","","AP-0","Classe I","3ª","-","-","-","-","-","-","-","-","-","-","","-"]
["SBSO","MT0005","REGIONAL DE SORRISO ADOLINO BEDIN (SDSS*)","SORRISO","MT","12° 28' 22'' S","55° 40' 8'' W","386 m","VFR Diurno/Noturno e IFR Diurno/Noturno"," 05/23","1700 m","30 m","PCN 26/F/A/Y/T","Asfalto","-","-","-","-","-","-","-","-","-","-","-","-","-","-","-","PA2016-0745",0,0,0,"PA2016-0745","","","","AP-1","Classe I","-","3C","NPA(05;23)","N/A","PA2020-1223","-","PA2020-1223","-","Proibição de operações de aeronaves de asa fixa com motor à reação (turbojato) e divulgação do PCN 22/F/A/Y/T.","PA2019-1596","PA2019-1596","X","-"]
["SDTB","SP0069","ATIBAIA","ATIBAIA","SP","23° 7' 42'' S","46° 34' 29'' W","797 m","VFR Diurno"," 02/20","800 m","30 m","5000 kg / 0,5 MPa","Terra","-","-","-","-","-","-","-","-","-","-","-","-","-","-","-","PA2014-1106",0,0,0,"PA2014-1106","","","","AP-0","Classe I","-","-","-","-","-","-","-","-","-","-","-","","-"]
["SDTF","SP0050","TATUÍ","TATUÍ","SP","23° 19' 55'' S","47° 52' 48'' W","635 m","VFR Diurno"," 14/32","1300 m","30 m","PCN 28/F/B/X/T","Asfalto","-","-","-","-","-","-","-","-","-","-","-","-","-","-","-","PA2020-1084",0,0,0,"PA2020-1084","","","","AP-0","Classe I","-","-","-","-","-","-","-","-","-","-","-","","-"]
["SDTI","SP0073","TUPI PAULISTA","TUPI PAULISTA","SP","21° 23' 36'' S","51° 36' 3'' W","365 m","VFR Diurno"," 06/24","750 m","23 m","5700 kg / 0,5 MPa","Grama","-","-","-","-","-","-","-","-","-","-","-","-","-","-","-","PA2020-1925",0,0,0,"PA2020-1925","","","","AP-0","Classe I","-","-","-","-","-","-","-","-","-","-","-","","-"]
["SDTK","RJ0011","PARATI","PARATI","RJ","23° 13' 28'' S","44° 43' 13'' W","3 m","VFR Diurno"," 10/28","700 m","23 m","2500 kg / 0,5 MPa","Asfalto","-","-","-","-","-","-","-","-","-","-","-","-","-","-","-","PD1998-0051",0,0,0,"PD1998-0051","","","","AP-0","Classe I","-","-","-","-","-","-","-","-","-","-","-","","-"]
["SDTP","SP0025","JOSÉ VICENTE FARIA LIMA","TUPÃ","SP","21° 53' 24'' S","50° 30' 21'' W","550 m","VFR Diurno/Noturno"," 06/24","1500 m","35 m","PCN 33/F/B/X/T","Asfalto","-","-","-","-","-","-","-","-","-","-","-","-","-","-","-","PA2018-0305",0,0,0,"PA2018-0305","","","","AP-0","Classe I","4ª","-","-","-","-","-","-","-","-","-","-","","-"]
["SDUB","SP0065","ESTADUAL GASTÃO MADEIRA","UBATUBA","SP","23° 26' 29'' S","45° 4' 34'' W","3 m","VFR Diurno"," 09/27","940 m","30 m","PCN 8/F/C/Y/U","Asfalto","-","-","-","-","-","-","-","-","-","-","-","-","-","-","-","PA2020-1019",0,0,0,"PA2020-1019","","","","AP-0","Classe I","4ª","-","-","-","-","-","-","-","-","-","-","","-"]
["SDUN","RJ0008","ITAPERUNA","ITAPERUNA","RJ","21° 13' 10'' S","41° 52' 32'' W","125 m","VFR Diurno"," 06/24","1200 m","30 m","PCN 8/F/C/Y/U","Grama","-","-","-","-","-","-","-","-","-","-","-","-","-","-","-","PD1998-0052",0,0,0,"PD1998-0052","","","","AP-0","Classe I","4ª","-","-","-","-","-","-","-","-","-","-","","-"]
["SDUQ","SP0042","PARAGUAÇU PAULISTA","PARAGUAÇU PAULISTA","SP","22° 25' 37'' S","50° 36' 25'' W","476 m","VFR Diurno"," 05/23","1199 m","30 m","5600 kg / 0,5 MPa","Terra","-","-","-","-","-","-","-","-","-","-","-","-","-","-","-","PA2011-0330",0,0,0,"PA2011-0330","","","","AP-0","Classe I","-","-","-","-","-","-","-","-","Interditado","PA2019-2858","PA2019-2858","","-"]
["SDVE","SP0070","VERA CRUZ","VERA CRUZ","SP","22° 13' 49'' S","49° 49' 1'' W","640 m","VFR Diurno"," 15/33","950 m","20 m","5600 kg / 0,5 MPa","Asfalto","-","-","-","-","-","-","-","-","-","-","-","-","-","-","-","PA2020-1028",0,0,0,"PA2020-1028","","","","AP-0","Classe I","-","-","-","-","-","-","-","-","-","-","-","","-"]
["SDVG","SP0026","DOMINGOS PIGNATARI","VOTUPORANGA","SP","20° 27' 26'' S","50° 0' 9'' W","508 m","VFR Diurno/Noturno"," 05/23","1500 m","30 m","PCN 26/F/B/X/T","Asfalto","-","-","-","-","-","-","-","-","-","-","-","-","-","-","-","PA2020-3476",0,0,0,"PA2020-3476","","","","AP-0","Classe I","4ª","3C","NINST",7,"-","PA2016-0908","-","PA2016-0908","-","-","-","","-"]
["SDWQ","PA0027","ALENQUER","ALENQUER","PA","1° 55' 1'' S","54° 43' 22'' W","30,87 m","VFR Diurno"," 10/28","1000 m","23 m","5700 kg / 0,5 MPa","Asfalto","-","-","-","-","-","-","-","-","-","-","-","-","-","-","-","PA2008-0769",0,0,0,"PA2008-0769","","","","AP-0","Classe I","-","-","-","-","-","-","-","-","-","-","-","X","-"]
["SDXF","GO0020","ALTO PARAÍSO DE GOIÁS","ALTO PARAÍSO DE GOIÁS","GO","14° 7' 9'' S","47° 31' 49'' W","1345 m","VFR Diurno"," 09/27","1080 m","30 m","5700 kg / 0,5 MPa","Asfalto","-","-","-","-","-","-","-","-","-","-","-","-","-","-","-","PA2018-1383",0,0,0,"PA2018-1383","","",{"$f":"IF(AG196<>0,HYPERLINK(\"http://pergamum.anac.gov.br/arquivos/\" & AG196 & \".pdf\",AG196),\"\")","v":""},"AP-0","Classe I","-","-","-","-","-","-","-","-","-","-","-","","-"]
["SDXJ","MS0017","COSTA RICA","COSTA RICA","MS","18° 29' 29'' S","53° 10' 6'' W","738 m","VFR Diurno"," 09/27","1160 m","23 m","PCN 10/F/B/Y/T","Asfalto","-","-","-","-","-","-","-","-","-","-","-","-","-","-","-","PA2015-2207",0,0,0,{"$f":"IF(AD197<>0,HYPERLINK(\"http://pergamum.anac.gov.br/arquivos/\" & AD197 & \".pdf\",AD197),\"\")","v":"PA2015-2207"},"","","","AP-0","Classe I","-","-","-","-","-","-",{"$f":"IF(AR197<>0,HYPERLINK(\"http://pergamum.anac.gov.br/arquivos/\" & AR197 & \".pdf\",AR197),\"\")","v":"-"},"-","-","-",{"$f":"IF(AW197<>0,HYPERLINK(\"http://pergamum.anac.gov.br/arquivos/\" & AW197 & \".pdf\",AW197),\"\")","v":"-"},"","-"]
["SDZG","CE0008","PEDRO TEIXEIRA CASTELO REGIONAL TAUÁ","TAUÁ","CE","5° 56' 0'' S","40° 17' 51'' W","444 m","VFR Diurno/Noturno"," 09/27","1200 m","30 m","PCN 7/F/C/Y/U","Asfalto","-","-","-","-","-","-","-","-","-","-","-","-","-","-","-","PA2020-1189",0,0,0,"PA2020-1189","","","","AP-1","Classe I","-","-","-","-","-","-","-","-","-","-","-","","-"]
["SIBU","PB0012","CATOLÉ DO ROCHA","CATOLÉ DO ROCHA","PB","6° 21' 45'' S","37° 45' 19'' W","272 m","VFR Diurno"," 11/29","800 m","18 m","PCN 10/F/B/Y/U","Asfalto","-","-","-","-","-","-","-","-","-","-","-","-","-","-","-","PA2018-0072",0,0,0,"PA2018-0072","","","","AP-0","Classe I","-","-","-","-","-","-","-","-","-","-","-","","-"]
["SIBW","PB0008","CONCEIÇÃO","CONCEIÇÃO","PB","7° 33' 45'' S","38° 29' 51'' W","370 m","VFR Diurno"," 08/26","1000 m","27 m","PCN 8/F/C/Y/U","Asfalto","-","-","-","-","-","-","-","-","-","-","-","-","-","-","-","PD2001-1493",0,0,0,"PD2001-1493","","","","AP-0","Classe I","-","-","-","-","-","-","-","-","Interditado","-","-","","Interdição noticiada por meio do Ofício nº 149/2013/SIA/ANAC"]
["SIBY","PB0009","MONTEIRO","MONTEIRO","PB","7° 52' 42'' S","37° 8' 12'' W","619 m","VFR Diurno"," 14/32","1000 m","28 m","PCN 8/F/C/Y/U","Asfalto","-","-","-","-","-","-","-","-","-","-","-","-","-","-","-","PA2018-2329",0,0,0,"PA2018-2329","","","","AP-0","Classe I","-","-","-","-","-","-","-","-","-","-","-","","-"]
["SIBZ","PB0010","ITAPORANGA","ITAPORANGA","PB","7° 18' 40'' S","38° 6' 49'' W","292 m","VFR Diurno"," 14/32","1000 m","24 m","PCN 8/F/B/Y/U","Asfalto","-","-","-","-","-","-","-","-","-","-","-","-","-","-","-","PA2018-0027",0,0,0,"PA2018-0027","","","","AP-0","Classe I","-","-","-","-","-","-","-","-","-","-","-","","-"]
["SICB","PB0007","PEDRO SIMÕES PIMENTA","CUITÉ","PB","6° 29' 15'' S","36° 8' 24'' W","652 m","VFR Diurno"," 10/28","1150 m","30 m","5700 kg / 0,5 MPa","Terra","-","-","-","-","-","-","-","-","-","-","-","-","-","-","-","PD2001-1494",0,0,0,"PD2001-1494","","","","AP-0","Classe I","-","-","-","-","-","-","-","-","Interditado","-","-","","Interdição noticiada por meio do Ofício nº 149/2013/SIA/ANAC"]
["SILC","MT0025","AEROPORTO MUNICIPAL BOM FUTURO ","LUCAS DO RIO VERDE","MT","13° 2' 16'' S","55° 57' 1'' W","414 m","VFR Diurno/Noturno"," 08/26","1730 m","30 m","5700 kg / 0,5 MPa","Asfalto","-","-","-","-","-","-","-","-","-","-","-","-","-","-","-","PA2019-3497",0,0,0,"PA2019-3497","","","","AP-0","Classe I","-","-","-","-","-","-","-","-","-","-","-","X","-"]
["SIMK","SP0011","TENENTE LUND PRESSOTO","FRANCA","SP","20° 35' 25'' S","47° 22' 57'' W","1003 m","VFR Diurno/Noturno"," 05/23","2000 m","30 m","PCN 26/F/B/X/T","Asfalto","-","-","-","-","-","-","-","-","-","-","-","-","-","-","-","PA2016-0034",0,0,0,"PA2016-0034","","","","AP-1","Classe I","3ª","-","-","-","-","-","-","-","-","-","-","","-"]
["SIZX","MT0018","JUARA SUL","JUARA","MT","11° 17' 12'' S","57° 32' 20'' W","302 m","VFR Diurno"," 11/29","1200 m","30 m","5700 kg / 0,5 MPa","Cascalho","-","-","-","-","-","-","-","-","-","-","-","-","-","-","-","PD2004-0791",0,0,0,"PD2004-0791","","","","AP-1","Classe I","-","-","-","-","-","-","-","-","-","-","-","X","-"]
["SJAU","TO0007","ARAGUACEMA","ARAGUACEMA","TO","8° 50' 16'' S","49° 33' 28'' W","207 m","VFR Diurno"," 12/30","1400 m","30 m","PCN 6/F/A/Y/T","Asfalto","-","-","-","-","-","-","-","-","-","-","-","-","-","-","-","PD2004-0057",0,0,0,"PD2004-0057","","","","AP-0","Classe I","-","-","-","-","-","-","-","-","Interditado","PA2020-2799","PA2020-2799","X","-"]
["SJBY","MA0007","JOÃO SILVA","SANTA INÊS","MA","3° 39' 14'' S","45° 20' 42'' W","25 m","VFR Diurno"," 06/24","1500 m","30 m","PCN 10/F/C/Y/T","Asfalto","-","-","-","-","-","-","-","-","-","-","-","-","-","-","-","PA2020-1297",0,0,0,"PA2020-1297","","","","AP-0","Classe I","-","-","-","-","-","-","-","-","Proibição de operações de pouso na pista 06.","PA2020-0251","PA2020-0251","X","-"]
["SJGU","TO0005","ARAGUATINS","ARAGUATINS","TO","5° 41' 4'' S","48° 6' 56'' W","125 m","VFR Diurno/Noturno"," 12/30","1500 m","30 m","PCN 8/F/B/Y/T","Cascalho","-","-","-","-","-","-","-","-","-","-","-","-","-","-","-","PD2004-0056",0,0,0,"PD2004-0056","","","","AP-0","Classe I","-","-","-","-","-","-","-","-","-","-","-","X","-"]
["SBJA","SC0005","REGIONAL SUL","JAGUARUNA","SC","28° 40' 31'' S","49° 3' 37'' W","35 m","VFR Diurno/Noturno e IFR Diurno/Noturno"," 05/23","2499 m","30 m","PCN 57/F/A/X/T","Asfalto","-","-","-","-","-","-","-","-","-","-","-","-","-","-","-","PA2015-0252",0,0,0,"PA2015-0252","","","","AP-1","Classe I","3ª","4C","NPA",6,"-","PA2016-0908","-","PA2016-0908","-","-","-","","-"]
["SJNP","PA0026","NOVO PROGRESSO","NOVO PROGRESSO","PA","7° 7' 33'' S","55° 24' 3'' W","242 m","VFR Diurno"," 17/35","1050 m","28 m","5700 kg / 0,5 MPa","Piçarra","-","-","-","-","-","-","-","-","-","-","-","-","-","-","-","PA2020-1923",0,0,0,"PA2020-1923","","","","AP-0","Classe I","-","-","-","-","-","-","-","-","Interditado","PA2019-1343","PA2019-1343","X","-"]
["SJOG","RO0008","ARIQUEMES","ARIQUEMES","RO","9° 52' 50'' S","63° 2' 50'' W","142 m","VFR Diurno"," 03/21","1306 m","18 m","PCN 25/F/C/Y/U","Asfalto","-","-","-","-","-","-","-","-","-","-","-","-","-","-","-","PA2020-3473",0,0,0,"PA2020-3473","","","","AP-0","Classe I","-","-","-","-","-","-","-","-","-","-","-","X","-"]
["SJQN","GO0006","QUIRINÓPOLIS","QUIRINÓPOLIS","GO","18° 26' 46'' S","50° 24' 33'' W","586 m","VFR Diurno"," 13/31","1500 m","30 m","PCN 10/F/C/Y/T","Asfalto","-","-","-","-","-","-","-","-","-","-","-","-","-","-","-","PA2020-3471",0,0,0,"PA2020-3471","","","","AP-0","Classe I","-","-","-","-","-","-","-","-","-","-","-","","-"]
["SJRG","RS0013","REGIONAL DE RIO GRANDE","RIO GRANDE","RS","32° 5' 0'' S","52° 10' 3'' W","8 m","VFR Diurno/Noturno"," 06/24","1900 m","30 m","PCN 11/F/B/Y/T","Asfalto","-","-","-","-","-","-","-","-","-","-","-","-","-","-","-","PA2020-1743",0,0,0,"PA2020-1743","","","","AP-1","Classe I","3ª","-","-","-","-","-","-","-","-","-","-","","-"]
["SJTS","PA0028","TERRA SANTA","TERRA SANTA","PA","2° 4' 22'' S","56° 29' 20'' W","25 m","VFR Diurno"," 12/30","1000 m","23 m","5700 kg / 0,5 MPa","Piçarra","-","-","-","-","-","-","-","-","-","-","-","-","-","-","-","PD2004-1233",0,0,0,"PD2004-1233","","","","AP-0","Classe I","-","-","-","-","-","-","-","-","-","-","-","X","-"]
["SJVO","GO0030","ARAGARÇAS","ARAGARÇAS","GO","15° 53' 57'' S","52° 14' 43'' W","323 m","VFR Diurno"," 10/28","1010 m","30 m","PCN 14/F/B/X/U","Asfalto","-","-","-","-","-","-","-","-","-","-","-","-","-","-","-","PD2005-1223",0,0,0,"PD2005-1223","","","","AP-0","Classe I","-","-","-","-","-","-","-","-","Proibição de operações de aeronaves de asa fixa com motor à reação (turbojato), exceto no caso de operações de emergência médica ou de transporte de valores realizadas mediante prévia coordenação com o Operador do Aeródromo.","PA2020-1542","PA2020-1542","","-"]
["SJZA","PB0004","PEDRO VIEIRA MOREIRA","CAJAZEIRAS","PB","6° 52' 58'' S","38° 36' 57'' W","335 m","VFR Diurno/Noturno"," 12/30","1600 m","30 m","PCN 26/F/B/X/T","Asfalto","-","-","-","-","-","-","-","-","-","-","-","-","-","-","-","PA2016-3365",0,0,0,"PA2016-3365","","","","AP-0","Classe I","-","-","-","-","-","-","-","-","-","-","-","","-"]
["SNAB","PE0009","ARARIPINA","ARARIPINA","PE","7° 35' 11'' S","40° 32' 7'' W","669 m","VFR Diurno"," 13/31","1247 m","26 m","PCN 4/F/A/X/T","Asfalto","-","-","-","-","-","-","-","-","-","-","-","-","-","-","-","PA2018-3128",0,0,0,"PA2018-3128","","","","AP-0","Classe I","-","-","-","-","-","-","-","-","Proibição de operações de pouso de aeronaves de asa fixa com motor à reação (turbojato).","PA2020-0963","PA2020-0963","","-"]
["SNAE","PE0007","ARCOVERDE","ARCOVERDE","PE","8° 24' 28'' S","37° 5' 18'' W","634 m","VFR Diurno/Noturno"," 15/33","1300 m","28 m","PCN 6/F/B/Y/U","Asfalto","-","-","-","-","-","-","-","-","-","-","-","-","-","-","-","PA2018-3679",0,0,0,"PA2018-3679","","","","AP-0","Classe I","-","-","-","-","-","-","-","-","Interditado","PA2020-3466","PA2020-3466","","-"]
["SNAG","MG0020","ARAGUARI","ARAGUARI","MG","18° 40' 5'' S","48° 11' 25'' W","947 m","VFR Diurno"," 05/23","1500 m","30 m","PCN 14/F/A/Y/T","Asfalto","-","-","-","-","-","-","-","-","-","-","-","-","-","-","-",0,0,0,0,"","","","","AP-0","Classe I","-","-","-","-","-","-","-","-","Proibição de operações de pouso de aeronaves de asa fixa.","PA2018-2443 / PA2018-2677","PA2018-2443 / PA2018-2677","","-"]
["SNAL","AL0003","ARAPIRACA","ARAPIRACA","AL","9° 46' 35'' S","36° 37' 50'' W","270 m","VFR Diurno/Noturno"," 10/28","930 m","18 m","PCN 13/F/B/Y/T","Asfalto","-","-","-","-","-","-","-","-","-","-","-","-","-","-","-","PA2020-1073",0,0,0,"PA2020-1073","","","","AP-0","Classe I","-","-","-","-","-","-","-","-","-","-","-","","-"]
["SNAM","MG0011","SANTO ANTÔNIO DO AMPARO","SANTO ANTÔNIO DO AMPARO","MG","20° 54' 41'' S","44° 53' 40'' W","1097 m","VFR Diurno/Noturno"," 18/36","1620 m","30 m","PCN 7/F/A/Y/T","Asfalto","-","-","-","-","-","-","-","-","-","-","-","-","-","-","-","PD1994-0447",0,0,0,"PD1994-0447","","","","AP-0","Classe I","-","-","-","-","-","-","-","-","-","-","-","","-"]
["SNAP","MG0021","JANAÚBA","JANAÚBA","MG","15° 43' 55'' S","43° 19' 23'' W","532 m","VFR Diurno"," 10/28","1500 m","30 m","5700 kg / 0,5 MPa","Asfalto","-","-","-","-","-","-","-","-","-","-","-","-","-","-","-","PA2020-2974",0,0,0,"PA2020-2974","","","","AP-0","Classe I","-","-","-","-","-","-","-","-","-","-","-","","-"]
["SNAR","MG0033","CIRILO QUEIRÓZ","ALMENARA","MG","16° 11' 2'' S","40° 40' 2'' W","195 m","VFR Diurno/Noturno"," 07/25","1400 m","30 m","PCN 8/F/B/Y/U","Asfalto","-","-","-","-","-","-","-","-","-","-","-","-","-","-","-","PD2005-0707",0,0,0,"PD2005-0707","","","","AP-0","Classe I","-","-","-","-","-","-","-","-","-","-","-","","-"]
["SNAS","MG0022","TRÊS MARIAS","TRÊS MARIAS","MG","18° 13' 30'' S","45° 11' 26'' W","786 m","VFR Diurno"," 06/24","1500 m","45 m","PCN 24/F/C/X/U","Asfalto","-","-","-","-","-","-","-","-","-","-","-","-","-","-","-","PD1960-0132",0,0,0,"PD1960-0132","","","","AP-0","Classe I","-","-","-","-","-","-","-","-","-","-","-","","-"]
["SBAC","CE0004","ARACATI (SNAT*)","ARACATI","CE","4° 34' 7'' S","37° 48' 17'' W","36 m","VFR Diurno/Noturno e IFR Diurno/Noturno"," 09/27","1800 m","30 m","PCN 36/F/A/X/U","Asfalto","-","-","-","-","-","-","-","-","-","-","-","-","-","-","-","PA2018-1227",0,0,0,"PA2018-1227","","","","AP-1","Classe I","-","3C","NPA","N/A","PA2019-3971","-","PA2019-3971","-","-","-","-","","-"]
["SNAX","SP0016","MARCELO PIRES HALZHAUSEN","ASSIS","SP","22° 38' 24'' S","50° 27' 11'' W","564 m","VFR Diurno/Noturno"," 12/30","1689 m","30 m","PCN 25/F/C/Y/U","Asfalto","-","-","-","-","-","-","-","-","-","-","-","-","-","-","-","PA2016-0460",0,0,0,"PA2016-0460","","","","AP-0","Classe I","4ª","-","-","-","-","-","-","-","-","-","-","","-"]
["SNBA","SP0013","CHAFEI AMSEI (SBBT*)","BARRETOS","SP","20° 35' 8'' S","48° 35' 45'' W","580 m","VFR Diurno/Noturno"," 08/26","1800 m","30 m","PCN 32/F/A/X/T","Asfalto","-","-","-","-","-","-","-","-","-","-","-","-","-","-","-","PA2020-1562",0,0,0,"PA2020-1562","","","","AP-1","Classe I","3ª","-","-","-","-","-","-","-","-","-","-","","-"]
["SNBC","MA0006","BARRA DO CORDA","BARRA DO CORDA","MA","5° 30' 9'' S","45° 12' 58'' W","155 m","VFR Diurno"," 08/26","1560 m","30 m","PCN 13/F/B/Y/U","Terra","-","-","-","-","-","-","-","-","-","-","-","-","-","-","-","PA2020-1088",0,0,0,"PA2020-1088","","","","AP-0","Classe I","-","-","-","-","-","-","-","-","-","-","-","X","-"]
["SNBG","ES0005","BAIXO GUANDU - AIMORÉS","BAIXO GUANDU","ES","19° 29' 56'' S","41° 2' 31'' W","80 m","VFR Diurno"," 11/29","1200 m","30 m","PCN 10/F/C/Y/U","Asfalto","-","-","-","-","-","-","-","-","-","-","-","-","-","-","-","PA2015-1984",0,0,0,"PA2015-1984","","","","AP-0","Classe I","-","-","-","-","-","-","-","-","Interditado","PA2019-3182","PA2019-3182","","-"]
["SNBI","MA0005","BACABAL","BACABAL","MA","4° 13' 41'' S","44° 49' 11'' W","20 m","VFR Diurno"," 10/28","1600 m","30 m","PCN 25/F/A/X/T","Asfalto","-","-","-","-","-","-","-","-","-","-","-","-","-","-","-","PA2018-0629",0,0,0,"PA2018-0629","","","","AP-0","Classe I","-","-","-","-","-","-","-","-","-","-","-","X","-"]
["SNBM","MG0051","CRISTIANO FERREIRA VARELLA","MURIAÉ","MG","21° 7' 34'' S","42° 23' 40'' W","270 m","VFR Diurno"," 12/30","1140 m","23 m","PCN 12/F/B/Y/T","Asfalto","-","-","-","-","-","-","-","-","-","-","-","-","-","-","-","PA2020-1561",0,0,0,"PA2020-1561","","","","AP-0","Classe I","-","-","-","-","-","-","-","-","-","-","-","","-"]
["SNBR","BA0011","BARREIRAS","BARREIRAS","BA","12° 4' 45'' S","45° 0' 34'' W","748 m","VFR Diurno/Noturno"," 08/26","1600 m","30 m","PCN 35/F/A/X/T","Asfalto","-","-","-","-","-","-","-","-","-","-","-","-","-","-","-","PA2014-2208",0,0,0,"PA2014-2208","","","","AP-1","Classe I","3ª","3C","NINST",43,"-","PA2016-0908","-","PA2016-0908","-","-","-","","-"]
["SNBS","MA0010","BALSAS","BALSAS","MA","7° 31' 31'' S","46° 3' 12'' W","284 m","VFR Diurno"," 15/33","1000 m","23 m","PCN 14/F/B/Y/U","Asfalto","-","-","-","-","-","-","-","-","-","-","-","-","-","-","-","PA2015-2308",0,0,0,"PA2015-2308","","","","AP-0","Classe I","-","-","-","-","-","-","-","-","-","-","-","X","-"]
["SNBX","BA0028","BARRA","BARRA","BA","11° 4' 52'' S","43° 8' 51'' W","389 m","VFR Diurno"," 06/24","1300 m","20 m","PCN 10/F/B/X/U","Asfalto","-","-","-","-","-","-","-","-","-","-","-","-","-","-","-","PA2016-0574",0,0,0,"PA2016-0574","","","","AP-0","Classe I","-","-","-","-","-","-","-","-","-","-","-","","-"]
["SNBZ","BA0042","PARAMIRIM","PARAMIRIM","BA","13° 29' 26'' S","42° 13' 45'' W","639 m","VFR Diurno"," 18/36","1179 m","25 m","5700 kg / 0,5 MPa","Cascalho","-","-","-","-","-","-","-","-","-","-","-","-","-","-","-","PA2020-1558",0,0,0,"PA2020-1558","","","","AP-0","Classe I","-","-","-","-","-","-","-","-","Interditado","PA2019-3188","PA2019-3188","","-"]
["SNCA","MG0031","CAMPO BELO","CAMPO BELO","MG","20° 53' 33'' S","45° 20' 8'' W","970 m","VFR Diurno"," 10/28","1420 m","30 m","PCN 25/F/A/X/T","Asfalto","-","-","-","-","-","-","-","-","-","-","-","-","-","-","-","PA2020-1560",0,0,0,"PA2020-1560","","","","AP-0","Classe I","-","-","-","-","-","-","-","-","-","-","-","","-"]
["SNCS","CE0009","CAMPOS SALES","CAMPOS SALES","CE","7° 2' 58'' S","40° 21' 51'' W","610 m","VFR Diurno"," 11/29","1200 m","30 m","PCN 17/F/A/X/T","Asfalto","-","-","-","-","-","-","-","-","-","-","-","-","-","-","-","PA2020-1022",0,0,0,"PA2020-1022","","","","AP-0","Classe I","-","-","-","-","-","-","-","-","-","-","-","","-"]
["SNCT","MG0056","CARATINGA","UBAPORANGA","MG","19° 43' 31'' S","42° 6' 40'' W","599 m","VFR Diurno"," 02/20","1080 m","23 m","5000 kg / 0,5 MPa","Asfalto","-","-","-","-","-","-","-","-","-","-","-","-","-","-","-","PA2016-3721",0,0,0,"PA2016-3721","","","","AP-0","Classe I","-","-","-","-","-","-","-","-","-","-","-","","-"]
["SNCX","ES0004","COLATINA","COLATINA","ES","19° 29' 4'' S","40° 35' 4'' W","153 m","VFR Diurno/Noturno"," 15/33","1300 m","30 m","PCN 8/F/B/Y/T","Asfalto","-","-","-","-","-","-","-","-","-","-","-","-","-","-","-","PA2019-1474",0,0,0,"PA2019-1474","","","","AP-0","Classe I","-","-","-","-","-","-","-","-","-","-","-","","-"]
["SNCZ","MG0059","PONTE NOVA","PONTE NOVA","MG","20° 24' 11'' S","42° 55' 0'' W","572 m","VFR Diurno"," 07/25","1060 m","30 m","PCN 11/F/C/Y/T","Asfalto","-","-","-","-","-","-","-","-","-","-","-","-","-","-","-","PD1999-0818",0,0,0,"PD1999-0818","","","","AP-0","Classe I","-","-","-","-","-","-","-","-","-","-","-","","-"]
["SNDC","PA0030","REDENÇÃO","REDENÇÃO","PA","8° 1' 52'' S","49° 58' 47'' W","207 m","VFR Diurno"," 06/24","960 m","30 m","PCN 7/F/C/Y/T","Asfalto","-","-","-","-","-","-","-","-","-","-","-","-","-","-","-","PA2015-0561",0,0,0,"PA2015-0561","","","","AP-0","Classe I","4ª","-","-","-","-","-","-","-","-","-","-","X","-"]
["SNDT","MG0030","JUSCELINO KUBITSCHEK","DIAMANTINA","MG","18° 13' 56'' S","43° 39' 1'' W","1356 m","VFR Diurno/Noturno"," 03/21","1610 m","30 m","PCN 14/F/B/X/T","Asfalto","-","-","-","-","-","-","-","-","-","-","-","-","-","-","-","PA2018-2328",0,0,0,"PA2018-2328","","","","AP-0","Classe I","-","-","-","-","-","-","-","-","-","-","-","","-"]
["SNDV","MG0015","BRIGADEIRO ANTÔNIO CABRAL","DIVINÓPOLIS","MG","20° 10' 55'' S","44° 52' 12'' W","795 m","VFR Diurno/Noturno"," 17/35","1540 m","30 m","PCN 20/F/B/X/T","Asfalto","-","-","-","-","-","-","-","-","-","-","-","-","-","-","-","PA2016-0019",0,0,0,"PA2016-0019","","","","AP-0","Classe I","3ª","3C","NINST",7,"-","PA2016-0908 / PA2016-2636","-","PA2016-0908 / PA2016-2636","-","-","-","","-"]
["SNDW","BA0043","DIVISA","ENCRUZILHADA","BA","15° 31' 10'' S","40° 52' 21'' W","826 m","VFR Diurno"," 08/26","1200 m","20 m","2500 kg / 0,5 MPa","Asfalto","-","-","-","-","-","-","-","-","-","-","-","-","-","-","-","PA2016-0350",0,0,0,"PA2016-0350","","","","AP-0","Classe I","-","-","-","-","-","-","-","-","Interditado","PA2019-3053","PA2019-3053","","-"]
["SNEB","PA0018","NAGIB DEMACHKI","PARAGOMINAS","PA","3° 1' 11'' S","47° 18' 59'' W","135 m","VFR Diurno"," 09/27","1450 m","30 m","PCN 30/F/C/X/T","Asfalto","-","-","-","-","-","-","-","-","-","-","-","-","-","-","-","PA2020-1291",0,0,0,"PA2020-1291","","","","AP-0","Classe I","-","-","-","-","-","-","-","-","-","-","-","X","-"]
["SNED","BA0023","SÓCRATES REZENDE","CANAVIEIRAS","BA","15° 39' 59'' S","38° 57' 19'' W","6 m","VFR Diurno"," 14/32","1340 m","30 m","5700 kg / 0,5 MPa","Asfalto","-","-","-","-","-","-","-","-","-","-","-","-","-","-","-","PA2017-1349",0,0,0,"PA2017-1349","","","","AP-0","Classe I","4ª","-","-","-","-","-","-","-","Interditado","PA2020-3384","PA2020-3384","","-"]
["SNEE","RS0004","VACARIA NOVO","VACARIA","RS","28° 25' 55'' S","51° 1' 22'' W","900 m","VFR Diurno"," 11/29","2020 m","30 m","PCN 32/F/A/X/T","Asfalto","-","-","-","-","-","-","-","-","-","-","-","-","-","-","-","PA2014-0071",0,0,0,"PA2014-0071","","","","AP-0","Classe I","-","-","-","-","-","-","-","-","-","-","-","","-"]
["SNEU","BA0044","EUCLIDES DA CUNHA","EUCLIDES DA CUNHA","BA","10° 31' 39'' S","39° 1' 57'' W","462 m","VFR Diurno"," 18/36","1200 m","22 m","PCN 10/F/C/Y/U","Asfalto","-","-","-","-","-","-","-","-","-","-","-","-","-","-","-","PA2015-2104",0,0,0,"PA2015-2104","","","","AP-0","Classe I","-","-","-","-","-","-","-","-","Interditado","PA2020-3553","PA2020-3553","","-"]
["SNFE","MG0012","COMANDANTE PASCHOAL PATROCÍNIO FILHO","ALFENAS","MG","21° 25' 54'' S","45° 55' 59'' W","875 m","VFR Diurno/Noturno"," 04/22","1600 m","30 m","PCN 8/F/C/Y/U","Asfalto","-","-","-","-","-","-","-","-","-","-","-","-","-","-","-","PA2020-1920",0,0,0,"PA2020-1920","","","","AP-0","Classe I","-","-","-","-","-","-","-","-","-","-","-","","-"]
["SNFO","MG0060","FORMIGA","FORMIGA","MG","20° 23' 43'' S","45° 29' 12'' W","1017 m","VFR Diurno"," 02/20","1030 m","23 m","PCN 8/F/C/Y/U","Cascalho","-","-","-","-","-","-","-","-","-","-","-","-","-","-","-","PA2016-0079",0,0,0,"PA2016-0079","","","","AP-0","Classe I","-","-","-","-","-","-","-","-","-","-","-","","-"]
["SNFU","MG0063","FRUTAL","FRUTAL","MG","20° 0' 17'' S","48° 57' 32'' W","549 m","VFR Diurno"," 07/25","1320 m","30 m","PCN 15/F/C/Y/T","Asfalto","-","-","-","-","-","-","-","-","-","-","-","-","-","-","-","PA2020-0681",0,0,0,"PA2020-0681","","","","AP-0","Classe I","-","-","-","-","-","-","-","-","-","-","-","","-"]
["SNFX","PA0013","SÃO FÉLIX DO XINGU","SÃO FÉLIX DO XINGU","PA","6° 38' 25'' S","51° 59' 24'' W","200 m","VFR Diurno"," 13/31","1600 m","33 m","PCN 45/F/C/X/U","Asfalto","-","-","-","-","-","-","-","-","-","-","-","-","-","-","-","PD1978-0043",0,0,0,"PD1978-0043","","","","AP-0","Classe I","4ª","-","-","-","-","-","-","-","-","-","-","X","-"]
["SNGA","ES0007","GUARAPARI","GUARAPARI","ES","20° 38' 47'' S","40° 29' 30'' W","9 m","VFR Diurno/Noturno"," 06/24","940 m","30 m","PCN 13/F/C/X/U","Asfalto","-","-","-","-","-","-","-","-","-","-","-","-","-","-","-","PA2017-3632",0,0,0,"PA2017-3632","","","","AP-0","Classe I","4ª","-","-","-","-","-","-","-","-","-","-","","-"]
["SNGB","PI0011","GILBUÉS","GILBUÉS","PI","9° 50' 1'' S","45° 22' 2'' W","450 m","VFR Diurno"," 09/27","1000 m","30 m","PCN 8/F/C/Y/U","Terra","-","-","-","-","-","-","-","-","-","-","-","-","-","-","-",0,0,0,0,"","","","","AP-0","Classe I","-","-","-","-","-","-","-","-","Interditado","-","-","","Interdição noticiada por meio do Ofício nº 149/2013/SIA/ANAC"]
["SNGD","PI0005","GUADALUPE","GUADALUPE","PI","6° 46' 59'' S","43° 34' 51'' W","172 m","VFR Diurno"," 15/33","1600 m","36 m","PCN 9/F/C/X/U","Piçarra","-","-","-","-","-","-","-","-","-","-","-","-","-","-","-","PA2020-2978",0,0,0,"PA2020-2978","","","","AP-0","Classe I","-","-","-","-","-","-","-","-","-","-","-","","-"]
["SNGG","PI0007","BOM JESUS DO GURGUÉIA","BOM JESUS","PI","9° 3' 34'' S","44° 22' 9'' W","338 m","VFR Diurno"," 16/34","1200 m","20 m","PCN 9/F/C/Y/U","Asfalto","-","-","-","-","-","-","-","-","-","-","-","-","-","-","-","PA2020-1085",0,0,0,"PA2020-1085","","","","AP-0","Classe I","-","-","-","-","-","-","-","-","-","-","-","","-"]
["SNGI","BA0009","GUANAMBI","GUANAMBI","BA","14° 12' 29'' S","42° 44' 46'' W","553 m","VFR Diurno/Noturno"," 14/32","1700 m","30 m","PCN 18/F/A/Y/T","Asfalto","-","-","-","-","-","-","-","-","-","-","-","-","-","-","-","PA2015-1765",0,0,0,"PA2015-1765","","","","AP-0","Classe I","4ª","2C","NINST","N/A","PA2020-0452","-","PA2020-0452","-","-","-","-","","-"]
["SNGN","PE0006","GARANHUNS","GARANHUNS","PE","8° 50' 4'' S","36° 28' 17'' W","772 m","VFR Diurno"," 16/34","1254 m","28 m","PCN 6/F/C/Y/T","Asfalto","-","-","-","-","-","-","-","-","-","-","-","-","-","-","-","PA2018-1372",0,0,0,"PA2018-1372","","","","AP-0","Classe I","-","-","-","-","-","-","-","-","Proibição de operações noturnas de pouso e decolagem, exceto no caso de operações de emergência médica ou de transporte de valores realizadas mediante prévia coordenação com o Operador do Aeródromo.","PA2020-3753","PA2020-3753","","-"]
["SNGT","BA0029","GENTIO DO OURO","GENTIO DO OURO","BA","11° 26' 30'' S","42° 31' 8'' W","1082 m","VFR Diurno"," 06/24","1300 m","29 m","PCN 10/F/B/Y/U","Asfalto","-","-","-","-","-","-","-","-","-","-","-","-","-","-","-","PD2000-0599",0,0,0,"PD2000-0599","","","","AP-0","Classe I","-","-","-","-","-","-","-","-","Interditado","PA2020-3550","PA2020-3550","","-"]
["SNGX","MG0023","GUAXUPÉ","GUAXUPÉ","MG","21° 19' 36'' S","46° 43' 49'' W","849 m","VFR Diurno/Noturno"," 12/30","1500 m","30 m","PCN 19/F/A/Y/T","Asfalto","-","-","-","-","-","-","-","-","-","-","-","-","-","-","-","PA2020-1564",0,0,0,{"$f":"IF(AD261<>0,HYPERLINK(\"http://pergamum.anac.gov.br/arquivos/\" & AD261 & \".pdf\",AD261),\"\")","v":"PA2020-1564"},"","","","AP-0","Classe I","-","-","-","-","-","-",{"$f":"IF(AR261<>0,HYPERLINK(\"http://pergamum.anac.gov.br/arquivos/\" & AR261 & \".pdf\",AR261),\"\")","v":"-"},"-","-","-",{"$f":"IF(AW261<>0,HYPERLINK(\"http://pergamum.anac.gov.br/arquivos/\" & AW261 & \".pdf\",AW261),\"\")","v":"-"},"","-"]
["SNHS","PE0005","SANTA MAGALHÃES","SERRA TALHADA","PE","8° 3' 41'' S","38° 19' 43'' W","470 m","VFR Diurno/Noturno"," 13/31","1593 m","30 m","PCN 31/F/B/Y/T","Asfalto","-","-","-","-","-","-","-","-","-","-","-","-","-","-","-","PA2018-2109",0,0,0,"PA2018-2109","","","","AP-0","Classe I","-","-","-","-","-","-","-","-","-","-","-","","-"]
["SNIB","BA0045","ITABERABA","ITABERABA","BA","12° 29' 59'' S","40° 16' 13'' W","283 m","VFR Diurno"," 14/32","1100 m","30 m","PCN 8/F/C/Y/U","Asfalto","-","-","-","-","-","-","-","-","-","-","-","-","-","-","-","PA2018-1228",0,0,0,"PA2018-1228","","","","AP-0","Classe I","-","-","-","-","-","-","-","-","-","-","-","","-"]
["SNIC","BA0019","IRECÊ","IRECÊ","BA","11° 20' 24'' S","41° 50' 49'' W","784 m","VFR Diurno/Noturno"," 11/29","1400 m","30 m","5700 kg / 0,5 MPa","Asfalto","-","-","-","-","-","-","-","-","-","-","-","-","-","-","-","PA2020-1299",0,0,0,"PA2020-1299","","","","AP-0","Classe I","4ª","-","-","-","-","-","-","-","-","-","-","","-"]
["SNIE","BA0020","CAETITÉ","CAETITÉ","BA","14° 0' 44'' S","42° 29' 38'' W","976 m","VFR Diurno"," 10/28","1365 m","20 m","PCN 12/F/C/Y/U","Asfalto","-","-","-","-","-","-","-","-","-","-","-","-","-","-","-","PA2015-3332",0,0,0,"PA2015-3332","","","","AP-0","Classe I","-","-","-","-","-","-","-","-","-","-","-","","-"]
["SNIG","CE0007","IGUATU","IGUATU","CE","6° 20' 48'' S","39° 17' 40'' W","213 m","VFR Diurno"," 16/34","1410 m","30 m","PCN 16/F/C/Y/U","Asfalto","-","-","-","-","-","-","-","-","-","-","-","-","-","-","-","PA2020-1023",0,0,0,"PA2020-1023","","","","AP-1","Classe I","-","-","-","-","-","-","-","-","-","-","-","","-"]
["SNIO","BA0010","CIPÓ","CIPÓ","BA","11° 7' 31'' S","38° 29' 13'' W","223 m","VFR Diurno"," 13/31","1620 m","27 m","PCN 4/F/B/Y/U","Asfalto","-","-","-","-","-","-","-","-","-","-","-","-","-","-","-","PA2015-2097",0,0,0,"PA2015-2097","","","","AP-0","Classe I","-","-","-","-","-","-","-","-","-","-","-","","-"]
["SNIP","BA0057","ITAPETINGA","ITAPETINGA","BA","15° 14' 40'' S","40° 16' 38'' W","270 m","VFR Diurno"," 11/29","1060 m","29 m","PCN 8/F/C/Y/U","Asfalto","-","-","-","-","-","-","-","-","-","-","-","-","-","-","-","PA2014-2366",0,0,0,"PA2014-2366","","","","AP-0","Classe I","-","-","-","-","-","-","-","-","-","-","-","","-"]
["SNIT","BA0046","IBOTIRAMA","IBOTIRAMA","BA","12° 9' 52'' S","43° 13' 32'' W","422 m","VFR Diurno"," 16/34","1100 m","20 m","PCN 6/F/C/Y/U","Asfalto","-","-","-","-","-","-","-","-","-","-","-","-","-","-","-","PA2019-0063",0,0,0,"PA2019-0063","","","","AP-0","Classe I","-","-","-","-","-","-","-","-","-","-","-","","-"]
["SNIU","BA0030","IPIAÚ","IPIAÚ","BA","14° 10' 24'' S","39° 41' 3'' W","132 m","VFR Diurno"," 15/33","1300 m","20 m","PCN 6/F/C/Z/U","Asfalto","-","-","-","-","-","-","-","-","-","-","-","-","-","-","-","PA2014-2365",0,0,0,"PA2014-2365","","","","AP-0","Classe I","-","-","-","-","-","-","-","-","-","-","-","","-"]
["SNJB","BA0062","JACOBINA","JACOBINA","BA","11° 9' 47'' S","40° 33' 12'' W","489 m","VFR Diurno"," 14/32","900 m","25 m","PCN 6/F/C/Y/U","Asfalto","-","-","-","-","-","-","-","-","-","-","-","-","-","-","-","PA2015-2078",0,0,0,"PA2015-2078","","","","AP-0","Classe I","-","-","-","-","-","-","-","-","-","-","-","","-"]
["SDIY","BA0013","JOÃO DURVAL CARNEIRO (SBFE*)","FEIRA DE SANTANA","BA","12° 12' 2'' S","38° 54' 23'' W","238 m","VFR Diurno/Noturno"," 13/31","1500 m","30 m","PCN 30/F/A/X/T","Asfalto","-","-","-","-","-","-","-","-","-","-","-","-","-","-","-","PA2019-0627",0,0,0,"PA2019-0627","","","","AP-1","Classe I","3ª","3C","NINST",7,"-","PA2016-0908","-","PA2016-0908","-","-","-","","-"]
["SNJK","BA0047","JEQUIÉ","JEQUIÉ","BA","13° 52' 40'' S","40° 4' 17'' W","197 m","VFR Diurno"," 14/32","1200 m","29 m","PCN 8/F/C/Y/U","Asfalto","-","-","-","-","-","-","-","-","-","-","-","-","-","-","-","PA2014-2695",0,0,0,"PA2014-2695","","","","AP-0","Classe I","4ª","-","-","-","-","-","-","-","-","-","-","","-"]
["SNJM","MG0050","ELIAS BREDER","MANHUAÇU","MG","20° 15' 35'' S","42° 11' 2'' W","829 m","VFR Diurno"," 02/20","1170 m","30 m","PCN 14/F/B/X/T","Asfalto","-","-","-","-","-","-","-","-","-","-","-","-","-","-","-","PA2016-1899",0,0,0,"PA2016-1899","","","","AP-0","Classe I","-","-","-","-","-","-","-","-","-","-","-","","-"]
["SNJN","MG0039","JANUÁRIA","JANUÁRIA","MG","15° 28' 29'' S","44° 23' 11'' W","480 m","VFR Diurno"," 08/26","1200 m","30 m","PCN 10/F/B/Y/U","Asfalto","-","-","-","-","-","-","-","-","-","-","-","-","-","-","-","PD1982-0206",0,0,0,"PD1982-0206","","","","AP-0","Classe I","-","-","-","-","-","-","-","-","-","-","-","","-"]
["SNJO","PB0002","AEROCLUBE DE JOÃO PESSOA","JOÃO PESSOA","PB","7° 5' 30'' S","34° 50' 31'' W","6 m","VFR Diurno"," 15/33","782 m","18 m","5000 kg / 0,5 MPa","Cascalho","-","-","-","-","-","-","-","-","-","-","-","-","-","-","-","PA2018-1234",0,0,0,"PA2018-1234","","","","AP-0","Classe I","-","-","-","-","-","-","-","-","Interditado","PA2019-1778","PA2019-1778","","-"]
["SNJP","MG0036","JOÃO PINHEIRO","JOÃO PINHEIRO","MG","17° 47' 15'' S","46° 7' 12'' W","911 m","VFR Diurno"," 06/24","1300 m","23 m","5670 kg / 0,5 MPa","Asfalto","-","-","-","-","-","-","-","-","-","-","-","-","-","-","-","PD2000-0057",0,0,0,"PD2000-0057","","","","AP-0","Classe I","-","-","-","-","-","-","-","-","-","-","-","","-"]
["SNJQ","MG0053","JEQUITINHONHA","JEQUITINHONHA","MG","16° 26' 29'' S","41° 2' 14'' W","260 m","VFR Diurno"," 10/28","1130 m","23 m","PCN 6/F/C/Z/U","Asfalto","-","-","-","-","-","-","-","-","-","-","-","-","-","-","-","PA2020-3472",0,0,0,"PA2020-3472","","","","AP-0","Classe I","-","-","-","-","-","-","-","-","-","-","-","","-"]
["SNJR","MG0034","PREFEITO OCTÁVIO DE ALMEIDA NEVES","SÃO JOÃO DEL REI","MG","21° 5' 8'' S","44° 13' 31'' W","945 m","VFR Diurno/Noturno"," 08/26","1400 m","30 m","PCN 16/F/B/Y/T","Asfalto","-","-","-","-","-","-","-","-","-","-","-","-","-","-","-","PA2015-1205",0,0,0,"PA2015-1205","","","","AP-0","Classe I","3ª","2C","NINST",7,"-","PA2016-0908","-","PA2016-0908","-","-","-","","-"]
["SNKC","BA0058","COCOS","COCOS","BA","14° 10' 2'' S","44° 33' 2'' W","613 m","VFR Diurno"," 15/33","1000 m","20 m","PCN 6/F/B/Y/U","Piçarra","-","-","-","-","-","-","-","-","-","-","-","-","-","-","-","PA2015-2385",0,0,0,"PA2015-2385","","","","AP-0","Classe I","-","-","-","-","-","-","-","-","Interditado","PA2020-3508","PA2020-3508","","-"]
["SNKD","MG0070","CONCEIÇÃO DO MATO DENTRO","CONCEIÇÃO DO MATO DENTRO","MG","19° 1' 13'' S","43° 26' 2'' W","669 m","VFR Diurno"," 15/33","960 m","23 m","PCN 8/F/B/X/T","Asfalto","-","-","-","-","-","-","-","-","-","-","-","-","-","-","-","PD1984-0091",0,0,0,"PD1984-0091","","","","AP-0","Classe I","-","-","-","-","-","-","-","-","Interditado","PA2016-1321","PA2016-1321","","-"]
["SNKF","MG0071","DAS BANDEIRINHAS","CONSELHEIRO LAFAIETE","MG","20° 44' 19'' S","43° 47' 53'' W","1057 m","VFR Diurno"," 04/22","902 m","24 m","PCN 9/F/C/Y/U","Asfalto","-","-","-","-","-","-","-","-","-","-","-","-","-","-","-","PA2018-3126",0,0,0,"PA2018-3126","","","","AP-0","Classe I","-","-","-","-","-","-","-","-","-","-","-","","-"]
["SNKI","ES0006","CACHOEIRO DE ITAPEMIRIM","CACHOEIRO DE ITAPEMIRIM","ES","20° 50' 7'' S","41° 11' 11'' W","78 m","VFR Diurno/Noturno"," 06/24","1200 m","30 m","PCN 14/F/C/Y/T","Asfalto","-","-","-","-","-","-","-","-","-","-","-","-","-","-","-","PA2015-1473",0,0,0,"PA2015-1473","","","","AP-0","Classe I","-","-","-","-","-","-","-","-","-","-","-","","-"]
["SNKK","RN0005","CAICÓ","CAICÓ","RN","6° 26' 21'' S","37° 4' 41'' W","182 m","VFR Diurno"," 14/32","980 m","30 m","PCN 12/F/B/Y/U","Asfalto","-","-","-","-","-","-","-","-","-","-","-","-","-","-","-","PA2015-2499",0,0,0,"PA2015-2499","","","","AP-0","Classe I","-","-","-","-","-","-","-","-","-","-","-","","-"]
["SNKN","RN0004","CURRAIS NOVOS","CURRAIS NOVOS","RN","6° 16' 51'' S","36° 32' 25'' W","367 m","VFR Diurno"," 10/28","1040 m","30 m","PCN 6/F/B/Y/U","Piçarra","-","-","-","-","-","-","-","-","-","-","-","-","-","-","-","PA2020-0981",0,0,0,"PA2020-0981","","","","AP-0","Classe I","-","-","-","-","-","-","-","-","-","-","-","","-"]
["SNKR","PI0012","CORRENTE","CORRENTE","PI","10° 27' 7'' S","45° 8' 11'' W","473 m","VFR Diurno"," 11/29","1000 m","20 m","2500 kg / 0,5 MPa","Terra","-","-","-","-","-","-","-","-","-","-","-","-","-","-","-",0,0,0,0,"","","","","AP-0","Classe I","-","-","-","-","-","-","-","-","Interditado","-","-","","Interdição noticiada por meio do Ofício nº 149/2013/SIA/ANAC"]
["SNKS","BA0064","SANTA RITA DE CÁSSIA","SANTA RITA DE CÁSSIA","BA","10° 59' 21'' S","44° 30' 55'' W","458 m","VFR Diurno"," 09/27","800 m","35 m","PCN 10/F/B/Y/U","Asfalto","-","-","-","-","-","-","-","-","-","-","-","-","-","-","-","PA2014-1705",0,0,0,"PA2014-1705","","","","AP-0","Classe I","-","-","-","-","-","-","-","-","Interditado","PA2020-3537","PA2020-3537","","-"]
["SNKU","BA0066","CANUDOS","CANUDOS","BA","9° 54' 11'' S","39° 1' 58'' W","372 m","VFR Diurno"," 14/32","700 m","22 m","2500 kg / 0,5 MPa","Terra","-","-","-","-","-","-","-","-","-","-","-","-","-","-","-","PA2016-0631",0,0,0,"PA2016-0631","","","","AP-0","Classe I","-","-","-","-","-","-","-","-","Interditado","PA2020-3507","PA2020-3507","","-"]
["SNLI","MG0040","DOUTOR JOSÉ MOURÃO","ABAETÉ","MG","19° 9' 26'' S","45° 29' 45'' W","664 m","VFR Diurno"," 17/35","1200 m","30 m","5670 kg / 0,63 MPa","Asfalto","-","-","-","-","-","-","-","-","-","-","-","-","-","-","-","PD1998-0497E",0,0,0,"PD1998-0497E","","","","AP-0","Classe I","-","-","-","-","-","-","-","-","Interditado","PA2020-0655","PA2020-0655","","-"]
["SNLN","ES0002","MUNICIPAL DE LINHARES","LINHARES","ES","19° 21' 19'' S","40° 4' 10'' W","40 m","VFR Diurno/Noturno"," 06/24","1350 m","30 m","PCN 14/F/A/Y/T","Asfalto","-","-","-","-","-","-","-","-","-","-","-","-","-","-","-","PA2015-2012",0,0,0,"PA2015-2012","","","","AP-0","Classe I","-","-","-","-","-","-","-","-","-","-","-","","-"]
["SNLO","MG0037","SÃO LOURENÇO","SÃO LOURENÇO","MG","22° 5' 30'' S","45° 2' 43'' W","875 m","VFR Diurno"," 05/23","1300 m","30 m","PCN 14/F/B/X/T","Asfalto","-","-","-","-","-","-","-","-","-","-","-","-","-","-","-","PD1983-0097",0,0,0,"PD1983-0097","","","","AP-0","Classe I","4ª","-","-","-","-","-","-","-","-","-","-","","-"]
["SNLT","PI0010","PAULISTANA","PAULISTANA","PI","8° 9' 59'' S","41° 9' 14'' W","360 m","VFR Diurno"," 07/25","1060 m","30 m","2500 kg / 0,5 MPa","Cascalho","-","-","-","-","-","-","-","-","-","-","-","-","-","-","-",0,0,0,0,"","","","","AP-0","Classe I","-","-","-","-","-","-","-","-","Interditado","-","-","","Interdição noticiada por meio do Ofício nº 149/2013/SIA/ANAC"]
["SNMA","PA0019","MONTE ALEGRE","MONTE ALEGRE","PA","1° 59' 48'' S","54° 4' 17'' W","99 m","VFR Diurno"," 10/28","1425 m","30 m","PCN 9/F/C/Y/U","Asfalto","-","-","-","-","-","-","-","-","-","-","-","-","-","-","-","PD1973-0043",0,0,0,"PD1973-0043","","","","AP-0","Classe I","-","-","-","-","-","-","-","-","-","-","-","X","-"]
["SNMC","BA0026","MACAÚBAS","MACAÚBAS","BA","13° 1' 30'' S","42° 40' 20'' W","641 m","VFR Diurno"," 12/30","1318 m","19 m","PCN 8/F/C/Y/U","Asfalto","-","-","-","-","-","-","-","-","-","-","-","-","-","-","-","PA2016-0669",0,0,0,"PA2016-0669","","","","AP-0","Classe I","-","-","-","-","-","-","-","-","Interditado","PA2020-3545","PA2020-3545","","-"]
["SNMH","GO0018","PIRENÓPOLIS","PIRENÓPOLIS","GO","15° 50' 53'' S","48° 58' 49'' W","785 m","VFR Diurno"," 15/33","1295 m","30 m","PCN 18/F/A/Y/T","Asfalto","-","-","-","-","-","-","-","-","-","-","-","-","-","-","-","PA2011-0969",0,0,0,"PA2011-0969","","","","AP-0","Classe I","-","-","-","-","-","-","-","-","-","-","-","","-"]
["SNMJ","BA0031","MARACÁS","MARACÁS","BA","13° 23' 10'' S","40° 27' 58'' W","962 m","VFR Diurno"," 07/25","1300 m","20 m","5700 kg / 0,5 MPa","Asfalto","-","-","-","-","-","-","-","-","-","-","-","-","-","-","-","PA2014-1386",0,0,0,"PA2014-1386","","","","AP-0","Classe I","-","-","-","-","-","-","-","-","-","-","-","","-"]
["SNMK","MG0017","MOCAMBINHO","JAÍBA","MG","15° 5' 35'' S","43° 58' 45'' W","450 m","VFR Diurno"," 11/29","1531 m","30 m","PCN 14/F/A/Y/T","Asfalto","-","-","-","-","-","-","-","-","-","-","-","-","-","-","-","PA2020-2078",0,0,0,"PA2020-2078","","","","AP-0","Classe I","-","-","-","-","-","-","-","-","-","-","-","","-"]
["SNMN","MG0075","MINAS NOVAS","MINAS NOVAS","MG","17° 14' 2'' S","42° 35' 2'' W","750 m","VFR Diurno"," 15/33","800 m","20 m","2500 kg / 0,5 MPa","Asfalto","-","-","-","-","-","-","-","-","-","-","-","-","-","-","-",0,0,0,0,"","","","","AP-0","Classe I","-","-","-","-","-","-","-","-","Interditado","PA2019-3102","PA2019-3102","","-"]
["SNMR","BA0065","MARAÚ","MARAÚ","BA","14° 7' 2'' S","38° 59' 2'' W","20 m","VFR Diurno"," 12/30","800 m","30 m","5000 kg / 0,5 MPa","Areia","-","-","-","-","-","-","-","-","-","-","-","-","-","-","-",0,0,0,0,"","","","","AP-0","Classe I","-","-","-","-","-","-","-","-","Interditado","PA2019-3781","PA2019-3781","","-"]
["SNMX","ES0003","SÃO MATEUS","SÃO MATEUS","ES","18° 43' 17'' S","39° 50' 1'' W","30 m","VFR Diurno/Noturno"," 08/26","1350 m","30 m","PCN 8/F/C/Y/U","Asfalto","-","-","-","-","-","-","-","-","-","-","-","-","-","-","-","PA2015-2013",0,0,0,"PA2015-2013","","","","AP-0","Classe I","-","-","-","-","-","-","-","-","-","-","-","","-"]
["SNMZ","PA0020","PORTO DE MOZ","PORTO DE MOZ","PA","1° 44' 29'' S","52° 14' 9'' W","16 m","VFR Diurno"," 05/23","1270 m","28 m","5700 kg / 0,5 MPa","Asfalto","-","-","-","-","-","-","-","-","-","-","-","-","-","-","-","PA2017-2640",0,0,0,"PA2017-2640","","","","AP-1","Classe I","-","-","-","-","-","-","-","-","-","-","-","X","-"]
["SNNE","MG0078","SEBASTIÃO CARLOS LEITE","SÃO JOÃO NEPOMUCENO","MG","21° 32' 32'' S","43° 1' 16'' W","403 m","VFR Diurno"," 11/29","620 m","40 m","3000 kg / 0,5 MPa","Saibro","-","-","-","-","-","-","-","-","-","-","-","-","-","-","-","PA2020-0975",0,0,0,"PA2020-0975","","","","AP-0","Classe I","-","-","-","-","-","-","-","-","-","-","-","","-"]
["SNNU","MG0041","NANUQUE","NANUQUE","MG","17° 49' 23'' S","40° 19' 47'' W","210 m","VFR Diurno"," 11/29","1220 m","23 m","PCN 13/F/C/Y/U","Asfalto","-","-","-","-","-","-","-","-","-","-","-","-","-","-","-","PA2018-2331",0,0,0,"PA2018-2331","","","","AP-0","Classe I","-","-","-","-","-","-","-","-","-","-","-","","-"]
["SNOB","CE0013","AERÓDROMO PÚBLICO DE SOBRAL","SOBRAL","CE","3° 40' 44'' S","40° 20' 12'' W","64 m","VFR Diurno/Noturno"," 10/28","1033 m","30 m","PCN 8/F/C/Y/U","Asfalto","-","-","-","-","-","-","-","-","-","-","-","-","-","-","-","PA2020-0984",0,0,0,"PA2020-0984","","","","AP-1","Classe I","-","-","-","-","-","-","-","-","-","-","-","","-"]
["SNOC","BA0059","MORRO DO CHAPÉU","MORRO DO CHAPÉU","BA","11° 32' 4'' S","41° 10' 47'' W","1100 m","VFR Diurno"," 15/33","1000 m","25 m","PCN 7/F/C/Y/U","Cascalho","-","-","-","-","-","-","-","-","-","-","-","-","-","-","-","PD1966-0130",0,0,0,"PD1966-0130","","","","AP-0","Classe I","-","-","-","-","-","-","-","-","-","-","-","","-"]
["SNOE","PI0008","OEIRAS","OEIRAS","PI","7° 1' 8'' S","42° 10' 2'' W","250 m","VFR Diurno"," 11/29","1200 m","40 m","PCN 8/F/C/Y/U","Terra","-","-","-","-","-","-","-","-","-","-","-","-","-","-","-",0,0,0,0,"","","","","AP-0","Classe I","-","-","-","-","-","-","-","-","Interditado","-","-","","Interdição noticiada por meio do Ofício nº 149/2013/SIA/ANAC"]
["SNOF","MG0057","OURO FINO","OURO FINO","MG","22° 17' 51'' S","46° 23' 36'' W","859 m","VFR Diurno"," 06/24","1080 m","50 m","2500 kg / 0,5 MPa","Grama","-","-","-","-","-","-","-","-","-","-","-","-","-","-","-",0,0,0,0,"","","","","AP-0","Classe I","-","-","-","-","-","-","-","-","-","-","-","","-"]
["SNOS","MG0024","MUNICIPAL JOSÉ FIGUEIREDO","PASSOS","MG","20° 44' 0'' S","46° 39' 35'' W","822 m","VFR Diurno/Noturno"," 14/32","1500 m","30 m","PCN 19/F/A/Y/T","Asfalto","-","-","-","-","-","-","-","-","-","-","-","-","-","-","-","PA2013-2698",0,0,0,"PA2013-2698","","","","AP-0","Classe I","-","-","-","-","-","-","-","-","-","-","-","","-"]
["SNOU","AC0003","NOVO AERÓDROMO DE FEIJÓ","FEIJÓ","AC","8° 8' 29'' S","70° 20' 27'' W","168 m","VFR Diurno"," 03/21","1200 m","24 m","5500 kg / 0,5 MPa","Asfalto","-","-","-","-","-","-","-","-","-","-","-","-","-","-","-","PA2020-1089",0,0,0,"PA2020-1089","","","","AP-0","Classe I","-","-","-","-","-","-","-","-","-","-","-","X","-"]
["SNOX","PA0014","ORIXIMINÁ","ORIXIMINÁ","PA","1° 42' 49'' S","55° 50' 9'' W","80 m","VFR Diurno"," 17/35","1600 m","30 m","PCN 27/F/B/X/U","Asfalto","-","-","-","-","-","-","-","-","-","-","-","-","-","-","-","PA2020-0969",0,0,0,"PA2020-0969","","","","AP-0","Classe I","-","-","-","-","-","-","-","-","-","-","-","X","-"]
["SNPA","MG0052","PARÁ DE MINAS","PARÁ DE MINAS","MG","19° 50' 33'' S","44° 36' 3'' W","839 m","VFR Diurno"," 12/30","1140 m","23 m","PCN 8/F/C/Y/U","Asfalto","-","-","-","-","-","-","-","-","-","-","-","-","-","-","-","PA2018-1756",0,0,0,"PA2018-1756","","","","AP-0","Classe I","-","-","-","-","-","-","-","-","-","-","-","","-"]
["SNPC","PI0009","PICOS","PICOS","PI","7° 3' 55'' S","41° 31' 10'' W","320 m","VFR Diurno"," 14/32","1200 m","24 m","PCN 8/F/C/Y/U","Asfalto","-","-","-","-","-","-","-","-","-","-","-","-","-","-","-","PA2018-2847",0,0,0,"PA2018-2847","","","","AP-0","Classe I","-","-","-","-","-","-","-","-","-","-","-","","-"]
["SNPD","MG0010","PATOS DE MINAS","PATOS DE MINAS","MG","18° 40' 20'' S","46° 29' 29'' W","851 m","VFR Diurno/Noturno"," 09/27","1700 m","30 m","PCN 39/F/A/Y/T","Asfalto","-","-","-","-","-","-","-","-","-","-","-","-","-","-","-","PA2016-0576",0,0,0,"PA2016-0576","","","","AP-0","Classe I","-","3C","NINST",7,"-","PA2016-0908","-","PA2016-0908","-","-","-","","-"]
["SNPI","BA0021","PIATÃ","PIATÃ","BA","13° 9' 56'' S","41° 46' 19'' W","1267 m","VFR Diurno"," 01/19","1350 m","25 m","PCN 10/F/C/Y/U","Cascalho","-","-","-","-","-","-","-","-","-","-","-","-","-","-","-","PD2000-0601",0,0,0,"PD2000-0601","","","","AP-0","Classe I","-","-","-","-","-","-","-","-","Interditado","PA2020-3547 / PA2019-3189","PA2020-3547 / PA2019-3189","","-"]
["SNPJ","MG0042","PATROCÍNIO","PATROCÍNIO","MG","18° 54' 33'' S","46° 58' 58'' W","985 m","VFR Diurno"," 05/23","1200 m","30 m","PCN 14/F/B/Y/T","Asfalto","-","-","-","-","-","-","-","-","-","-","-","-","-","-","-","PA2019-1662",0,0,0,"PA2019-1662","","","","AP-0","Classe I","-","-","-","-","-","-","-","-","-","-","-","","-"]
["SNPO","MG0043","TENENTE XAVIER","POMPÉU","MG","19° 12' 12'' S","45° 1' 24'' W","705 m","VFR Diurno"," 15/33","1200 m","70 m","5000 kg / 0,5 MPa","Terra","-","-","-","-","-","-","-","-","-","-","-","-","-","-","-",0,0,0,0,"","","","","AP-0","Classe I","-","-","-","-","-","-","-","-","-","-","-","","-"]
["SNPQ","PE0010","PESQUEIRA","PESQUEIRA","PE","8° 22' 27'' S","36° 38' 16'' W","630 m","VFR Diurno"," 10/28","1000 m","20 m","PCN 8/F/C/Y/U","Terra","-","-","-","-","-","-","-","-","-","-","-","-","-","-","-","PA2017-1243",0,0,0,"PA2017-1243","","","","AP-0","Classe I","-","-","-","-","-","-","-","-","Interditado","PA2019-2470","PA2019-2470","","-"]
["SBCZ","AC0002","CRUZEIRO DO SUL","CRUZEIRO DO SUL","AC","7° 35' 58'' S","72° 46' 10'' W","194 m","VFR Diurno/Noturno e IFR Diurno/Noturno"," 10/28","2400 m","45 m","PCN 32/F/A/X/T","Asfalto","-","-","-","-","-","-","-","-","-","-","-","-","-","-","-","PA2014-0630",0,0,0,"PA2014-0630","","","","AP-1","Classe I","2ª","4C","NPA",7,"-","PA2016-0908","-","PA2016-0908","-","-","-","X","-"]
["SNPX","MG0028","PIRAPORA","PIRAPORA","MG","17° 18' 50'' S","44° 51' 31'' W","551 m","VFR Diurno"," 10/28","1480 m","30 m","PCN 10/F/B/Y/U","Asfalto","-","-","-","-","-","-","-","-","-","-","-","-","-","-","-","PA2020-1087",0,0,0,"PA2020-1087","","","","AP-0","Classe I","-","-","-","-","-","-","-","-","-","-","-","","-"]
["SNPY","MG0013","SÃO SEBASTIÃO DO PARAÍSO","SÃO SEBASTIÃO DO PARAÍSO","MG","20° 56' 54'' S","46° 58' 59'' W","950 m","VFR Diurno"," 05/23","1600 m","30 m","PCN 8/F/C/Y/U","Asfalto","-","-","-","-","-","-","-","-","-","-","-","-","-","-","-","PA2019-3901",0,0,0,"PA2019-3901","","","","AP-0","Classe I","-","-","-","-","-","-","-","-","-","-","-","","-"]
["SNQD","PB0006","SOUSA","SOUSA","PB","6° 47' 8'' S","38° 14' 2'' W","272 m","VFR Diurno"," 15/33","1075 m","30 m","PCN 13/F/A/Y/U","Asfalto","-","-","-","-","-","-","-","-","-","-","-","-","-","-","-","PA2018-1693",0,0,0,"PA2018-1693","","","","AP-0","Classe I","-","-","-","-","-","-","-","-","-","-","-","","-"]
["SNQG","PI0003","CANGAPARA","FLORIANO","PI","6° 50' 45'' S","43° 4' 39'' W","210 m","VFR Diurno"," 16/34","1800 m","30 m","PCN 6/F/C/Y/U","Asfalto","-","-","-","-","-","-","-","-","-","-","-","-","-","-","-","PA2018-2843",0,0,0,"PA2018-2843","","","","AP-0","Classe I","-","-","-","-","-","-","-","-","-","-","-","","-"]
["SNQU","BA0032","MUCUGÊ","MUCUGÊ","BA","13° 1' 54'' S","41° 26' 40'' W","1056 m","VFR Diurno"," 07/25","1300 m","19 m","PCN 6/F/C/Z/U","Asfalto","-","-","-","-","-","-","-","-","-","-","-","-","-","-","-","PD2000-0529",0,0,0,"PD2000-0529","","","","AP-0","Classe I","-","-","-","-","-","-","-","-","Interditado","PA2019-3190","PA2019-3190","","-"]
["SNQV","MG0044","CURVELO","CURVELO","MG","18° 44' 58'' S","44° 27' 29'' W","672 m","VFR Diurno"," 09/27","1200 m","23 m","5000 kg / 0,5 MPa","Asfalto","-","-","-","-","-","-","-","-","-","-","-","-","-","-","-","PA2018-3127",0,0,0,"PA2018-3127","","",{"$f":"IF(AG324<>0,HYPERLINK(\"http://pergamum.anac.gov.br/arquivos/\" & AG324 & \".pdf\",AG324),\"\")","v":""},"AP-0","Classe I","-","-","-","-","-","-","-","-","-","-","-","","-"]
["SNQX","CE0010","QUIXADÁ","QUIXADÁ","CE","4° 58' 44'' S","38° 59' 16'' W","225 m","VFR Diurno"," 14/32","1200 m","30 m","PCN 17/F/A/X/T","Terra","-","-","-","-","-","-","-","-","-","-","-","-","-","-","-","PA2020-1076",0,0,0,{"$f":"IF(AD325<>0,HYPERLINK(\"http://pergamum.anac.gov.br/arquivos/\" & AD325 & \".pdf\",AD325),\"\")","v":"PA2020-1076"},"","","","AP-0","Classe I","-","-","-","-","-","-",{"$f":"IF(AR325<>0,HYPERLINK(\"http://pergamum.anac.gov.br/arquivos/\" & AR325 & \".pdf\",AR325),\"\")","v":"-"},"-","Proibição de operações de pouso de aeronaves de asa fixa com motor à reação (turbojato).","PA2020-0749",{"$f":"IF(AW325<>0,HYPERLINK(\"http://pergamum.anac.gov.br/arquivos/\" & AW325 & \".pdf\",AW325),\"\")","v":"PA2020-0749"},"","-"]
["SNRD","BA0048","PRADO","PRADO","BA","17° 17' 49'' S","39° 16' 19'' W","27 m","VFR Diurno"," 11/29","1081 m","30 m","PCN 8/F/C/Y/U","Asfalto","-","-","-","-","-","-","-","-","-","-","-","-","-","-","-","PA2018-1208",0,0,0,"PA2018-1208","","","","AP-0","Classe I","4ª","-","-","-","-","-","-","-","-","-","-","","-"]
["SNRM","BA0022","REMANSO","REMANSO","BA","9° 34' 48'' S","42° 6' 57'' W","405 m","VFR Diurno"," 11/29","1350 m","30 m","PCN 8/F/C/Y/U","Asfalto","-","-","-","-","-","-","-","-","-","-","-","-","-","-","-","PA2016-0401",0,0,0,"PA2016-0401","","","","AP-0","Classe I","-","-","-","-","-","-","-","-","-","-","-","","-"]
["SNRP","MG0066","RIO PARANAÍBA","RIO PARANAÍBA","MG","19° 12' 45'' S","46° 14' 26'' W","1145 m","VFR Diurno"," 16/34","1000 m","22 m","4000 kg / 0,5 MPa","Terra","-","-","-","-","-","-","-","-","-","-","-","-","-","-","-","PA2020-0982",0,0,0,"PA2020-0982","","","","AP-0","Classe I","-","-","-","-","-","-","-","-","-","-","-","","-"]
["SNRU","PE0004","CARUARU","CARUARU","PE","8° 17' 4'' S","36° 0' 39'' W","576 m","VFR Diurno"," 13/31","1800 m","30 m","PCN 30/F/A/X/U","Asfalto","-","-","-","-","-","-","-","-","-","-","-","-","-","-","-","PA2020-1090",0,0,0,"PA2020-1090","","","","AP-0","Classe I","-","-","-","-","-","-","-","-","-","-","-","","-"]
["SNRX","MA0009","RIACHÃO","RIACHÃO","MA","7° 21' 1'' S","46° 38' 2'' W","400 m","VFR Diurno"," 12/30","1200 m","40 m","PCN 6/F/C/Y/U","Terra","-","-","-","-","-","-","-","-","-","-","-","-","-","-","-",0,0,0,0,"","","","","AP-0","Classe I","-","-","-","-","-","-","-","-","Interditado","PA2020-1040","PA2020-1040","X","-"]
["SNRZ","MG0049","OLIVEIRA","OLIVEIRA","MG","20° 42' 52'' S","44° 51' 55'' W","982 m","VFR Diurno/Noturno"," 03/21","1180 m","18 m","5700 kg / 0,5 MPa","Asfalto","-","-","-","-","-","-","-","-","-","-","-","-","-","-","-","PA2020-2420",0,0,0,"PA2020-2420","","","","AP-0","Classe I","-","-","-","-","-","-","-","-","-","-","-","","-"]
["SNSE","BA0056","SENTO SÉ","SENTO SÉ","BA","9° 45' 27'' S","41° 51' 18'' W","398 m","VFR Diurno"," 15/33","1100 m","25 m","PCN 10/F/B/Y/U","Cascalho","-","-","-","-","-","-","-","-","-","-","-","-","-","-","-","PA2014-1707",0,0,0,"PA2014-1707","","","","AP-0","Classe I","-","-","-","-","-","-","-","-","-","-","-","","-"]
["SNSG","PE0008","SALGUEIRO","SALGUEIRO","PE","8° 2' 48'' S","39° 8' 2'' W","469 m","VFR Diurno"," 17/35","1300 m","30 m","PCN 6/F/B/Y/U","Asfalto","-","-","-","-","-","-","-","-","-","-","-","-","-","-","-","PA2018-1374",0,0,0,"PA2018-1374","","","","AP-0","Classe I","-","-","-","-","-","-","-","-","Interditado","PA2020-0999","PA2020-0999","","-"]
["SNSI","MG0076","SANTA MARIA DO SUAÇUÍ","SANTA MARIA DO SUAÇUÍ","MG","18° 11' 55'' S","42° 27' 58'' W","480 m","VFR Diurno"," 03/21","800 m","35 m","2500 kg / 0,5 MPa","Terra","-","-","-","-","-","-","-","-","-","-","-","-","-","-","-",0,0,0,0,"","","","","AP-0","Classe I","-","-","-","-","-","-","-","-","Interditado","PA2020-2489","PA2020-2489","","-"]
["SNSM","PA0029","SALINÓPOLIS","SALINÓPOLIS","PA","0° 41' 49'' S","47° 20' 16'' W","27 m","VFR Diurno"," 09/27","1000 m","25 m","5700 kg / 0,5 MPa","Asfalto","-","-","-","-","-","-","-","-","-","-","-","-","-","-","-","PD1999-0432",0,0,0,"PD1999-0432","","","","AP-0","Classe I","-","-","-","-","-","-","-","-","Interditado","-","-","X","Interdição noticiada por meio do Ofício nº 149/2013/SIA/ANAC"]
["SNSS","MG0029","SALINAS","SALINAS","MG","16° 12' 30'' S","42° 19' 19'' W","763 m","VFR Diurno"," 18/36","1480 m","30 m","PCN 8/F/B/Y/T","Asfalto","-","-","-","-","-","-","-","-","-","-","-","-","-","-","-","PA2019-2065",0,0,0,"PA2019-2065","","","","AP-0","Classe I","-","-","-","-","-","-","-","-","-","-","-","","-"]
["SNST","BA0049","SOUTO SOARES","SOUTO SOARES","BA","12° 5' 50'' S","41° 38' 26'' W","816 m","VFR Diurno"," 17/35","1200 m","20 m","PCN 8/F/C/Y/U","Asfalto","-","-","-","-","-","-","-","-","-","-","-","-","-","-","-","PD2000-0532",0,0,0,"PD2000-0532","","","","AP-0","Classe I","-","-","-","-","-","-","-","-","-","-","-","","-"]
["SNSW","PA0025","SOURE","SOURE","PA","0° 41' 52'' S","48° 31' 10'' W","13 m","VFR Diurno"," 06/24","1100 m","30 m","5700 kg / 0,5 MPa","Asfalto","-","-","-","-","-","-","-","-","-","-","-","-","-","-","-","PA2015-2707",0,0,0,"PA2015-2707","","","","AP-0","Classe I","-","-","-","-","-","-","-","-","Interditado","PA2019-1106","PA2019-1106","X","-"]
["SNTF","BA0016","TEIXEIRA DE FREITAS","TEIXEIRA DE FREITAS","BA","17° 31' 28'' S","39° 40' 6'' W","105 m","VFR Diurno/Noturno"," 11/29","1460 m","30 m","PCN 31/F/A/X/T","Asfalto","-","-","-","-","-","-","-","-","-","-","-","-","-","-","-","PA2014-1877",0,0,0,"PA2014-1877","","","","AP-1","Classe I","4ª","3C","NINST",8,"-","PA2016-0908","-","PA2016-0908","-","-","-","","-"]
["SNTI","PA0016","ÓBIDOS","ÓBIDOS","PA","1° 52' 5'' S","55° 30' 52'' W","100 m","VFR Diurno"," 10/28","1520 m","30 m","PCN 9/F/C/Y/U","Asfalto","-","-","-","-","-","-","-","-","-","-","-","-","-","-","-","PA2017-2710",0,0,0,"PA2017-2710","","","","AP-0","Classe I","-","-","-","-","-","-","-","-","-","-","-","X","-"]
["SNTM","MG0068","TURMALINA","TURMALINA","MG","17° 14' 2'' S","42° 44' 2'' W","882 m","VFR Diurno"," 01/19","1000 m","30 m","2500 kg / 0,5 MPa","Terra","-","-","-","-","-","-","-","-","-","-","-","-","-","-","-",0,0,0,0,"","","","","AP-0","Classe I","-","-","-","-","-","-","-","-","Interditado","-","-","","Interdição noticiada por meio do Ofício nº 149/2013/SIA/ANAC"]
["SNTO","MG0048","JUSCELINO KUBITSCHECK","TEÓFILO OTONI","MG","17° 53' 27'' S","41° 30' 54'' W","480 m","VFR Diurno/Noturno"," 11/29","1190 m","23 m","PCN 10/F/B/Y/U","Asfalto","-","-","-","-","-","-","-","-","-","-","-","-","-","-","-","PA2020-1559",0,0,0,"PA2020-1559","","","","AP-0","Classe I","4ª","-","-","-","-","-","-","-","-","-","-","","-"]
["SNTQ","BA0053","BURITIRAMA","BURITIRAMA","BA","10° 43' 18'' S","43° 39' 13'' W","499 m","VFR Diurno"," 11/29","1102 m","29 m","5700 kg / 0,5 MPa","Piçarra","-","-","-","-","-","-","-","-","-","-","-","-","-","-","-","PA2015-2911",0,0,0,"PA2015-2911","","","","AP-0","Classe I","-","-","-","-","-","-","-","-","-","-","-","","-"]
["SNTR","BA0036","PIRITIBA","PIRITIBA","BA","11° 44' 17'' S","40° 34' 11'' W","585 m","VFR Diurno"," 10/28","1227 m","25 m","PCN 8/F/B/Y/U","Asfalto","-","-","-","-","-","-","-","-","-","-","-","-","-","-","-","PD2000-0602",0,0,0,"PD2000-0602","","","","AP-0","Classe I","-","-","-","-","-","-","-","-","-","-","-","","-"]
["SNTS","PB0005","PATOS","PATOS","PB","7° 2' 16'' S","37° 15' 27'' W","265 m","VFR Diurno/Noturno"," 12/30","1600 m","30 m","PCN 6/F/C/Y/U","Asfalto","-","-","-","-","-","-","-","-","-","-","-","-","-","-","-","PA2020-1080",0,0,0,"PA2020-1080","","","","AP-0","Classe I","-","-","-","-","-","-","-","-","-","-","-","","-"]
["SNTY","BA0051","CORRENTINA","CORRENTINA","BA","13° 22' 48'' S","44° 37' 19'' W","667 m","VFR Diurno"," 12/30","1140 m","25 m","PCN 8/F/C/Y/U","Cascalho","-","-","-","-","-","-","-","-","-","-","-","-","-","-","-","PA2015-2849",0,0,0,"PA2015-2849","","","","AP-0","Classe I","-","-","-","-","-","-","-","-","Interditado","PA2020-3509","PA2020-3509","","-"]
["SNUB","MG0058","UBÁ","UBÁ","MG","21° 7' 21'' S","42° 52' 56'' W","340 m","VFR Diurno"," 16/34","1080 m","30 m","PCN 8/F/C/Y/U","Asfalto","-","-","-","-","-","-","-","-","-","-","-","-","-","-","-","PD1983-0189",0,0,0,"PD1983-0189","","","","AP-0","Classe I","-","-","-","-","-","-","-","-","-","-","-","","-"]
["SNUC","RN0003","AÇU","AÇU","RN","5° 35' 42'' S","36° 57' 39'' W","111 m","VFR Diurno"," 11/29","1500 m","14 m","PCN 8/F/C/Y/U","Asfalto","-","-","-","-","-","-","-","-","-","-","-","-","-","-","-","PA2016-0351",0,0,0,"PA2016-0351","","","","AP-0","Classe I","-","-","-","-","-","-","-","-","-","-","-","","-"]
["SNUH","MG0054","PIUMHI","PIUMHI","MG","20° 26' 20'' S","45° 59' 32'' W","751 m","VFR Diurno"," 07/25","1148 m","30 m","PCN 14/F/A/Y/T","Asfalto","-","-","-","-","-","-","-","-","-","-","-","-","-","-","-","PA2020-1981",0,0,0,"PA2020-1981","","","","AP-0","Classe I","-","-","-","-","-","-","-","-","-","-","-","","-"]
["SNUI","MG0045","ARAÇUAÍ","ARAÇUAÍ","MG","16° 51' 7'' S","42° 2' 46'' W","360 m","VFR Diurno"," 09/27","1200 m","30 m","PCN 10/F/B/Y/T","Asfalto","-","-","-","-","-","-","-","-","-","-","-","-","-","-","-","PD1983-0173",0,0,0,"PD1983-0173","","","","AP-0","Classe I","-","-","-","-","-","-","-","-","-","-","-","","-"]
["SNUN","MG0055","UNAÍ","UNAÍ","MG","16° 21' 14'' S","46° 55' 37'' W","609 m","VFR Diurno"," 17/35","1100 m","30 m","PCN 10/F/C/X/U","Asfalto","-","-","-","-","-","-","-","-","-","-","-","-","-","-","-",0,0,0,0,"","","","","AP-0","Classe I","-","-","-","-","-","-","-","-","Interditado","-","-","","Interdição noticiada por meio do Ofício nº 149/2013/SIA/ANAC"]
["SNUT","BA0017","UTINGA","UTINGA","BA","12° 6' 20'' S","41° 4' 28'' W","598 m","VFR Diurno"," 06/24","1420 m","20 m","PCN 8/F/C/Y/U","Asfalto","-","-","-","-","-","-","-","-","-","-","-","-","-","-","-","PA2016-0458",0,0,0,"PA2016-0458","","","","AP-0","Classe I","-","-","-","-","-","-","-","-","Interditado","PA2020-3494","PA2020-3494","","-"]
["SNVB","BA0008","VALENÇA","VALENÇA","BA","13° 17' 47'' S","38° 59' 33'' W","5 m","VFR Diurno/Noturno"," 04/22","1800 m","30 m","PCN 55/F/B/X/U","Asfalto","-","-","-","-","-","-","-","-","-","-","-","-","-","-","-","PA2015-3090",0,0,0,"PA2015-3090","","","","AP-1","Classe I","3ª","4C","NINST",7,"-","PA2016-0908 / PA2018-0389 / PA2018-0390","-","PA2016-0908 / PA2018-0389 / PA2018-0390","-","-","-","","-"]
["SNVC","MG0074","VIÇOSA","VIÇOSA","MG","20° 44' 41'' S","42° 50' 31'' W","659 m","VFR Diurno"," 17/35","900 m","30 m","5000 kg / 0,5 MPa","Asfalto","-","-","-","-","-","-","-","-","-","-","-","-","-","-","-",0,0,0,0,"","","","","AP-0","Classe I","-","-","-","-","-","-","-","-","-","-","-","","-"]
["SNVD","BA0050","SANTA MARIA DA VITÓRIA","SANTA MARIA DA VITÓRIA","BA","13° 24' 17'' S","44° 13' 23'' W","465 m","VFR Diurno"," 10/28","1200 m","30 m","PCN 8/F/C/Y/U","Asfalto","-","-","-","-","-","-","-","-","-","-","-","-","-","-","-","PA2014-1706",0,0,0,"PA2014-1706","","","","AP-0","Classe I","-","-","-","-","-","-","-","-","-","-","-","","-"]
["SNVI","MG0035","MELLO VIANA","TRÊS CORAÇÕES","MG","21° 47' 21'' S","45° 16' 5'' W","976 m","VFR Diurno"," 04/22","1400 m","23 m","PCN 8/F/C/Y/U","Asfalto","-","-","-","-","-","-","-","-","-","-","-","-","-","-","-","PA2019-2431",0,0,0,"PA2019-2431","","","","AP-0","Classe I","-","-","-","-","-","-","-","-","-","-","-","","-"]
["SNVS","PA0015","BREVES","BREVES","PA","1° 38' 11'' S","50° 26' 36'' W","30 m","VFR Diurno"," 07/25","1600 m","30 m","PCN 27/F/B/X/T","Asfalto","-","-","-","-","-","-","-","-","-","-","-","-","-","-","-","PA2016-0724",0,0,0,"PA2016-0724","","","","AP-1","Classe I","4ª","-","-","-","-","-","-","-","-","-","-","X","-"]
["SNWC","CE0011","CAMOCIM","CAMOCIM","CE","2° 53' 45'' S","40° 51' 32'' W","14 m","VFR Diurno/Noturno"," 14/32","1200 m","30 m","PCN 14/F/B/Y/U","Asfalto","-","-","-","-","-","-","-","-","-","-","-","-","-","-","-","PA2020-1190",0,0,0,"PA2020-1190","","","","AP-0","Classe I","-","-","-","-","-","-","-","-","-","-","-","","-"]
["SNWS","CE0005","CRATEÚS","CRATEÚS","CE","5° 12' 40'' S","40° 42' 15'' W","315 m","VFR Diurno/Noturno"," 08/26","1500 m","30 m","PCN 12/F/C/Y/U","Asfalto","-","-","-","-","-","-","-","-","-","-","-","-","-","-","-","PA2020-3477",0,0,0,"PA2020-3477","","","","AP-1","Classe I","-","-","-","-","-","-","-","-","-","-","-","","-"]
["SNXB","MG0025","CAXAMBU","CAXAMBU","MG","21° 55' 3'' S","44° 58' 10'' W","865 m","VFR Diurno/Noturno"," 09/27","1500 m","30 m","PCN 8/F/C/X/U","Asfalto","-","-","-","-","-","-","-","-","-","-","-","-","-","-","-","PA2020-1077",0,0,0,"PA2020-1077","","","","AP-0","Classe I","-","-","-","-","-","-","-","-","-","-","-","","-"]
["SNXQ","BA0018","XIQUE-XIQUE","XIQUE-XIQUE","BA","10° 50' 3'' S","42° 41' 0'' W","427 m","VFR Diurno"," 13/31","1420 m","20 m","PCN 8/F/C/Y/U","Asfalto","-","-","-","-","-","-","-","-","-","-","-","-","-","-","-","PA2014-2207",0,0,0,"PA2014-2207","","","","AP-0","Classe I","-","-","-","-","-","-","-","-","-","-","-","","-"]
["SNYA","PA0024","ALMEIRIM","ALMEIRIM","PA","1° 28' 45'' S","52° 34' 41'' W","178 m","VFR Diurno"," 06/24","1200 m","30 m","PCN 7/F/B/Y/U","Piçarra","-","-","-","-","-","-","-","-","-","-","-","-","-","-","-","PA2015-0560",0,0,0,"PA2015-0560","","","","AP-1","Classe I","-","-","-","-","-","-","-","-","-","-","-","X","-"]
["SNYB","MG0047","TITO TEIXEIRA","ITUIUTABA","MG","19° 0' 7'' S","49° 29' 14'' W","605 m","VFR Diurno"," 03/21","1200 m","30 m","PCN 8/F/B/X/U","Asfalto","-","-","-","-","-","-","-","-","-","-","-","-","-","-","-",0,0,0,0,"","","","","AP-0","Classe I","-","-","-","-","-","-","-","-","-","-","-","","-"]
["SNYE","MA0004","PINHEIRO","PINHEIRO","MA","2° 28' 39'' S","45° 6' 18'' W","20 m","VFR Diurno"," 09/27","1740 m","30 m","PCN 29/F/C/X/T","Asfalto","-","-","-","-","-","-","-","-","-","-","-","-","-","-","-","PA2020-0706",0,0,0,"PA2020-0706","","","","AP-0","Classe I","-","-","-","-","-","-","-","-","Interditado","PA2020-1936","PA2020-1936","X","-"]
["SNYT","BA0014","ITUAÇU","ITUAÇU","BA","13° 49' 43'' S","41° 18' 8'' W","535 m","VFR Diurno"," 03/21","1500 m","30 m","PCN 10/F/B/Y/U","Asfalto","-","-","-","-","-","-","-","-","-","-","-","-","-","-","-","PA2014-2364",0,0,0,"PA2014-2364","","","","AP-0","Classe I","-","-","-","-","-","-","-","-","Interditado","PA2020-3544","PA2020-3544","","-"]
["SNYU","MG0014","ITURAMA","ITURAMA","MG","19° 43' 2'' S","50° 13' 13'' W","475 m","VFR Diurno/Noturno"," 18/36","1550 m","30 m","PCN 10/F/A/Y/T","Asfalto","-","-","-","-","-","-","-","-","-","-","-","-","-","-","-","PA2020-2411",0,0,0,"PA2020-2411","","","","AP-0","Classe I","-","-","-","-","-","-","-","-","-","-","-","","-"]
["SNZA","MG0038","POUSO ALEGRE","POUSO ALEGRE","MG","22° 17' 20'' S","45° 55' 10'' W","885 m","VFR Diurno"," 01/19","1220 m","30 m","PCN 7/F/B/Y/U","Asfalto","-","-","-","-","-","-","-","-","-","-","-","-","-","-","-","PA2020-3470",0,0,0,"PA2020-3470","","","","AP-0","Classe I","3ª","-","-","-","-","-","-","-","-","-","-","","-"]
["SNZR","MG0026","PEDRO RABELO DE SOUZA","PARACATU","MG","17° 14' 35'' S","46° 52' 53'' W","730 m","VFR Diurno"," 11/29","1500 m","30 m","PCN 11/F/C/Y/T","Asfalto","-","-","-","-","-","-","-","-","-","-","-","-","-","-","-","PA2018-3129",0,0,0,"PA2018-3129","","","","AP-0","Classe I","4ª","-","-","-","-","-","-","-","-","-","-","","-"]
["SNZW","BA0063","ITUBERÁ","ITUBERÁ","BA","13° 43' 54'' S","39° 8' 26'' W","7 m","VFR Diurno"," 10/28","850 m","20 m","PCN 6/F/B/Y/U","Cascalho","-","-","-","-","-","-","-","-","-","-","-","-","-","-","-","PA2015-2105",0,0,0,"PA2015-2105","","","","AP-0","Classe I","-","-","-","-","-","-","-","-","-","-","-","","-"]
["SSAB","PR0024","MOISÉS LUPION","IBAITI","PR","23° 45' 47'' S","50° 15' 53'' W","600 m","VFR Diurno"," 05/23","1200 m","18 m","5700 kg / 0,5 MPa","Asfalto","-","-","-","-","-","-","-","-","-","-","-","-","-","-","-","PA2017-2711",0,0,0,"PA2017-2711","","","","AP-0","Classe I","-","-","-","-","-","-","-","-","-","-","-","","-"]
["SSAE","RS0040","ARROIO GRANDE","ARROIO GRANDE","RS","32° 13' 45'' S","53° 3' 21'' W","49 m","VFR Diurno"," 06/24","1000 m","18 m","5700 kg / 0,5 MPa","Terra","-","-","-","-","-","-","-","-","-","-","-","-","-","-","-","PA2018-2952",0,0,0,"PA2018-2952","","","","AP-0","Classe I","-","-","-","-","-","-","-","-","-","-","-","","-"]
["SSAK","RS0048","CARLOS RUHL","CRUZ ALTA","RS","28° 39' 31'' S","53° 36' 41'' W","481 m","VFR Diurno"," 08/26","800 m","42 m","2500 kg / 0,5 MPa","Grama"," 17/35","650 m","46 m","2500 kg / 0,5 MPa","Grama","-","-","-","-","-","-","-","-","-","-","PA2020-2975",0,0,0,"PA2020-2975","","","","AP-0","Classe I","-","-","-","-","-","-","-","-","-","-","-","","-"]
["SSAN","PR0032","JOÃO GALDINO","ANDIRÁ","PR","23° 1' 37'' S","50° 13' 42'' W","490 m","VFR Diurno"," 09/27","1000 m","23 m","5600 kg / 0,5 MPa","Asfalto","-","-","-","-","-","-","-","-","-","-","-","-","-","-","-","PA2017-3631",0,0,0,"PA2017-3631","","","","AP-0","Classe I","-","-","-","-","-","-","-","-","-","-","-","","-"]
["SSAP","PR0014","CAPITÃO JOÃO BUSSE","APUCARANA","PR","23° 36' 44'' S","51° 23' 6'' W","800 m","VFR Diurno/Noturno"," 10/28","1400 m","30 m","PCN 9/F/C/Y/U","Asfalto","-","-","-","-","-","-","-","-","-","-","-","-","-","-","-","PA2020-1193",0,0,0,"PA2020-1193","","","","AP-0","Classe I","4ª","-","-","-","-","-","-","-","-","-","-","","-"]
["SSAQ","RS0036","AEROCLUBE DE PASSO FUNDO","PASSO FUNDO","RS","28° 15' 2'' S","52° 31' 0'' W","600 m","VFR Diurno"," 15/33","1080 m","35 m","5700 kg / 0,5 MPa","Grama"," 17/35","940 m","18 m","5700 kg / 0,5 MPa","Grama","-","-","-","-","-","-","-","-","-","-","PA2018-0468",0,0,0,"PA2018-0468","","","","AP-0","Classe I","-","-","-","-","-","-","-","-","-","-","-","","-"]
["SSBL","SC0019","BLUMENAU","BLUMENAU","SC","26° 49' 58'' S","49° 5' 37'' W","18 m","VFR Diurno"," 18/36","1080 m","30 m","PCN 17/F/C/Y/U","Asfalto","-","-","-","-","-","-","-","-","-","-","-","-","-","-","-","PA2018-2330",0,0,0,"PA2018-2330","","","","AP-0","Classe I","4ª","-","-","-","-","-","-","-","-","-","-","","-"]
["SSBN","RS0002","BELÉM NOVO","PORTO ALEGRE","RS","30° 11' 21'' S","51° 10' 57'' W","5 m","VFR Diurno"," 09/27","1103 m","23 m","5700 kg / 0,5 MPa","Asfalto","-","-","-","-","-","-","-","-","-","-","-","-","-","-","-","PA2019-2615",0,0,0,"PA2019-2615","","","","AP-0","Classe I","-","-","-","-","-","-","-","-","-","-","-","","-"]
["SSBR","PR0022","YARA","BANDEIRANTES","PR","23° 4' 22'' S","50° 25' 23'' W","402 m","VFR Diurno"," 14/32","1300 m","100 m","PCN 8/F/C/Y/U","Cascalho","-","-","-","-","-","-","-","-","-","-","-","-","-","-","-","PD1957-0017",0,0,0,"PD1957-0017","","","","AP-0","Classe I","-","-","-","-","-","-","-","-","-","-","-","","-"]
["SSBV","MS0011","BELA VISTA","BELA VISTA","MS","22° 4' 56'' S","56° 32' 18'' W","235 m","VFR Diurno"," 03/21","1300 m","23 m","PCN 10/F/B/Y/T","Terra","-","-","-","-","-","-","-","-","-","-","-","-","-","-","-","PD1999-0028",0,0,0,"PD1999-0028","","","","AP-0","Classe I","-","-","-","-","-","-","-","-","Interditado","-","-","","Interdição noticiada por meio do Ofício nº 149/2013/SIA/ANAC"]
["SSCB","SP0044","MUNICIPAL DE CASA BRANCA","CASA BRANCA","SP","21° 47' 17'' S","47° 3' 20'' W","712 m","VFR Diurno"," 09/27","1154 m","20 m","5700 kg / 0,5 MPa","Terra","-","-","-","-","-","-","-","-","-","-","-","-","-","-","-","PA2017-2128",0,0,0,"PA2017-2128","","","","AP-0","Classe I","-","-","-","-","-","-","-","-","-","-","-","","-"]
["SSCD","MS0007","CHAPADÃO DO SUL","CHAPADÃO DO SUL","MS","18° 50' 21'' S","52° 29' 17'' W","817 m","VFR Diurno/Noturno"," 05/23","2000 m","30 m","PCN 30/F/C/X/T","Asfalto","-","-","-","-","-","-","-","-","-","-","-","-","-","-","-","PA2018-2968",0,0,0,"PA2018-2968","","","","AP-0","Classe I","-","-","-","-","-","-","-","-","-","-","-","","-"]
["SSCI","MS0012","COXIM","COXIM","MS","18° 28' 53'' S","54° 42' 57'' W","292 m","VFR Diurno"," 02/20","1300 m","23 m","PCN 13/F/A/X/T","Asfalto","-","-","-","-","-","-","-","-","-","-","-","-","-","-","-","PD2003-0667",0,0,0,"PD2003-0667","","","","AP-0","Classe I","-","-","-","-","-","-","-","-","Interditado","PA2019-3407","PA2019-3407","","-"]
["SSCK","SC0010","OLAVO CECCO RIGON","CONCÓRDIA","SC","27° 10' 50'' S","52° 3' 4'' W","750 m","VFR Diurno/Noturno"," 14/32","1480 m","18 m","PCN 12/F/B/Y/U","Asfalto","-","-","-","-","-","-","-","-","-","-","-","-","-","-","-","PA2013-3070",0,0,0,"PA2013-3070","","","","AP-0","Classe I","4ª","-","-","-","-","-","-","-","-","-","-","","-"]
["SNPU","MG0073","PARAGUAÇU","PARAGUAÇU","MG","21° 33' 41'' S","45° 45' 17'' W","898 m","VFR Diurno"," 07/25","900 m","30 m","PCN 8/F/C/Y/U","Terra","-","-","-","-","-","-","-","-","-","-","-","-","-","-","-","PA2017-1296",0,0,0,"PA2017-1296","","","","AP-0","Classe I","-","-","-","-","-","-","-","-","-","-","-","","-"]
["SSCN","RS0019","CANELA","CANELA","RS","29° 22' 14'' S","50° 49' 56'' W","837 m","VFR Diurno/Noturno"," 06/24","1260 m","18 m","PCN 21/F/B/Y/T","Asfalto","-","-","-","-","-","-","-","-","-","-","-","-","-","-","-","PA2019-2752",0,0,0,"PA2019-2752","","","","AP-0","Classe I","4ª","-","-","-","-","-","-","-","-","-","-","","-"]
["SSCP","PR0015","FRANCISCO LACERDA JÚNIOR","CORNÉLIO PROCÓPIO","PR","23° 9' 9'' S","50° 36' 9'' W","567 m","VFR Diurno"," 06/24","1400 m","30 m","PCN 8/F/C/Y/U","Asfalto","-","-","-","-","-","-","-","-","-","-","-","-","-","-","-","PA2020-1192",0,0,0,"PA2020-1192","","","","AP-1","Classe I","4ª","-","-","-","-","-","-","-","-","-","-","","-"]
["SSCR","PR0016","RUBEN BERTA","MARECHAL CÂNDIDO RONDON","PR","24° 30' 46'' S","54° 3' 14'' W","525 m","VFR Diurno"," 01/19","1400 m","30 m","PCN 10/F/C/Y/U","Asfalto","-","-","-","-","-","-","-","-","-","-","-","-","-","-","-","PA2018-2358",0,0,0,"PA2018-2358","","","","AP-0","Classe I","4ª","-","-","-","-","-","-","-","-","-","-","","-"]
["SSCT","PR0025","ENGENHEIRO GASTÃO DE MESQUITA FILHO","CIANORTE","PR","23° 41' 30'' S","52° 38' 32'' W","539 m","VFR Diurno/Noturno"," 04/22","1200 m","23 m","5700 kg / 0,62 MPa","Asfalto","-","-","-","-","-","-","-","-","-","-","-","-","-","-","-","PA2016-0114",0,0,0,"PA2016-0114","","","","AP-1","Classe I","4ª","-","-","-","-","-","-","-","-","-","-","","-"]
["SSEE","RS0054","REGIONAL DO VALE DO TAQUARI","ESTRELA","RS","29° 27' 12'' S","51° 56' 3'' W","32 m","VFR Diurno"," 06/24","570 m","18 m","4000 kg / 0,5 MPa","Grama","-","-","-","-","-","-","-","-","-","-","-","-","-","-","-","PA2017-3024",0,0,0,{"$f":"IF(AD389<>0,HYPERLINK(\"http://pergamum.anac.gov.br/arquivos/\" & AD389 & \".pdf\",AD389),\"\")","v":"PA2017-3024"},"","","","AP-0","Classe I","-","-","-","-","-","-",{"$f":"IF(AR389<>0,HYPERLINK(\"http://pergamum.anac.gov.br/arquivos/\" & AR389 & \".pdf\",AR389),\"\")","v":"-"},"-","-","-",{"$f":"IF(AW389<>0,HYPERLINK(\"http://pergamum.anac.gov.br/arquivos/\" & AW389 & \".pdf\",AW389),\"\")","v":"-"},"","-"]
["SSEP","RS0031","SÃO SEPÉ","SÃO SEPÉ","RS","30° 10' 56'' S","53° 34' 46'' W","153 m","VFR Diurno"," 14/32","1140 m","18 m","5700 kg / 0,62 MPa","Terra","-","-","-","-","-","-","-","-","-","-","-","-","-","-","-","PD1985-0073",0,0,0,"PD1985-0073","","","","AP-0","Classe I","-","-","-","-","-","-","-","-","-","-","-","","-"]
["SSER","RS0018","ERECHIM","ERECHIM","RS","27° 39' 36'' S","52° 16' 34'' W","761 m","VFR Diurno/Noturno"," 14/32","1280 m","30 m","PCN 11/F/B/X/U","Asfalto","-","-","-","-","-","-","-","-","-","-","-","-","-","-","-","PA2018-2449",0,0,0,"PA2018-2449","","","","AP-0","Classe I","-","-","-","-","-","-","-","-","-","-","-","","-"]
["SSEZ","RS0050","ESPUMOSO","ESPUMOSO","RS","28° 44' 17'' S","52° 51' 20'' W","390 m","VFR Diurno"," 08/26","720 m","18 m","2000 kg / 0,5 MPa","Grama","-","-","-","-","-","-","-","-","-","-","-","-","-","-","-","PA2015-2869",0,0,0,"PA2015-2869","","","","AP-0","Classe I","-","-","-","-","-","-","-","-","-","-","-","","-"]
["SSFB","PR0021","PAULO ABDALA","FRANCISCO BELTRÃO","PR","26° 3' 32'' S","53° 3' 48'' W","640 m","VFR Diurno/Noturno"," 07/25","1340 m","30 m","PCN 11/F/C/Y/U","Asfalto","-","-","-","-","-","-","-","-","-","-","-","-","-","-","-","PA2018-2357",0,0,0,"PA2018-2357","","","","AP-1","Classe I","4ª","-","-","-","-","-","-","-","-","-","-","","-"]
["SSFL","PI0006","JOÃO PEREIRA DOS SANTOS FILHO","FRONTEIRAS","PI","7° 6' 0'' S","40° 37' 42'' W","448 m","VFR Diurno/Noturno"," 11/29","1500 m","25 m","PCN 7/F/A/Y/T","Asfalto","-","-","-","-","-","-","-","-","-","-","-","-","-","-","-","PA2019-1470",0,0,0,"PA2019-1470","","","","AP-0","Classe I","-","-","-","-","-","-","-","-","Interditado","PA2019-2706","PA2019-2706","","-"]
["SSGA","RS0020","GARIBALDI","GARIBALDI","RS","29° 16' 6'' S","51° 31' 56'' W","680 m","VFR Diurno"," 15/33","1200 m","30 m","PCN 8/F/C/Y/U","Asfalto","-","-","-","-","-","-","-","-","-","-","-","-","-","-","-","PA2020-1563",0,0,0,"PA2020-1563","","","","AP-0","Classe I","-","-","-","-","-","-","-","-","-","-","-","","-"]
["SSGB","PR0035","MUNICIPAL DE GUARATUBA","GUARATUBA","PR","25° 52' 50'' S","48° 36' 44'' W","15 m","VFR Diurno"," 02/20","1000 m","18 m","2500 kg / 0,5 MPa","Asfalto","-","-","-","-","-","-","-","-","-","-","-","-","-","-","-","PA2020-3250",0,0,0,"PA2020-3250","","","","AP-0","Classe I","4ª","-","-","-","-","-","-","-","-","-","-","","-"]
["SSGW","PR0037","MANOEL RIBAS","GOIOERÊ","PR","24° 13' 11'' S","53° 2' 38'' W","491 m","VFR Diurno"," 05/23","799 m","18 m","PCN 8/F/B/Y/U","Asfalto","-","-","-","-","-","-","-","-","-","-","-","-","-","-","-","PA2019-1478",0,0,0,"PA2019-1478","","","","AP-0","Classe I","-","-","-","-","-","-","-","-","-","-","-","","-"]
["SSGY","PR0023","GUAÍRA","GUAÍRA","PR","24° 4' 47'' S","54° 11' 17'' W","271 m","VFR Diurno"," 07/25","1300 m","30 m","PCN 13/F/C/Y/U","Asfalto","-","-","-","-","-","-","-","-","-","-","-","-","-","-","-","PA2014-1876",0,0,0,"PA2014-1876","","","","AP-1","Classe I","4ª","-","-","-","-","-","-","-","-","-","-","","-"]
["SSHZ","RS0037","WALTER BÜNDCHEN","HORIZONTINA","RS","27° 38' 18'' S","54° 20' 20'' W","310 m","VFR Diurno"," 16/34","1050 m","18 m","PCN 6/F/C/Y/U","Asfalto","-","-","-","-","-","-","-","-","-","-","-","-","-","-","-","PA2019-1419",0,0,0,"PA2019-1419","","","","AP-0","Classe I","-","-","-","-","-","-","-","-","-","-","-","","-"]
["SSIE","MS0002","TERUEL IPANEMA ESTÂNCIA","CAMPO GRANDE","MS","20° 36' 14'' S","54° 35' 43'' W","528 m","VFR Diurno"," 06/24","1500 m","30 m","5700 kg / 0,5 MPa","Cascalho","-","-","-","-","-","-","-","-","-","-","-","-","-","-","-","PA2020-1075",0,0,0,"PA2020-1075","","","","AP-0","Classe I","-","-","-","-","-","-","-","-","-","-","-","","-"]
["SSIJ","RS0032","IJUÍ","IJUÍ","RS","28° 22' 7'' S","53° 50' 47'' W","365 m","VFR Diurno/Noturno"," 18/36","1280 m","23 m","PCN 8/F/C/Y/U","Asfalto","-","-","-","-","-","-","-","-","-","-","-","-","-","-","-","PA2020-1835",0,0,0,"PA2020-1835","","","","AP-0","Classe I","-","-","-","-","-","-","-","-","-","-","-","","-"]
["SSIQ","RS0045","ITAQUI","ITAQUI","RS","29° 10' 19'' S","56° 32' 18'' W","84 m","VFR Diurno"," 15/33","966 m","23 m","1800 kg / 0,5 MPa","Grama","-","-","-","-","-","-","-","-","-","-","-","-","-","-","-","PA2020-1288",0,0,0,"PA2020-1288","","","","AP-0","Classe I","-","-","-","-","-","-","-","-","Interditado","PA2019-3520","PA2019-3520","","-"]
["SSIR","RS0049","IBIRUBÁ","IBIRUBÁ","RS","28° 36' 15'' S","53° 4' 43'' W","457 m","VFR Diurno"," 11/29","760 m","18 m","5000 kg / 0,5 MPa","Grama","-","-","-","-","-","-","-","-","-","-","-","-","-","-","-","PA2016-2358",0,0,0,"PA2016-2358","","","","AP-0","Classe I","-","-","-","-","-","-","-","-","-","-","-","","-"]
["SSJA","SC0014","SANTA TEREZINHA","JOAÇABA","SC","27° 10' 22'' S","51° 33' 6'' W","776 m","VFR Diurno/Noturno"," 15/33","1260 m","18 m","PCN 10/F/C/Y/U","Asfalto","-","-","-","-","-","-","-","-","-","-","-","-","-","-","-","PA2018-2444",0,0,0,"PA2018-2444","","","","AP-0","Classe I","4ª","-","-","-","-","-","-","-","-","-","-","","-"]
["SSJI","MS0019","JARDIM","JARDIM","MS","21° 29' 34'' S","56° 9' 10'' W","321 m","VFR Diurno"," 18/36","950 m","18 m","PCN 8/F/C/Y/U","Asfalto","-","-","-","-","-","-","-","-","-","-","-","-","-","-","-","PD1999-0246",0,0,0,"PD1999-0246","","","","AP-0","Classe I","-","-","-","-","-","-","-","-","-","-","-","","-"]
["SSJK","RS0028","JÚLIO DE CASTILHOS","JÚLIO DE CASTILHOS","RS","29° 9' 11'' S","53° 44' 36'' W","498 m","VFR Diurno"," 12/30","1190 m","30 m","PCN 8/F/C/Y/U","Grama","-","-","-","-","-","-","-","-","-","-","-","-","-","-","-","PA2020-1301",0,0,0,"PA2020-1301","","","","AP-0","Classe I","-","-","-","-","-","-","-","-","Interditado","PA2020-1520","PA2020-1520","","-"]
["SSKG","MS0003","ESTÂNCIA SANTA MARIA","CAMPO GRANDE","MS","20° 30' 20'' S","54° 31' 29'' W","618 m","VFR Diurno"," 06/24","1500 m","23 m","5600 kg / 0,5 MPa","Asfalto","-","-","-","-","-","-","-","-","-","-","-","-","-","-","-","PA2020-1390",0,0,0,"PA2020-1390","","","","AP-0","Classe I","4ª","-","-","-","-","-","-","-","-","-","-","","-"]
["SSKK","RS0052","CAPÃO DA CANOA","CAPÃO DA CANOA","RS","29° 45' 49'' S","50° 2' 13'' W","10 m","VFR Diurno"," 08/26","700 m","27 m","2500 kg / 0,5 MPa","Grama","-","-","-","-","-","-","-","-","-","-","-","-","-","-","-","PA2020-0979",0,0,0,"PA2020-0979","","","","AP-0","Classe I","-","-","-","-","-","-","-","-","-","-","-","","Proibidas operações de pouso na RWY 08"]
["SSKM","PR0017","CAMPO MOURÃO","CAMPO MOURÃO","PR","24° 0' 9'' S","52° 21' 25'' W","574 m","VFR Diurno/Noturno"," 02/20","1370 m","30 m","PCN 14/F/C/Y/U","Asfalto","-","-","-","-","-","-","-","-","-","-","-","-","-","-","-","PA2020-0578",0,0,0,"PA2020-0578","","","","AP-1","Classe I","4ª","-","-","-","-","-","-","-","-","-","-","","-"]
["SSKS","RS0039","BRIGADEIRO NERO MOURA","CACHOEIRA DO SUL","RS","30° 0' 8'' S","52° 56' 25'' W","77 m","VFR Diurno"," 12/30","1020 m","18 m","PCN 10/F/B/X/T","Asfalto","-","-","-","-","-","-","-","-","-","-","-","-","-","-","-","PA2020-3744",0,0,0,"PA2020-3744","","","","AP-0","Classe I","-","-","-","-","-","-","-","-","-","-","-","","-"]
["SSKU","SC0016","LAURO ANTÔNIO DA COSTA","CURITIBANOS","SC","27° 17' 14'' S","50° 36' 14'' W","978 m","VFR Diurno/Noturno"," 11/29","1400 m","30 m","PCN 22/F/A/Y/T","Asfalto","-","-","-","-","-","-","-","-","-","-","-","-","-","-","-","PA2020-1296",0,0,0,"PA2020-1296","","","","AP-0","Classe I","-","-","-","-","-","-","-","-","-","-","-","","-"]
["SSKW","RO0004","CACOAL","CACOAL","RO","11° 29' 44'' S","61° 27' 3'' W","249 m","VFR Diurno/Noturno"," 16/34","2100 m","45 m","PCN 31/F/A/X/T","Asfalto","-","-","-","-","-","-","-","-","-","-","-","-","-","-","-","PA2020-1567",0,0,0,"PA2020-1567","","","","AP-1","Classe I","3ª","3C","NINST",8,"-","PA2016-0908","-","PA2016-0908","-","-","-","X","-"]
["SSKZ","RS0009","CARAZINHO","CARAZINHO","RS","28° 19' 17'' S","52° 48' 56'' W","565 m","VFR Diurno/Noturno"," 11/29","1560 m","30 m","PCN 12/F/B/Y/T","Asfalto","-","-","-","-","-","-","-","-","-","-","-","-","-","-","-","PA2018-3261",0,0,0,"PA2018-3261","","","","AP-0","Classe I","4ª","-","-","-","-","-","-","-","-","-","-","","-"]
["SSLG","RS0021","SÃO LUIZ GONZAGA","SÃO LUIZ GONZAGA","RS","28° 22' 35'' S","55° 2' 15'' W","200 m","VFR Diurno"," 06/24","1200 m","60 m","PCN 8/F/C/Y/U","Saibro","-","-","-","-","-","-","-","-","-","-","-","-","-","-","-",0,0,0,0,"","","","","AP-0","Classe I","-","-","-","-","-","-","-","-","-","-","-","","-"]
["SSLN","SC0018","LONTRAS","LONTRAS","SC","27° 9' 35'' S","49° 32' 34'' W","334 m","VFR Diurno"," 07/25","1100 m","23 m","PCN 10/F/C/Y/U","Asfalto","-","-","-","-","-","-","-","-","-","-","-","-","-","-","-","PA2020-1081",0,0,0,"PA2020-1081","","","","AP-0","Classe I","-","-","-","-","-","-","-","-","-","-","-","","-"]
["SSLO","PR0031","ATTILLIO ACCORSI","LOANDA","PR","22° 55' 4'' S","53° 8' 59'' W","470 m","VFR Diurno"," 05/23","1100 m","23 m","PCN 14/F/C/Y/U","Asfalto","-","-","-","-","-","-","-","-","-","-","-","-","-","-","-","PD1980-0013",0,0,0,"PD1980-0013","","","","AP-0","Classe I","4ª","-","-","-","-","-","-","-","Interditado","PA2015-2631","PA2015-2631","","-"]
["SSLS","BA0035","RUY BARBOSA","RUY BARBOSA","BA","12° 16' 17'' S","40° 31' 50'' W","404 m","VFR Diurno"," 13/31","1268 m","22 m","5700 kg / 0,6 MPa","Asfalto","-","-","-","-","-","-","-","-","-","-","-","-","-","-","-","PA2013-3071",0,0,0,"PA2013-3071","","","","AP-0","Classe I","-","-","-","-","-","-","-","-","Interditado","PA2020-3493","PA2020-3493","","-"]
["SSLT","RS0022","GAUDÊNCIO MACHADO RAMOS","ALEGRETE","RS","29° 48' 45'' S","55° 53' 36'' W","140 m","VFR Diurno"," 14/32","1200 m","18 m","PCN 6/F/B/X/T","Asfalto","-","-","-","-","-","-","-","-","-","-","-","-","-","-","-","PA2020-2417",0,0,0,"PA2020-2417","","","","AP-0","Classe I","4ª","-","-","-","-","-","-","-","Proibição de operações de pouso de aeronaves de asa fixa com motor à reação (turbojato).","PA2018-2675","PA2018-2675","","-"]
["SSMJ","MS0020","MARACAJU","MARACAJU","MS","21° 38' 2'' S","55° 8' 42'' W","390 m","VFR Diurno"," 01/19","800 m","30 m","5600 kg / 0,5 MPa","Grama","-","-","-","-","-","-","-","-","-","-","-","-","-","-","-","PA2020-1196",0,0,0,"PA2020-1196","","","","AP-0","Classe I","-","-","-","-","-","-","-","-","-","-","-","","-"]
["SSMR","PR0026","MANOEL RIBAS","MANOEL RIBAS","PR","24° 31' 46'' S","51° 39' 6'' W","886 m","VFR Diurno"," 17/35","1200 m","30 m","PCN 12/F/C/Y/U","Asfalto","-","-","-","-","-","-","-","-","-","-","-","-","-","-","-","PA2017-1810",0,0,0,"PA2017-1810","","","","AP-0","Classe I","-","-","-","-","-","-","-","-","Interditado","PA2020-1480","PA2020-1480","","-"]
["SSMT","RS0044","MOSTARDAS","MOSTARDAS","RS","31° 6' 15'' S","50° 54' 44'' W","18 m","VFR Diurno"," 05/23","975 m","18 m","5700 kg / 0,5 MPa","Asfalto","-","-","-","-","-","-","-","-","-","-","-","-","-","-","-","PD1971-0009",0,0,0,"PD1971-0009","","","","AP-0","Classe I","-","-","-","-","-","-","-","-","Interditado","PA2019-2366","PA2019-2366","","-"]
["SSNB","MS0015","ARIOSTO DA RIVA","NAVIRAÍ","MS","23° 2' 29'' S","54° 11' 6'' W","405 m","VFR Diurno"," 09/27","1200 m","23 m","PCN 10/F/B/Y/T","Asfalto","-","-","-","-","-","-","-","-","-","-","-","-","-","-","-","PD1997-0377",0,0,0,"PD1997-0377","","","","AP-0","Classe I","-","-","-","-","-","-","-","-","-","-","-","","-"]
["SSNG","RS0046","MONTENEGRO","MONTENEGRO","RS","29° 43' 11'' S","51° 29' 20'' W","24 m","VFR Diurno"," 13/31","920 m","23 m","5700 kg / 0,5 MPa","Grama","-","-","-","-","-","-","-","-","-","-","13  31","quadrado","18 m x18 m","3 t","Grama","PA2016-1774",0,0,0,"PA2016-1774","","","","AP-0","Classe I","-","-","-","-","-","-","-","-","-","-","-","","-"]
["SSNH","RS0023","NOVO HAMBURGO","NOVO HAMBURGO","RS","29° 41' 57'' S","51° 4' 55'' W","15 m","VFR Diurno"," 02/20","870 m","30 m","5700 kg / 0,5 MPa","Grama","-","-","-","-","-","-","-","-","-","-","-","-","-","-","-","PA2020-1592",0,0,0,"PA2020-1592","","","","AP-0","Classe I","-","-","-","-","-","-","-","-","-","-","-","","-"]
["SSNP","RS0041","NOVA PRATA","NOVA PRATA","RS","28° 48' 9'' S","51° 36' 15'' W","690 m","VFR Diurno"," 13/31","1000 m","30 m","PCN 5/F/B/Y/U","Terra","-","-","-","-","-","-","-","-","-","-","-","-","-","-","-","PD1985-0068",0,0,0,"PD1985-0068","","","","AP-0","Classe I","-","-","-","-","-","-","-","-","-","-","-","","-"]
["SSNQ","MS0016","NIOAQUE","NIOAQUE","MS","21° 11' 5'' S","55° 49' 49'' W","300 m","VFR Diurno"," 18/36","1200 m","60 m","PCN 8/F/C/Y/U","Grama","-","-","-","-","-","-","-","-","-","-","-","-","-","-","-","PD1960-0110",0,0,0,"PD1960-0110","","","","AP-0","Classe I","-","-","-","-","-","-","-","-","Interditado","PA2019-3450","PA2019-3450","","-"]
["SSOE","SC0015","HÉLIO WASUM","SÃO MIGUEL DO OESTE","SC","26° 46' 52'' S","53° 30' 12'' W","665 m","VFR Diurno/Noturno"," 17/35","1260 m","18 m","PCN 11/F/A/Y/T","Asfalto","-","-","-","-","-","-","-","-","-","-","-","-","-","-","-","PA2020-1292",0,0,0,"PA2020-1292","","","","AP-0","Classe I","4ª","-","-","-","-","-","-","-","-","-","-","","-"]
["SSOG","PR0027","ARAPONGAS","ARAPONGAS","PR","23° 21' 21'' S","51° 29' 27'' W","792 m","VFR Diurno/Noturno"," 16/34","1200 m","23 m","PCN 6/F/B/Y/U","Asfalto","-","-","-","-","-","-","-","-","-","-","-","-","-","-","-","PA2017-2398",0,0,0,"PA2017-2398","","","","AP-1","Classe I","4ª","-","-","-","-","-","-","-","-","-","-","","-"]
["SSOI","SP0043","PEDERNEIRAS","PEDERNEIRAS","SP","22° 18' 23'' S","48° 46' 26'' W","536 m","VFR Diurno"," 15/33","1165 m","25 m","5600 kg / 0,5 MPa","Terra","-","-","-","-","-","-","-","-","-","-","-","-","-","-","-","PA2014-1259",0,0,0,"PA2014-1259","","","","AP-0","Classe I","-","-","-","-","-","-","-","-","-","-","-","","-"]
["SSOL","MG0027","LAVRAS","LAVRAS","MG","21° 14' 38'' S","44° 58' 10'' W","959 m","VFR Diurno/Noturno"," 05/23","1500 m","30 m","PCN 12/F/C/Y/T","Asfalto","-","-","-","-","-","-","-","-","-","-","-","-","-","-","-","PA2011-2243",0,0,0,"PA2011-2243","","","","AP-0","Classe I","-","-","-","-","-","-","-","-","-","-","-","","-"]
["SSOS","RS0042","OSÓRIO","OSÓRIO","RS","29° 54' 8'' S","50° 14' 57'' W","17 m","VFR Diurno"," 11/29","950 m","25 m","5700 kg / 0,5 MPa","Saibro","-","-","-","-","-","-","-","-","-","-","-","-","-","-","-","PA2020-1195",0,0,0,"PA2020-1195","","","","AP-0","Classe I","-","-","-","-","-","-","-","-","-","-","-","","-"]
["SBPO","PR0018","JUVENAL LOUREIRO CARDOSO","PATO BRANCO","PR","26° 13' 2'' S","52° 41' 40'' W","823 m","VFR Diurno/Noturno e IFR Diurno/Noturno"," 07/25","1317 m","30 m","PCN 50/F/A/X/T","Asfalto","-","-","-","-","-","-","-","-","-","-","-","-","-","-","-","PA2019-0993",0,0,0,"PA2019-0993","","","","AP-1","Classe I","4ª","2C","NPA","N/A","PA2020-0857","-","PA2020-0857","-","-","-","-","","-"]
["SSPG","PR0011","SANTOS DUMONT","PARANAGUÁ","PR","25° 32' 26'' S","48° 31' 52'' W","5 m","VFR Diurno"," 06/24","1455 m","30 m","PCN 16/F/C/Y/U","Asfalto","-","-","-","-","-","-","-","-","-","-","-","-","-","-","-","PD1991-0064",0,0,0,"PD1991-0064","","","","AP-1","Classe I","4ª","-","-","-","-","-","-","-","-","-","-","","-"]
["SSPI","PR0010","EDU CHAVES","PARANAVAÍ","PR","23° 5' 24'' S","52° 29' 19'' W","474 m","VFR Diurno"," 13/31","1500 m","30 m","PCN 13/F/C/Y/U","Asfalto","-","-","-","-","-","-","-","-","-","-","-","-","-","-","-","PA2015-1832",0,0,0,"PA2015-1832","","","","AP-1","Classe I","4ª","-","-","-","-","-","-","-","Proibição de operações de pouso de aeronaves de asa fixa com motor à reação (turbojato) e proibição de operações noturnas, exceto no caso de operações de emergência médica ou de transporte de valores realizadas mediante prévia coordenação com o Operador do Aeródromo.","PA2020-0474","PA2020-0474","","-"]
["SSPL","RS0043","PALMEIRA DAS MISSÕES","PALMEIRA DAS MISSÕES","RS","27° 54' 6'' S","53° 19' 44'' W","635 m","VFR Diurno"," 05/23","1000 m","18 m","PCN 4/F/A/Y/U","Asfalto","-","-","-","-","-","-","-","-","-","-","-","-","-","-","-","PD1958-0185",0,0,0,"PD1958-0185","","","","AP-0","Classe I","-","-","-","-","-","-","-","-","-","-","-","","-"]
["SSPM","MS0013","PORTO MURTINHO","PORTO MURTINHO","MS","21° 42' 46'' S","57° 52' 45'' W","81 m","VFR Diurno"," 18/36","1300 m","30 m","PCN 15/F/B/X/T","Asfalto","-","-","-","-","-","-","-","-","-","-","-","-","-","-","-","PA2015-0655",0,0,0,"PA2015-0655","","","","AP-0","Classe I","-","-","-","-","-","-","-","-","Proibição de operações de pouso de aeronaves de asa fixa com motor à reação (turbojato).","PA2020-0077","PA2020-0077","","-"]
["SSPN","MS0010","PARANAÍBA","PARANAÍBA","MS","19° 39' 4'' S","51° 11' 58'' W","442 m","VFR Diurno"," 14/32","1320 m","23 m","PCN 12/F/A/Y/T","Asfalto","-","-","-","-","-","-","-","-","-","-","-","-","-","-","-","PA2015-2850",0,0,0,"PA2015-2850","","","","AP-0","Classe I","-","-","-","-","-","-","-","-","Proibição de operações de pouso de aeronaves de asa fixa com motor à reação (turbojato).","PA2020-0720","PA2020-0720","","-"]
["SSPS","PR0036","DIMORVAN CARRARO","PALMAS","PR","26° 28' 20'' S","51° 58' 32'' W","1100 m","VFR Diurno"," 03/21","1050 m","23 m","PCN 19/F/C/Y/U","Asfalto","-","-","-","-","-","-","-","-","-","-","-","-","-","-","-","PA2020-0983",0,0,0,"PA2020-0983","","","","AP-0","Classe I","4ª","-","-","-","-","-","-","-","-","-","-","","-"]
["SSPT","PR0028","BRASÍLIO MARQUES","PALOTINA","PR","24° 20' 36'' S","53° 49' 43'' W","373 m","VFR Diurno"," 03/21","1100 m","18 m","5700 kg / 0,5 MPa","Asfalto","-","-","-","-","-","-","-","-","-","-","-","-","-","-","-","PA2019-3554",0,0,0,"PA2019-3554","","","","AP-0","Classe I","-","-","-","-","-","-","-","-","Interditado","-","-","","Interdição noticiada por meio do Ofício nº 149/2013/SIA/ANAC"]
["SSQC","PR0029","AGUINALDO PEREIRA LIMA","SIQUEIRA CAMPOS","PR","23° 40' 28'' S","49° 49' 8'' W","705 m","VFR Diurno"," 07/25","1200 m","23 m","5700 kg / 0,5 MPa","Asfalto","-","-","-","-","-","-","-","-","-","-","-","-","-","-","-","PD1983-0010",0,0,0,"PD1983-0010","","","","AP-0","Classe I","-","-","-","-","-","-","-","-","Interditado","PA2020-1264","PA2020-1264","","-"]
["SSQP","BA0061","MONTE SANTO","MONTE SANTO","BA","10° 27' 55'' S","39° 17' 10'' W","443 m","VFR Diurno"," 17/35","1000 m","30 m","5700 kg / 0,5 MPa","Piçarra","-","-","-","-","-","-","-","-","-","-","-","-","-","-","-","PA2015-2706",0,0,0,"PA2015-2706","","","","AP-0","Classe I","-","-","-","-","-","-","-","-","-","-","-","","-"]
["SSQT","PR0013","MAJOR NEODO S. PEREIRA","CASTRO","PR","24° 48' 27'' S","49° 57' 37'' W","1010 m","VFR Diurno"," 05/23","1420 m","30 m","2500 kg / 0,5 MPa","Terra","-","-","-","-","-","-","-","-","-","-","-","-","-","-","-",0,0,0,0,"","","","","AP-0","Classe I","-","-","-","-","-","-","-","-","-","-","-","","-"]
["SSQZ","BA0033","LUÍS EDUARDO MAGALHÃES","LUÍS EDUARDO MAGALHÃES","BA","12° 6' 23'' S","45° 53' 42'' W","775 m","VFR Diurno"," 10/28","1300 m","28 m","PCN 10/F/B/Y/U","Asfalto","-","-","-","-","-","-","-","-","-","-","-","-","-","-","-","PA2015-2498",0,0,0,"PA2015-2498","","","","AP-0","Classe I","-","-","-","-","-","-","-","-","Interditado","PA2020-3546","PA2020-3546","","-"]
["SSRE","PR0030","REALEZA","REALEZA","PR","25° 48' 4'' S","53° 30' 47'' W","501 m","VFR Diurno"," 06/24","1200 m","18 m","PCN 6/F/B/Y/T","Asfalto","-","-","-","-","-","-","-","-","-","-","-","-","-","-","-","PA2013-2699",0,0,0,"PA2013-2699","","","","AP-0","Classe I","-","-","-","-","-","-","-","-","-","-","-","","-"]
["SSRF","BA0034","CASTRO ALVES","CASTRO ALVES","BA","12° 45' 57'' S","39° 27' 4'' W","261 m","VFR Diurno"," 13/31","1300 m","21 m","PCN 8/F/C/Y/U","Cascalho","-","-","-","-","-","-","-","-","-","-","-","-","-","-","-","PA2018-0664",0,0,0,"PA2018-0664","","","","AP-0","Classe I","-","-","-","-","-","-","-","-","-","-","-","","-"]
["SSRG","SP0030","AEROPORTO ESTADUAL DE REGISTRO","REGISTRO","SP","24° 31' 54'' S","47° 50' 25'' W","25 m","VFR Diurno"," 10/28","1430 m","30 m","PCN 30/F/B/X/T","Asfalto","-","-","-","-","-","-","-","-","-","-","-","-","-","-","-","PA2012-2146",0,0,0,"PA2012-2146","","","","AP-0","Classe I","-","-","-","-","-","-","-","-","-","-","-","","-"]
["SSRK","BA0015","CAMPO ALEGRE DE LOURDES","CAMPO ALEGRE DE LOURDES","BA","9° 30' 49'' S","42° 59' 45'' W","489 m","VFR Diurno"," 11/29","1500 m","21 m","PCN 8/F/B/Y/U","Asfalto","-","-","-","-","-","-","-","-","-","-","-","-","-","-","-","PA2015-3091",0,0,0,"PA2015-3091","","","","AP-0","Classe I","-","-","-","-","-","-","-","-","Interditado","PA2020-3554","PA2020-3554","","-"]
["SSRS","MA0008","BARREIRINHAS","BARREIRINHAS","MA","2° 45' 24'' S","42° 48' 16'' W","4 m","VFR Diurno"," 11/29","1500 m","30 m","PCN 71/F/A/Y/T","Asfalto","-","-","-","-","-","-","-","-","-","-","-","-","-","-","-","PA2014-0211",0,0,0,"PA2014-0211","","","","AP-0","Classe I","-","-","-","-","-","-","-","-","-","-","-","","-"]
["SSRU","RS0034","SÃO LOURENÇO DO SUL","SÃO LOURENÇO DO SUL","RS","31° 23' 5'' S","52° 1' 57'' W","27 m","VFR Diurno"," 03/21","1055 m","18 m","5700 kg / 0,5 MPa","Saibro","-","-","-","-","-","-","-","-","-","-","-","-","-","-","-","PA2020-2448","PA2020-2973",0,0,"PA2020-2448","PA2020-2973","","","AP-0","Classe I","-","-","-","-","-","-","-","-","-","-","-","","-"]
["SSRZ","RS0024","DÁRIO BRASIL CAPOANO DE OLIVEIRA","ROSÁRIO DO SUL","RS","30° 16' 39'' S","54° 55' 31'' W","102 m","VFR Diurno"," 10/28","1000 m","20 m","5700 kg / 0,5 MPa","Saibro","-","-","-","-","-","-","-","-","-","-","-","-","-","-","-","PA2020-0976",0,0,0,"PA2020-0976","","","","AP-0","Classe I","-","-","-","-","-","-","-","-","-","-","-","","-"]
["SSSB","RS0014","SÃO BORJA","SÃO BORJA","RS","28° 39' 17'' S","56° 2' 5'' W","80 m","VFR Diurno"," 07/25","1500 m","30 m","PCN 17/F/C/Y/U","Asfalto"," 14/32","700 m","18 m","5700 kg / 0,5 MPa","Grama","-","-","-","-","-","-","-","-","-","-","PA2020-1754",0,0,0,"PA2020-1754","","","","AP-1","Classe I","-","-","-","-","-","-","-","-","-","-","-","","-"]
["SSSC","RS0029","SANTA CRUZ DO SUL","SANTA CRUZ DO SUL","RS","29° 41' 3'' S","52° 24' 44'' W","199 m","VFR Diurno"," 08/26","1180 m","18 m","PCN 8/F/C/Y/U","Asfalto","-","-","-","-","-","-","-","-","-","-","-","-","-","-","-","PA2020-1024",0,0,0,"PA2020-1024","","",{"$f":"IF(AG452<>0,HYPERLINK(\"http://pergamum.anac.gov.br/arquivos/\" & AG452 & \".pdf\",AG452),\"\")","v":""},"AP-0","Classe I","-","-","-","-","-","-","-","-","-","-","-","","-"]
["SSSD","RS0017","SOLEDADE","SOLEDADE","RS","28° 51' 48'' S","52° 32' 26'' W","673 m","VFR Diurno"," 17/35","1199 m","23 m","5700 kg / 1 MPa","Grama","-","-","-","-","-","-","-","-","-","-","-","-","-","-","-","PA2020-1287",0,0,0,{"$f":"IF(AD453<>0,HYPERLINK(\"http://pergamum.anac.gov.br/arquivos/\" & AD453 & \".pdf\",AD453),\"\")","v":"PA2020-1287"},"","","","AP-0","Classe I","-","-","-","-","-","-",{"$f":"IF(AR453<>0,HYPERLINK(\"http://pergamum.anac.gov.br/arquivos/\" & AR453 & \".pdf\",AR453),\"\")","v":"-"},"-","-","-",{"$f":"IF(AW453<>0,HYPERLINK(\"http://pergamum.anac.gov.br/arquivos/\" & AW453 & \".pdf\",AW453),\"\")","v":"-"},"","-"]
["SSSG","RS0035","SÃO GABRIEL","SÃO GABRIEL","RS","30° 20' 42'' S","54° 16' 4'' W","144 m","VFR Diurno"," 05/23","1100 m","100 m","PCN 8/F/C/Y/U","Terra","-","-","-","-","-","-","-","-","-","-","-","-","-","-","-",0,0,0,0,"","","","","AP-0","Classe I","-","-","-","-","-","-","-","-","-","-","-","","-"]
["SSSS","SC0022","SÃO FRANCISCO DO SUL","SÃO FRANCISCO DO SUL","SC","26° 13' 16'' S","48° 33' 52'' W","15 m","VFR Diurno"," 18/36","700 m","35 m","2500 kg / 0,5 MPa","Grama","-","-","-","-","-","-","-","-","-","-","-","-","-","-","-","PA2020-1290",0,0,0,"PA2020-1290","","","","AP-0","Classe I","-","-","-","-","-","-","-","-","-","-","-","","-"]
["SSST","RS0015","SANTIAGO","SANTIAGO","RS","29° 12' 54'' S","54° 50' 32'' W","445 m","VFR Diurno"," 17/35","1340 m","60 m","PCN 8/F/C/Y/U","Terra","-","-","-","-","-","-","-","-","-","-","-","-","-","-","-",0,0,0,0,"","","","","AP-0","Classe I","-","-","-","-","-","-","-","-","-","-","-","","-"]
["SSSZ","PR0033","SERTANÓPOLIS","SERTANÓPOLIS","PR","23° 3' 43'' S","51° 0' 50'' W","361 m","VFR Diurno"," 10/28","1000 m","30 m","5700 kg / 0,5 MPa","Grama","-","-","-","-","-","-","-","-","-","-","-","-","-","-","-","PA2015-2705-1",0,0,0,"PA2015-2705-1","","","","AP-0","Classe I","-","-","-","-","-","-","-","-","-","-","-","","-"]
["SSTB","SC0013","TRÊS BARRAS","TRÊS BARRAS","SC","26° 7' 58'' S","50° 18' 35'' W","780 m","VFR Diurno"," 03/21","1370 m","18 m","5000 kg / 0,5 MPa","Asfalto","-","-","-","-","-","-","-","-","-","-","-","-","-","-","-","PA2020-0977",0,0,0,"PA2020-0977","","","","AP-0","Classe I","-","-","-","-","-","-","-","-","-","-","-","","-"]
["SSUM","PR0019","ORLANDO DE CARVALHO","UMUARAMA","PR","23° 47' 57'' S","53° 18' 50'' W","475 m","VFR Diurno/Noturno"," 04/22","1400 m","30 m","PCN 14/F/C/Y/U","Asfalto","-","-","-","-","-","-","-","-","-","-","-","-","-","-","-","PA2018-2722",0,0,0,"PA2018-2722","","","","AP-0","Classe I","4ª","-","-","-","-","-","-","-","-","-","-","","-"]
["SSUV","PR0034","JOSÉ CLETO","UNIÃO DA VITÓRIA","PR","26° 13' 54'' S","51° 4' 8'' W","752 m","VFR Diurno"," 16/34","1000 m","30 m","PCN 14/F/C/Y/U","Asfalto","-","-","-","-","-","-","-","-","-","-","-","-","-","-","-","PD1980-0014",0,0,0,"PD1980-0014","","","","AP-1","Classe I","4ª","-","-","-","-","-","-","-","-","-","-","","-"]
["SBVC","BA0005","GLAUBER DE ANDRADE ROCHA","VITÓRIA DA CONQUISTA","BA","14° 54' 28'' S","40° 54' 53'' W","896 m","VFR Diurno/Noturno e IFR Diurno/Noturno"," 15/33","2100 m","45 m","PCN 44/F/B/X/T","Asfalto","-","-","-","-","-","-","-","-","-","-","-","-","-","-","-","PA2019-2438"," "," "," ","PA2019-2438"," "," "," ","AP-1","Classe I","-","4C","NPA","N/A","PA2020-0930","-","PA2020-0930","-","-","-","-","","-"]
["SSVI","SC0011","ÂNGELO PONZONI","VIDEIRA","SC","26° 59' 59'' S","51° 8' 29'' W","840 m","VFR Diurno"," 10/28","1400 m","23 m","PCN 11/F/A/Y/T","Asfalto","-","-","-","-","-","-","-","-","-","-","-","-","-","-","-","PA2018-3718",0,0,0,"PA2018-3718","","","","AP-0","Classe I","4ª","-","-","-","-","-","-","-","Proibição de operações de pouso de aeronaves de asa fixa com motor à reação (turbojato).","PA2020-1413","PA2020-1413","","-"]
["SSVL","PR0007","TELÊMACO BORBA (SBTL*)","TELÊMACO BORBA","PR","24° 18' 59'' S","50° 39' 8'' W","796 m","VFR Diurno"," 02/20","1800 m","30 m","PCN 24/F/B/X/T","Asfalto","-","-","-","-","-","-","-","-","-","-","-","-","-","-","-","PA2019-3818",0,0,0,"PA2019-3818","","","","AP-1","Classe I","4ª","-","-","-","-","-","-","-","-","-","-","","-"]
["SSVN","RS0030","VERANÓPOLIS","VERANÓPOLIS","RS","28° 56' 8'' S","51° 34' 4'' W","676 m","VFR Diurno"," 12/30","1000 m","18 m","3700 kg / 0,5 MPa","Saibro","-","-","-","-","-","-","-","-","-","-","-","-","-","-","-","PA2018-2841",0,0,0,"PA2018-2841","","","","AP-0","Classe I","-","-","-","-","-","-","-","-","-","-","-","","-"]
["SBJE","CE0003","COMANDANTE ARISTON PESSOA","CRUZ","CE","2° 54' 24'' S","40° 21' 29'' W","27 m","VFR Diurno/Noturno e IFR Diurno/Noturno"," 08/26","2200 m","45 m","PCN 62/F/B/W/T","Asfalto","-","-","-","-","-","-","-","-","-","-","-","-","-","-","-","PA2017-3750",0,0,0,"PA2017-3750","","","","AP-1","Classe I","-","4D","NPA","N/A","PA2019-0618","-","PA2019-0618","-","-","-","-","","-"]
["SSWS","RS0025","CAÇAPAVA DO SUL","CAÇAPAVA DO SUL","RS","30° 32' 58'' S","53° 27' 33'' W","400 m","VFR Diurno"," 08/26","1200 m","60 m","PCN 8/F/C/Y/U","Terra"," 17/35","820 m","100 m","PCN 8/F/C/Y/U","Terra","-","-","-","-","-","-","-","-","-","-",0,0,0,0,"","","","","AP-0","Classe I","-","-","-","-","-","-","-","-","Interditado","-","-","","Interdição noticiada por meio do Ofício nº 149/2013/SIA/ANAC"]
["SSXD","RS0026","TOBIAS BACCI","SARANDI","RS","27° 58' 50'' S","52° 51' 52'' W","632 m","VFR Diurno"," 15/33","1050 m","25 m","PCN 8/F/C/Y/U","Terra","-","-","-","-","-","-","-","-","-","-","-","-","-","-","-","PA2020-2413",0,0,0,"PA2020-2413","","","","AP-0","Classe I","-","-","-","-","-","-","-","-","-","-","-","","-"]
["SSXX","SC0017","MUNICIPAL JOÃO WINCKLER","XANXERÊ","SC","26° 52' 32'' S","52° 22' 23'' W","910 m","VFR Diurno/Noturno"," 18/36","1149 m","18 m","PCN 8/F/A/Y/T","Asfalto","-","-","-","-","-","-","-","-","-","-","-","-","-","-","-","PA2016-0694",0,0,0,"PA2016-0694","","","","AP-0","Classe I","-","-","-","-","-","-","-","-","-","-","-","","-"]
["SSZR","RS0027","LUIS ALBERTO LEHR","SANTA ROSA","RS","27° 54' 32'' S","54° 31' 20'' W","309 m","VFR Diurno/Noturno"," 07/25","1200 m","30 m","PCN 8/F/A/Y/T","Asfalto","-","-","-","-","-","-","-","-","-","-","-","-","-","-","-","PA2020-1191",0,0,0,"PA2020-1191","","","","AP-1","Classe I","4ª","-","-","-","-","-","-","-","-","-","-","","-"]
["SBPG","PR0012","COMANDANTE ANTÔNIO AMILTON BERALDO","PONTA GROSSA","PR","25° 11' 4'' S","50° 8' 38'' W","789 m","VFR Diurno/Noturno e IFR Diurno/Noturno"," 08/26","1430 m","30 m","PCN 33/F/C/X/U","Asfalto","-","-","-","-","-","-","-","-","-","-","-","-","-","-","-","PA2018-2953",0,0,0,"PA2018-2953","","","","AP-1","Classe I","4ª","2C","NPA","N/A","PA2018-3154 / PA2020-1932","-","PA2018-3154 / PA2020-1932","-","-","-","-","","-"]
["SWBC","AM0017","BARCELOS","BARCELOS","AM","0° 58' 51'' S","62° 55' 8'' W","34 m","VFR Diurno"," 09/27","1200 m","30 m","PCN 6/F/B/Y/U","Asfalto","-","-","-","-","-","-","-","-","-","-","-","-","-","-","-","PD1982-0039",0,0,0,"PD1982-0039","","","","AP-0","Classe I","-","2C","NINST",7,"-","PA2016-0908","-","PA2016-0908","-","-","-","X","-"]
["SWBE","CE0006","WALFRIDO SAMITO DE ALMEIDA","SÃO BENEDITO","CE","4° 3' 0'' S","40° 53' 0'' W","884 m","VFR Diurno/Noturno"," 10/28","1500 m","30 m","PCN 12/F/B/Y/T","Asfalto","-","-","-","-","-","-","-","-","-","-","-","-","-","-","-","PA2013-2111",0,0,0,"PA2013-2111","","","","AP-1","Classe I","-","-","-","-","-","-","-","-","-","-","-","","-"]
["SWBG","MT0009","ANDRÉ ANTÔNIO MAGGI","PONTES E LACERDA","MT","15° 11' 36'' S","59° 23' 7'' W","247 m","VFR Diurno"," 01/19","1500 m","30 m","PCN 8/F/B/Y/T","Asfalto","-","-","-","-","-","-","-","-","-","-","-","-","-","-","-","PA2020-1194",0,0,0,"PA2020-1194","","","","AP-1","Classe I","-","-","-","-","-","-","-","-","Interditado","PA2020-1053","PA2020-1053","X","-"]
["SWBR","AM0018","BORBA","BORBA","AM","4° 24' 31'' S","59° 35' 52'' W","90 m","VFR Diurno"," 12/30","1200 m","30 m","PCN 8/F/C/Y/U","Asfalto","-","-","-","-","-","-","-","-","-","-","-","-","-","-","-",0,0,0,0,"","","","","AP-0","Classe I","-","-","-","-","-","-","-","-","-","-","-","X","-"]
["SWCA","AM0007","CARAUARI","CARAUARI","AM","4° 52' 17'' S","66° 53' 51'' W","108 m","VFR Diurno"," 04/22","1665 m","18 m","PCN 12/F/C/Y/T","Asfalto","-","-","-","-","-","-","-","-","-","-","-","-","-","-","-","PA2017-3045",0,0,0,"PA2017-3045","","","","AP-1","Classe I","4ª","2C","NINST",7,"-","PA2016-0908","-","PA2016-0908","-","-","-","X","-"]
["SWCB","GO0023","CAMPOS BELOS","CAMPOS BELOS","GO","13° 0' 25'' S","46° 42' 39'' W","690 m","VFR Diurno"," 18/36","1200 m","20 m","2500 kg / 0,5 MPa","Asfalto","-","-","-","-","-","-","-","-","-","-","-","-","-","-","-","PA2020-3558",0,0,0,"PA2020-3558","","","","AP-0","Classe I","-","-","-","-","-","-","-","-","-","-","-","","-"]
["SWCQ","RO0007","COSTA MARQUES","COSTA MARQUES","RO","12° 25' 18'' S","64° 15' 6'' W","169 m","VFR Diurno"," 01/19","1495 m","20 m","PCN 8/F/B/Y/T","Asfalto","-","-","-","-","-","-","-","-","-","-","-","-","-","-","-","PD1985-0317",0,0,0,"PD1985-0317","","","","AP-0","Classe I","-","-","-","-","-","-","-","-","Interditado","PA2020-0909","PA2020-0909","X","-"]
["SWCZ","GO0024","CERES","CERES","GO","15° 20' 41'' S","49° 36' 17'' W","598 m","VFR Diurno"," 15/33","1200 m","23 m","2500 kg / 0,5 MPa","Asfalto","-","-","-","-","-","-","-","-","-","-","-","-","-","-","-","PA2013-2624",0,0,0,"PA2013-2624","","","","AP-0","Classe I","-","-","-","-","-","-","-","-","Interditado","PA2020-0870","PA2020-0870","","-"]
["SWDM","MT0015","DIAMANTINO","DIAMANTINO","MT","14° 22' 37'' S","56° 24' 2'' W","450 m","VFR Diurno"," 15/33","1480 m","18 m","PCN 13/F/C/Y/U","Asfalto","-","-","-","-","-","-","-","-","-","-","-","-","-","-","-","PD1995-0423",0,0,0,"PD1995-0423","","","","AP-0","Classe I","-","-","-","-","-","-","-","-","-","-","-","X","-"]
["SWDN","TO0006","DIANÓPOLIS","DIANÓPOLIS","TO","11° 35' 43'' S","46° 50' 52'' W","730 m","VFR Diurno"," 10/28","1500 m","30 m","PCN 12/F/B/X/T","Asfalto","-","-","-","-","-","-","-","-","-","-","-","-","-","-","-","PA2016-1485",0,0,0,"PA2016-1485","","","","AP-0","Classe I","-","-","-","-","-","-","-","-","Interditado","PA2020-0946","PA2020-0946","X","-"]
["SWEI","AM0009","EIRUNEPÉ","EIRUNEPÉ","AM","6° 38' 15'' S","69° 52' 59'' W","122 m","VFR Diurno"," 16/34","2300 m","45 m","PCN 30/F/C/X/U","Asfalto","-","-","-","-","-","-","-","-","-","-","-","-","-","-","-","PA2019-2711",0,0,0,"PA2019-2711","","","","AP-1","Classe I","-","2C","NINST","N/A","PA2020-1284","-","PA2020-1284","-","-","-","-","X","-"]
["SWEK","MT0024","CANARANA","CANARANA","MT","13° 34' 39'' S","52° 16' 5'' W","398 m","VFR Diurno"," 18/36","685 m","18 m","5700 kg / 0,5 MPa","Terra","-","-","-","-","-","-","-","-","-","-","-","-","-","-","-","PA2020-1083",0,0,0,"PA2020-1083","","","","AP-1","Classe I","-","-","-","-","-","-","-","-","-","-","-","X","-"]
["SWFN","AM0002","FLORES","MANAUS","AM","3° 4' 22'' S","60° 1' 16'' W","62 m","VFR Diurno"," 11/29","830 m","30 m","5700 kg / 0,5 MPa","Asfalto","-","-","-","-","-","-","-","-","-","-","-","-","-","-","-","PA2017-1581",0,0,0,"PA2017-1581","","","","AP-0","Classe I","-","-","-","-","-","-","-","-","-","-","-","X","-"]
["SWFR","GO0014","FORMOSA","FORMOSA","GO","15° 33' 22'' S","47° 20' 43'' W","965 m","VFR Diurno"," 05/23","1400 m","30 m","5700 kg / 0,5 MPa","Asfalto","-","-","-","-","-","-","-","-","-","-","-","-","-","-","-","PA2015-2307",0,0,0,"PA2015-2307","","","","AP-0","Classe I","-","-","-","-","-","-","-","-","-","-","-","","-"]
["SWFX","MT0022","SÃO FÉLIX DO ARAGUAIA","SÃO FÉLIX DO ARAGUAIA","MT","11° 37' 55'' S","50° 41' 18'' W","198 m","VFR Diurno"," 12/30","1100 m","25 m","PCN 10/F/C/Y/U","Terra","-","-","-","-","-","-","-","-","-","-","-","-","-","-","-","PD1997-0887",0,0,0,"PD1997-0887","","","","AP-1","Classe I","-","-","-","-","-","-","-","-","-","-","-","X","-"]
["SWGI","TO0004","GURUPI","GURUPI","TO","11° 44' 22'' S","49° 8' 0'' W","350 m","VFR Diurno/Noturno"," 12/30","1730 m","30 m","PCN 10/F/B/X/T","Asfalto","-","-","-","-","-","-","-","-","-","-","-","-","-","-","-","PA2020-1566",0,0,0,"PA2020-1566","","","","AP-0","Classe I","4ª","-","-","-","-","-","-","-","-","-","-","X","-"]
["SWGN","TO0002","ARAGUAÍNA","ARAGUAÍNA","TO","7° 13' 42'' S","48° 14' 27'' W","235 m","VFR Diurno/Noturno"," 09/27","1804 m","45 m","PCN 44/F/C/X/U","Asfalto","-","-","-","-","-","-","-","-","-","-","-","-","-","-","-","PA2015-2236",0,0,0,"PA2015-2236","","","","AP-1","Classe I","3ª","2C","NINST","N/A","PA2020-3214","-","PA2020-3214","-","-","-","-","X","-"]
["SWHP","MT0006","OLHOS D'ÁGUA","ÁGUA BOA","MT","14° 1' 10'' S","52° 9' 8'' W","459 m","VFR Diurno/Noturno"," 03/21","1627 m","18 m","5700 kg / 0,5 MPa","Asfalto","-","-","-","-","-","-","-","-","-","-","-","-","-","-","-","PA2013-2444",0,0,0,"PA2013-2444","","","","AP-1","Classe I","-","-","-","-","-","-","-","-","-","-","-","X","-"]
["SWHT","AM0019","FRANCISCO CORREA DA CRUZ","HUMAITÁ","AM","7° 32' 1'' S","63° 3' 2'' W","70 m","VFR Diurno"," 14/32","1200 m","45 m","PCN 7/F/B/Y/U","Terra","-","-","-","-","-","-","-","-","-","-","-","-","-","-","-","PD1965-0149",0,0,0,"PD1965-0149","","","","AP-0","Classe I","-","2C","NINST",7,"-","PA2016-0908","-","PA2016-0908","-","-","-","X","-"]
["SWII","AM0013","IPIRANGA","SANTO ANTÔNIO DO IÇÁ","AM","2° 56' 1'' S","69° 41' 41'' W","40 m","VFR Diurno"," 01/19","1500 m","30 m","PCN 13/R/C/W/U","Concreto","-","-","-","-","-","-","-","-","-","-","-","-","-","-","-","PA2011-1806",0,0,0,"PA2011-1806","","","","AP-0","Classe I","-","-","-","-","-","-","-","-","-","-","-","X","-"]
["SWIQ","GO0019","MINAÇU","MINAÇU","GO","13° 33' 2'' S","48° 12' 2'' W","427 m","VFR Diurno/Noturno e IFR Diurno"," 05/23","1275 m","30 m","PCN 7/F/C/Y/U","Asfalto","-","-","-","-","-","-","-","-","-","-","-","-","-","-","-","PD2004-1039","PA2011-2418",0,0,"PD2004-1039","PA2011-2418","","","AP-0","Classe I","-","-","-","-","-","-","-","-","-","-","-","","-"]
["SWJN","MT0007","JUÍNA","JUÍNA","MT","11° 25' 10'' S","58° 42' 36'' W","330 m","VFR Diurno"," 17/35","1600 m","30 m","5600 kg / 0,5 MPa","Asfalto","-","-","-","-","-","-","-","-","-","-","-","-","-","-","-","PA2020-2414",0,0,0,"PA2020-2414","","","","AP-1","Classe I","-","-","-","-","-","-","-","-","-","-","-","X","-"]
["SWJW","GO0008","JATAÍ","JATAÍ","GO","17° 49' 48'' S","51° 46' 31'' W","771 m","VFR Diurno/Noturno"," 13/31","1500 m","23 m","PCN 10/F/B/X/U","Asfalto","-","-","-","-","-","-","-","-","-","-","-","-","-","-","-","PA2020-2415",0,0,0,"PA2020-2415","","","","AP-0","Classe I","-","-","-","-","-","-","-","-","-","-","-","","-"]
["SWKC","MT0017","CÁCERES","CÁCERES","MT","16° 2' 34'' S","57° 37' 47'' W","150 m","VFR Diurno/Noturno"," 18/36","1285 m","17 m","PCN 9/F/C/Y/U","Asfalto","-","-","-","-","-","-","-","-","-","-","-","-","-","-","-","PD1997-0889",0,0,0,"PD1997-0889","","","","AP-0","Classe I","-","-","-","-","-","-","-","-","-","-","-","X","-"]
["SWKO","AM0010","COARI","COARI","AM","4° 8' 2'' S","63° 7' 52'' W","40 m","VFR Diurno"," 10/28","1600 m","36 m","PCN 29/F/C/X/U","Asfalto","-","-","-","-","-","-","-","-","-","-","-","-","-","-","-","PA2016-1115",0,0,0,"PA2016-1115","","","","AP-1","Classe I","4ª","2C","NINST",7,"-","PA2016-0908","-","PA2016-0908","-","-","-","X","-"]
["SWKQ","PI0004","SERRA DA CAPIVARA/SÃO RAIMUNDO NONATO","SÃO RAIMUNDO NONATO","PI","9° 4' 58'' S","42° 38' 40'' W","415 m","VFR Diurno/Noturno"," 16/34","1650 m","45 m","PCN 34/F/B/X/T","Asfalto","-","-","-","-","-","-","-","-","-","-","-","-","-","-","-","PA2015-2098",0,0,0,"PA2015-2098","","","","AP-0","Classe I","4ª","-","-","-","-","-","-","-","-","-","-","","-"]
["SWKT","GO0015","CATALÃO","CATALÃO","GO","18° 13' 1'' S","47° 53' 58'' W","802 m","VFR Diurno/Noturno"," 17/35","1520 m","30 m","5700 kg / 0,5 MPa","Asfalto","-","-","-","-","-","-","-","-","-","-","-","-","-","-","-","PA2020-2421",0,0,0,"PA2020-2421","","","","AP-0","Classe I","-","-","-","-","-","-","-","-","Proibição de operações de pouso de aeronaves de asa fixa com motor à reação (turbojato) e proibição de operações noturnas.","PA2019-3011","PA2019-3011","","-"]
["SWLB","AM0024","LÁBREA","LÁBREA","AM","7° 16' 44'' S","64° 46' 10'' W","58 m","VFR Diurno"," 18/36","1000 m","40 m","PCN 7/F/C/Y/U","Asfalto","-","-","-","-","-","-","-","-","-","-","-","-","-","-","-","PA2020-3249",0,0,0,"PA2020-3249","","","","AP-1","Classe I","-","2C","NINST",7,"-","PA2016-0908","-","PA2016-0908","-","-","-","X","-"]
["SWLC","GO0009","GENERAL LEITE DE CASTRO","RIO VERDE","GO","17° 50' 5'' S","50° 57' 22'' W","751 m","VFR Diurno/Noturno"," 03/21","1500 m","30 m","PCN 19/F/C/Y/U","Asfalto","-","-","-","-","-","-","-","-","-","-","-","-","-","-","-","PA2015-1270",0,0,0,"PA2015-1270","","","","AP-1","Classe I","-","2C","NINST","N/A","PA2020-0326","-","PA2020-0326","-","-","-","-","","-"]
["SWME","GO0033","MINEIROS","MINEIROS","GO","17° 33' 7'' S","52° 33' 22'' W","825 m","VFR Diurno"," 18/36","1000 m","18 m","PCN 8/F/C/Y/U","Asfalto","-","-","-","-","-","-","-","-","-","-","-","-","-","-","-",0,0,0,0,"","","","","AP-0","Classe I","-","-","-","-","-","-","-","-","-","-","-","","-"]
["SWMW","AM0020","MAUÉS","MAUÉS","AM","3° 21' 25'' S","57° 42' 44'' W","21 m","VFR Diurno"," 01/19","1200 m","30 m","PCN 8/F/C/Y/U","Asfalto","-","-","-","-","-","-","-","-","-","-","-","-","-","-","-","PA2011-1705",0,0,0,"PA2011-1705","","","","AP-1","Classe I","-","-","-","-","-","-","-","-","-","-","-","X","-"]
["SWNH","GO0017","ARUANÃ","ARUANÃ","GO","14° 55' 59'' S","51° 2' 54'' W","250 m","VFR Diurno"," 06/24","1300 m","23 m","5700 kg / 0,5 MPa","Asfalto","-","-","-","-","-","-","-","-","-","-","-","-","-","-","-","PA2020-1082",0,0,0,"PA2020-1082","","","","AP-0","Classe I","-","-","-","-","-","-","-","-","-","-","-","","-"]
["SWNK","AM0011","NOVO CAMPO","BOCA DO ACRE","AM","8° 50' 1'' S","67° 18' 44'' W","120 m","VFR Diurno"," 18/36","1600 m","33 m","PCN 19/F/C/Y/U","Asfalto","-","-","-","-","-","-","-","-","-","-","-","-","-","-","-","PD1996-0085",0,0,0,"PD1996-0085","","","","AP-0","Classe I","-","-","-","-","-","-","-","-","-","-","-","X","-"]
["SWNQ","GO0016","NIQUELÂNDIA","NIQUELÂNDIA","GO","14° 26' 11'' S","48° 29' 31'' W","840 m","VFR Diurno"," 02/20","1400 m","50 m","PCN 8/F/B/X/U","Terra","-","-","-","-","-","-","-","-","-","-","-","-","-","-","-","PD2001-0908",0,0,0,"PD2001-0908","","","","AP-0","Classe I","-","-","-","-","-","-","-","-","-","-","-","","-"]
["SWNR","MT0019","NORTELÂNDIA","NORTELÂNDIA","MT","14° 29' 1'' S","56° 46' 2'' W","445 m","VFR Diurno"," 15/33","1200 m","20 m","PCN 8/F/C/Y/U","Terra","-","-","-","-","-","-","-","-","-","-","-","-","-","-","-",0,0,0,0,"","","","","AP-0","Classe I","-","-","-","-","-","-","-","-","-","-","-","X","-"]
["SWNS","GO0004","ANÁPOLIS","ANÁPOLIS","GO","16° 21' 45'' S","48° 55' 41'' W","1112 m","VFR Diurno/Noturno"," 07/25","1218 m","45 m","PCN 30/F/C/X/U","Asfalto","-","-","-","-","-","-","-","-","-","-","-","-","-","-","-","PA2020-1010",0,0,0,"PA2020-1010","","","","AP-0","Classe I","-","-","-","-","-","-","-","-","-","-","-","","-"]
["SBNV","GO0002","AERÓDROMO NACIONAL DE AVIAÇÃO","GOIÂNIA","GO","16° 37' 32'' S","49° 20' 58'' W","831 m","VFR Diurno"," 14/32","1100 m","20 m","5700 kg / 0,5 MPa","Asfalto","-","-","-","-","-","-","-","-","-","-","-","-","-","-","-","PA2019-0537",0,0,0,"PA2019-0537","","","","AP-0","Classe I","-","-","-","-","-","-","-","-","Proibição de operações na pista de pouso e decolagem do aeródromo concomitantes à execução de obras e serviços de manutenção dentro da faixa de pista da pista de pouso e decolagem.","PA2019-3988","PA2019-3988","","-"]
["SWOB","AM0014","FONTE BOA","FONTE BOA","AM","2° 32' 1'' S","66° 4' 2'' W","63 m","VFR Diurno"," 18/36","1270 m","27 m","PCN 6/F/C/Y/U","Asfalto","-","-","-","-","-","-","-","-","-","-","-","-","-","-","-",0,0,0,0,"","","","","AP-0","Classe I","-","2C","NINST",7,"-","PA2016-0908","-","PA2016-0908","Interditado","PA2019-2316","PA2019-2316","X","-"]
["SWPG","MT0010","PORTO DOS GAÚCHOS","PORTO DOS GAÚCHOS","MT","11° 31' 1'' S","57° 20' 2'' W","400 m","VFR Diurno"," 01/19","1500 m","60 m","PCN 13/F/C/Y/U","Terra","-","-","-","-","-","-","-","-","-","-","-","-","-","-","-",0,0,0,0,"","","","","AP-0","Classe I","-","-","-","-","-","-","-","-","Interditado","PA2019-2874","PA2019-2874","X","-"]
["SWPI","AM0006","PARINTINS","PARINTINS","AM","2° 40' 10'' S","56° 46' 16'' W","26 m","VFR Diurno/Noturno"," 06/24","1800 m","30 m","PCN 33/F/B/X/T","Asfalto","-","-","-","-","-","-","-","-","-","-","-","-","-","-","-","PA2015-2014",0,0,0,"PA2015-2014","","","","AP-1","Classe I","3ª","3C","NINST",80,"-","PA2016-0908","-","PA2016-0908","-","-","-","X","-"]
["SWPK","MT0021","POCONÉ","POCONÉ","MT","16° 16' 18'' S","56° 39' 4'' W","187 m","VFR Diurno"," 01/19","1150 m","23 m","5700 kg / 0,5 MPa","Cascalho","-","-","-","-","-","-","-","-","-","-","-","-","-","-","-","PA2016-2706",0,0,0,"PA2016-2706","","","","AP-0","Classe I","-","-","-","-","-","-","-","-","-","-","-","X","-"]
["SWPL","MT0027","POSTO LEONARDO VILAS BOAS","GAÚCHA DO NORTE","MT","12° 11' 54'' S","53° 22' 54'' W","330 m","VFR Diurno"," 07/25","1000 m","20 m","PCN 8/F/C/Y/U","Grama","-","-","-","-","-","-","-","-","-","-","-","-","-","-","-","PD1974-0301",0,0,0,"PD1974-0301","","","","AP-0","Classe I","-","-","-","-","-","-","-","-","Interditado","PA2020-0780","PA2020-0780","X","-"]
["SWPM","RO0009","PIMENTA BUENO","PIMENTA BUENO","RO","11° 38' 30'' S","61° 10' 52'' W","208 m","VFR Diurno/Noturno"," 04/22","1300 m","20 m","PCN 12/F/C/Y/U","Asfalto","-","-","-","-","-","-","-","-","-","-","-","-","-","-","-","PA2014-2262",0,0,0,"PA2014-2262","","","","AP-0","Classe I","-","-","-","-","-","-","-","-","-","-","-","X","-"]
["SWPR","GO0029","PIRES DO RIO","PIRES DO RIO","GO","17° 19' 9'' S","48° 20' 5'' W","781 m","VFR Diurno"," 10/28","1080 m","18 m","PCN 8/F/C/Y/U","Asfalto","-","-","-","-","-","-","-","-","-","-","-","-","-","-","-","PA2014-2214",0,0,0,"PA2014-2214","","","","AP-0","Classe I","-","-","-","-","-","-","-","-","-","-","-","","-"]
["SWPY","MT0023","PRIMAVERA DO LESTE","PRIMAVERA DO LESTE","MT","15° 33' 56'' S","54° 20' 16'' W","655 m","VFR Diurno"," 01/19","1100 m","23 m","5000 kg / 0,5 MPa","Terra","-","-","-","-","-","-","-","-","-","-","-","-","-","-","-","PD1993-0545",0,0,0,"PD1993-0545","","","","AP-1","Classe I","-","-","-","-","-","-","-","-","-","-","-","X","-"]
["SWPZ","GO0010","OURIÇANGA DE ABREU","POSSE","GO","14° 7' 5'' S","46° 20' 43'' W","841 m","VFR Diurno/Noturno"," 10/28","1500 m","25 m","PCN 18/F/B/Y/T","Asfalto","-","-","-","-","-","-","-","-","-","-","-","-","-","-","-","PA2020-1994",0,0,0,"PA2020-1994","","","","AP-0","Classe I","-","-","-","-","-","-","-","-","-","-","-","","-"]
["SWRO","RO0002","AEROCLUBE DE RONDÔNIA","PORTO VELHO","RO","8° 47' 37'' S","63° 51' 29'' W","113 m","VFR Diurno"," 01/19","1300 m","30 m","PCN 8/F/C/Y/U","Terra","-","-","-","-","-","-","-","-","-","-","-","-","-","-","-","PD1979-0090","PA2013-0425","PA2013-1245","PA2019-1473",{"$f":"IF(AD517<>0,HYPERLINK(\"http://pergamum.anac.gov.br/arquivos/\" & AD517 & \".pdf\",AD517),\"\")","v":"PD1979-0090"},"PA2013-0425","PA2013-1245","PA2019-1473","AP-0","Classe I","-","-","-","-","-","-",{"$f":"IF(AR517<>0,HYPERLINK(\"http://pergamum.anac.gov.br/arquivos/\" & AR517 & \".pdf\",AR517),\"\")","v":"-"},"-","-","-",{"$f":"IF(AW517<>0,HYPERLINK(\"http://pergamum.anac.gov.br/arquivos/\" & AW517 & \".pdf\",AW517),\"\")","v":"-"},"X","Suspensos os efeitos da Portaria 425/SIA, de 18/02/2013, pela decisão liminar deferida pelo juízo da 1ª Vara Federal da Subseção Judiciária de Rondônia, nos autos do Processo judicial n.º 3861-91.2013.4.01.4100, ajuizada por Aeroclube de Rondônia."]
["SBSI","MT0002","PRESIDENTE JOÃO BATISTA FIGUEIREDO","SINOP","MT","11° 53' 6'' S","55° 35' 10'' W","374 m","VFR Diurno/Noturno"," 03/21","1630 m","30 m","PCN 36/F/A/X/T","Asfalto","-","-","-","-","-","-","-","-","-","-","-","-","-","-","-","PA2018-2965",0,0,0,"PA2018-2965","","","","AP-1","Classe I","3ª","4C","NINST",52,"-","PA2016-0908 / PA2018-0389 / PA2018-0390","-","PA2016-0908 / PA2018-0389 / PA2018-0390","-","-","-","X","-"]
["SWTO","TO0008","PARAÍSO DO TOCANTINS","PARAÍSO DO TOCANTINS","TO","10° 10' 26'' S","48° 55' 58'' W","353 m","VFR Diurno"," 10/28","1200 m","30 m","PCN 20/F/C/X/U","Asfalto","-","-","-","-","-","-","-","-","-","-","-","-","-","-","-","PA2020-1298",0,0,0,"PA2020-1298","","","","AP-0","Classe I","-","-","-","-","-","-","-","-","-","-","-","X","-"]
["SWTP","AM0022","SANTA ISABEL DO RIO NEGRO","SANTA ISABEL DO RIO NEGRO","AM","0° 25' 1'' S","65° 2' 2'' W","68 m","VFR Diurno"," 09/27","1200 m","30 m","PCN 8/F/C/Y/U","Asfalto","-","-","-","-","-","-","-","-","-","-","-","-","-","-","-","PA2011-1908",0,0,0,"PA2011-1908","","","","AP-0","Classe I","-","2C","NINST",7,"-","PA2016-0908","-","PA2016-0908","-","-","-","X","-"]
["SWTS","MT0012","TANGARÁ DA SERRA","TANGARÁ DA SERRA","MT","14° 39' 43'' S","57° 26' 38'' W","449 m","VFR Diurno"," 18/36","1500 m","30 m","PCN 12/F/B/X/T","Asfalto","-","-","-","-","-","-","-","-","-","-","-","-","-","-","-","PA2018-2573",0,0,0,"PA2018-2573","","","","AP-1","Classe I","-","-","-","-","-","-","-","-","-","-","-","X","-"]
["SWTY","TO0009","TAGUATINGA","TAGUATINGA","TO","12° 26' 2'' S","46° 24' 2'' W","597 m","VFR Diurno"," 05/23","1200 m","40 m","PCN 8/F/C/Y/U","Terra","-","-","-","-","-","-","-","-","-","-","-","-","-","-","-","PD1952-0089",0,0,0,"PD1952-0089","","","","AP-0","Classe I","-","-","-","-","-","-","-","-","-","-","-","X","-"]
["SWUA","GO0011","SÃO MIGUEL DO ARAGUAIA","SÃO MIGUEL DO ARAGUAIA","GO","13° 20' 2'' S","50° 12' 21'' W","384 m","VFR Diurno"," 08/26","1500 m","30 m","5700 kg / 0,5 MPa","Asfalto","-","-","-","-","-","-","-","-","-","-","-","-","-","-","-","PA2020-1283",0,0,0,"PA2020-1283","","","","AP-0","Classe I","-","-","-","-","-","-","-","-","-","-","-","","-"]
["SWUD","MG0069","DEPUTADO OSWALDO TOLENTINO","CLÁUDIO","MG","20° 26' 45'' S","44° 48' 47'' W","820 m","VFR Diurno"," 12/30","1000 m","30 m","PCN 15/F/B/Y/T","Asfalto","-","-","-","-","-","-","-","-","-","-","-","-","-","-","-","PA2020-1389",0,0,0,"PA2020-1389","","","","AP-0","Classe I","-","-","-","-","-","-","-","-","-","-","-","","-"]
["SWUZ","GO0025","BRIGADEIRO ARARIPE MACEDO","LUZIÂNIA","GO","16° 15' 42'' S","47° 58' 7'' W","996 m","VFR Diurno"," 11/29","1200 m","20 m","PCN 8/F/C/Y/U","Asfalto","-","-","-","-","-","-","-","-","-","-","-","-","-","-","-","PA2018-0339",0,0,0,"PA2018-0339","","","","AP-0","Classe I","4ª","-","-","-","-","-","-","-","-","-","-","","-"]
["SWVC","MT0016","VILA RICA","VILA RICA","MT","9° 58' 52'' S","51° 8' 26'' W","254 m","VFR Diurno"," 07/25","1350 m","30 m","4000 kg / 0,5 MPa","Terra","-","-","-","-","-","-","-","-","-","-","-","-","-","-","-","PA2020-1286",0,0,0,"PA2020-1286","","","","AP-0","Classe I","-","-","-","-","-","-","-","-","-","-","-","X","-"]
["SWWA","GO0012","PORANGATU","PORANGATU","GO","13° 24' 16'' S","49° 9' 26'' W","366 m","VFR Diurno/Noturno"," 14/32","1500 m","23 m","5700 kg / 0,5 MPa","Asfalto","-","-","-","-","-","-","-","-","-","-","-","-","-","-","-","PA2020-1293",0,0,0,"PA2020-1293","","","","AP-0","Classe I","-","-","-","-","-","-","-","-","-","-","-","","-"]
["SWWU","GO0013","URUAÇU","URUAÇU","GO","14° 32' 41'' S","49° 5' 28'' W","520 m","VFR Diurno"," 18/36","1440 m","30 m","5700 kg / 0,5 MPa","Asfalto","-","-","-","-","-","-","-","-","-","-","-","-","-","-","-","PA2020-1295",0,0,0,"PA2020-1295","","","","AP-0","Classe I","-","-","-","-","-","-","-","-","-","-","-","","-"]
["SWXM","MT0014","REGIONAL ORLANDO VILLAS BOAS","MATUPÁ","MT","10° 10' 13'' S","54° 57' 10'' W","283 m","VFR Diurno"," 02/20","1482 m","18 m","5700 kg / 0,5 MPa","Cascalho","-","-","-","-","-","-","-","-","-","-","-","-","-","-","-","PA2009-0107",0,0,0,"PA2009-0107","","","","AP-0","Classe I","-","-","-","-","-","-","-","-","-","-","-","X","-"]
["SWXQ","SP0015","LINS","LINS","SP","21° 39' 46'' S","49° 43' 52'' W","480 m","VFR Diurno/Noturno"," 14/32","1700 m","35 m","PCN 30/F/B/X/T","Asfalto","-","-","-","-","-","-","-","-","-","-","-","-","-","-","-","PA2014-2413",0,0,0,"PA2014-2413","","","","AP-0","Classe I","4ª","-","-","-","-","-","-","-","-","-","-","","-"]
["SWXV","MT0013","XAVANTINA","NOVA XAVANTINA","MT","14° 41' 27'' S","52° 20' 57'' W","316 m","VFR Diurno"," 03/21","1490 m","45 m","PCN 10/F/C/Y/U","Terra","-","-","-","-","-","-","-","-","-","-","-","-","-","-","-","PD1974-0245","PD1992-0119",0,0,"PD1974-0245","PD1992-0119","","","AP-0","Classe I","-","-","-","-","-","-","-","-","Interditado","PA2020-0264","PA2020-0264","X","-"]
["SWYN","AM0023","APUÍ","APUÍ","AM","7° 10' 20'' S","59° 50' 20'' W","60 m","VFR Diurno"," 08/26","1200 m","23 m","PCN 12/F/B/Y/U","Asfalto","-","-","-","-","-","-","-","-","-","-","-","-","-","-","-","PA2020-1745",0,0,0,"PA2020-1745","","","","AP-1","Classe I","-","-","-","-","-","-","-","-","Proibição de operações de pouso de aeronaves de asa fixa com motor à reação (turbojato).","PA2020-3010","PA2020-3010","X","-"]
["SBJH","SP1176","SÃO PAULO CATARINA AEROPORTO EXECUTIVO","SÃO ROQUE","SP","23° 25' 37'' S","47° 9' 57'' W","777 m","VFR Diurno/Noturno e IFR Diurno/Noturno"," 12/30","2470 m","33 m","PCN 30/F/B/X/T","Asfalto","-","-","-","-","-","-","-","-","-","-","-","-","-","-","-","PA2019-3689",0,0,0,"PA2019-3689","","","","AP-0","Classe I","-","-","NPA","-","-","-","-","-","-","-","-","","-"]
["SJXI","MG0311","SANTA RITA DO SAPUCAÍ","SANTA RITA DO SAPUCAÍ","MG","22° 16' 22'' S","45° 38' 24'' W","882 m","VFR Diurno"," 16/34","1000 m","30 m","5700 kg / 0,5 MPa","Terra","-","-","-","-","-","-","-","-","-","-","-","-","-","-","-","PA2019-3886",0,0,0,"PA2019-3886","","","","AP-0","Classe I","-","-","-","-","-","-","-","-","-","-","-","","-"]
["SNCP","SC0181","REGIONAL DO PLANALTO SERRANO","CORREIA PINTO","SC","27° 38' 3'' S","50° 21' 30'' W","880 m","VFR Diurno e IFR Diurno/Noturno"," 09/27","1802 m","30 m","PCN 57/F/B/X/T","Asfalto","-","-","-","-","-","-","-","-","-","-","-","-","-","-","-","PA2020-0315",0,0,0,"PA2020-0315","","","","AP-0","Classe I","-","-","-","-","-","-","-","-","-","-","-","","-"]